atlas-dev mailing list archives

Site index · List index
Message view « Date » · « Thread »
Top « Date » · « Thread »
From Apache Jenkins Server <jenk...@builds.apache.org>
Subject Build failed in Jenkins: Atlas-master-IntegrationTests #39
Date Sat, 26 Aug 2017 06:41:25 GMT
See <https://builds.apache.org/job/Atlas-master-IntegrationTests/39/display/redirect>

------------------------------------------
[...truncated 33.08 MB...]
  HiveHookIT.testAlterTableRenameAliasRegistered:863->HiveITBase.assertTableIsRegistered:146->HiveITBase.assertTableIsRegistered:152->HiveITBase.assertEntityIsRegistered:158->HiveITBase.waitFor:202
Assertions failed. Failing after waiting for timeout 1000 msecs
  HiveHookIT.testAlterTableSerde:1403->runSerdePropsQuery:1550->verifyTableSdProperties:1663->assertTableIsRegistered:1802->HiveITBase.assertTableIsRegistered:152->HiveITBase.assertEntityIsRegistered:158->HiveITBase.waitFor:202
Assertions failed. Failing after waiting for timeout 1000 msecs
  HiveHookIT.testAlterTableWithoutHookConf:1243->HiveITBase.assertTableIsRegistered:146->HiveITBase.assertTableIsRegistered:152->HiveITBase.assertEntityIsRegistered:158->HiveITBase.waitFor:202
Assertions failed. Failing after waiting for timeout 1000 msecs
  HiveHookIT.testAlterViewAsSelect:380->HiveITBase.assertTableIsRegistered:146->HiveITBase.assertTableIsRegistered:152->HiveITBase.assertEntityIsRegistered:158->HiveITBase.waitFor:202
Assertions failed. Failing after waiting for timeout 1000 msecs
  HiveHookIT.testAlterViewProperties:1637->testAlterProperties:1610->verifyEntityProperties:1644->assertTableIsRegistered:1802->HiveITBase.assertTableIsRegistered:152->HiveITBase.assertEntityIsRegistered:158->HiveITBase.waitFor:202
Assertions failed. Failing after waiting for timeout 1000 msecs
  HiveHookIT.testAlterViewRename:1279->HiveITBase.assertTableIsRegistered:146->HiveITBase.assertTableIsRegistered:152->HiveITBase.assertEntityIsRegistered:158->HiveITBase.waitFor:202
Assertions failed. Failing after waiting for timeout 1000 msecs
  HiveHookIT.testCTAS:309->assertProcessIsRegistered:1710->HiveITBase.assertEntityIsRegistered:158->HiveITBase.waitFor:202
Assertions failed. Failing after waiting for timeout 1000 msecs
  HiveHookIT.testCreateDatabase:77->HiveITBase.assertDatabaseIsRegistered:237->HiveITBase.assertDatabaseIsRegistered:243->HiveITBase.assertEntityIsRegistered:158->HiveITBase.waitFor:202
Assertions failed. Failing after waiting for timeout 1000 msecs
  HiveHookIT.testCreateTable:142->HiveITBase.assertTableIsRegistered:146->HiveITBase.assertTableIsRegistered:152->HiveITBase.assertEntityIsRegistered:158->HiveITBase.waitFor:202
Assertions failed. Failing after waiting for timeout 1000 msecs
  HiveHookIT.testCreateView:368->assertProcessIsRegistered:1710->HiveITBase.assertEntityIsRegistered:158->HiveITBase.waitFor:202
Assertions failed. Failing after waiting for timeout 1000 msecs
  HiveHookIT.testDropAndRecreateCTASOutput:338->HiveITBase.assertTableIsRegistered:146->HiveITBase.assertTableIsRegistered:152->HiveITBase.assertEntityIsRegistered:158->HiveITBase.waitFor:202
Assertions failed. Failing after waiting for timeout 1000 msecs
  HiveHookIT.testDropTable:1416->HiveITBase.assertTableIsRegistered:146->HiveITBase.assertTableIsRegistered:152->HiveITBase.assertEntityIsRegistered:158->HiveITBase.waitFor:202
Assertions failed. Failing after waiting for timeout 1000 msecs
  HiveHookIT.testDropView:1526->HiveITBase.assertTableIsRegistered:146->HiveITBase.assertTableIsRegistered:152->HiveITBase.assertEntityIsRegistered:158->HiveITBase.waitFor:202
Assertions failed. Failing after waiting for timeout 1000 msecs
  HiveHookIT.testEmptyStringAsValue:328->HiveITBase.assertTableIsRegistered:146->HiveITBase.assertTableIsRegistered:152->HiveITBase.assertEntityIsRegistered:158->HiveITBase.waitFor:202
Assertions failed. Failing after waiting for timeout 1000 msecs
  HiveHookIT.testExportImportPartitionedTable:780->HiveITBase.assertTableIsRegistered:146->HiveITBase.assertTableIsRegistered:152->HiveITBase.assertEntityIsRegistered:158->HiveITBase.waitFor:202
Assertions failed. Failing after waiting for timeout 1000 msecs
  HiveHookIT.testExportImportUnPartitionedTable:736->HiveITBase.assertTableIsRegistered:146->HiveITBase.assertTableIsRegistered:152->HiveITBase.assertEntityIsRegistered:158->HiveITBase.waitFor:202
Assertions failed. Failing after waiting for timeout 1000 msecs
  HiveHookIT.testInsertIntoDFSDirPartitioned:638->validateProcess:487->assertProcessIsRegistered:1735->HiveITBase.assertEntityIsRegistered:158->HiveITBase.waitFor:202
Assertions failed. Failing after waiting for timeout 1000 msecs
  HiveHookIT.testInsertIntoLocalDir:571->validateProcess:507->validateProcess:487->assertProcessIsRegistered:1735->HiveITBase.assertEntityIsRegistered:158->HiveITBase.waitFor:202
Assertions failed. Failing after waiting for timeout 1000 msecs
  HiveHookIT.testInsertIntoPartition:717->validateProcess:487->assertProcessIsRegistered:1735->HiveITBase.assertEntityIsRegistered:158->HiveITBase.waitFor:202
Assertions failed. Failing after waiting for timeout 1000 msecs
  HiveHookIT.testInsertIntoTable:515->HiveITBase.assertTableIsRegistered:146->HiveITBase.assertTableIsRegistered:152->HiveITBase.assertEntityIsRegistered:158->HiveITBase.waitFor:202
Assertions failed. Failing after waiting for timeout 1000 msecs
  HiveHookIT.testLineage:1831->HiveITBase.assertTableIsRegistered:146->HiveITBase.assertTableIsRegistered:152->HiveITBase.assertEntityIsRegistered:158->HiveITBase.waitFor:202
Assertions failed. Failing after waiting for timeout 1000 msecs
  HiveHookIT.testLoadDFSPathPartitioned:448->HiveITBase.assertTableIsRegistered:146->HiveITBase.assertTableIsRegistered:152->HiveITBase.assertEntityIsRegistered:158->HiveITBase.waitFor:202
Assertions failed. Failing after waiting for timeout 1000 msecs
  HiveHookIT.testLoadLocalPath:428->HiveITBase.runCommand:105->HiveITBase.runCommandWithDelay:113->HiveITBase.runCommandWithDelay:120
expected:<0> but was:<40000>
  HiveHookIT.testLoadLocalPathIntoPartition:439->HiveITBase.runCommand:105->HiveITBase.runCommandWithDelay:113->HiveITBase.runCommandWithDelay:120
expected:<0> but was:<40000>
  HiveHookIT.testTraitsPreservedOnColumnRename:1255->assertColumnIsRegistered:278->assertColumnIsRegistered:283->HiveITBase.assertEntityIsRegistered:158->HiveITBase.waitFor:202
Assertions failed. Failing after waiting for timeout 1000 msecs
  HiveHookIT.testTruncateTable:1197->HiveITBase.assertTableIsRegistered:146->HiveITBase.assertTableIsRegistered:152->HiveITBase.assertEntityIsRegistered:158->HiveITBase.waitFor:202
Assertions failed. Failing after waiting for timeout 1000 msecs
  HiveHookIT.testUpdateProcess:590->validateProcess:507->validateProcess:487->assertProcessIsRegistered:1735->HiveITBase.assertEntityIsRegistered:158->HiveITBase.waitFor:202
Assertions failed. Failing after waiting for timeout 1000 msecs

Tests run: 45, Failures: 39, Errors: 0, Skipped: 0

[INFO] 
[INFO] --- jetty-maven-plugin:9.2.12.v20150709:stop (stop-jetty) @ hive-bridge ---
[INFO] Waiting 10 seconds for jetty to stop
[INFO] Stopped ServerConnector@4fa1feb1{HTTP/1.1}{0.0.0.0:31000}
2017-08-26 06:35:39,638 DEBUG - [NotificationHookConsumer thread-0:] ~ Sent message for topic
- ATLAS_ENTITIES, partition - 0, offset - 1116 (KafkaNotification:228)
2017-08-26 06:35:39,639 DEBUG - [NotificationHookConsumer thread-0:] ~ Retrieving entities
with guids=[6e1a1742-4727-49b1-a530-835974a01d14] (GraphBackedMetadataRepository:179)
2017-08-26 06:35:39,639 DEBUG - [NotificationHookConsumer thread-0:] ~ Executing: OrCondition
[andExprs=AndExpr [predicates=[InPredicate [propertyName=__guid, values=[6e1a1742-4727-49b1-a530-835974a01d14]]]]]
(TitanGraphQuery:130)
2017-08-26 06:35:39,643 DEBUG - [NotificationHookConsumer thread-0:] ~ Found a vertex vertex[id=2560256
type=hive_db guid=6e1a1742-4727-49b1-a530-835974a01d14] with __guid =  6e1a1742-4727-49b1-a530-835974a01d14
(GraphHelper:642)
2017-08-26 06:35:39,643 DEBUG - [NotificationHookConsumer thread-0:] ~ Mapping graph root
vertex Titan0Vertex [id=2560256] to typed instance for guid 6e1a1742-4727-49b1-a530-835974a01d14
(GraphToTypedInstanceMapper:82)
2017-08-26 06:35:39,644 DEBUG - [NotificationHookConsumer thread-0:] ~ Reading property __typeName
from vertex[id=2560256 type=hive_db guid=6e1a1742-4727-49b1-a530-835974a01d14] (GraphHelper:495)
2017-08-26 06:35:39,646 DEBUG - [NotificationHookConsumer thread-0:] ~ Found createdBy : jenkins
modifiedBy : jenkins createdTime: Sat Aug 26 06:30:41 UTC 2017 modifedTime: Sat Aug 26 06:35:36
UTC 2017 (GraphToTypedInstanceMapper:95)
2017-08-26 06:35:39,647 DEBUG - [NotificationHookConsumer thread-0:] ~ Reading property __version
from vertex[id=2560256 type=hive_db guid=6e1a1742-4727-49b1-a530-835974a01d14] (GraphHelper:506)
2017-08-26 06:35:39,648 DEBUG - [NotificationHookConsumer thread-0:] ~ Created id (type: hive_db,
id: 6e1a1742-4727-49b1-a530-835974a01d14) for instance type hive_db (GraphToTypedInstanceMapper:102)
2017-08-26 06:35:39,649 DEBUG - [NotificationHookConsumer thread-0:] ~ Mapping vertex Titan0Vertex
[id=2560256] to instance hive_db for fields (GraphToTypedInstanceMapper:131)
2017-08-26 06:35:39,649 DEBUG - [NotificationHookConsumer thread-0:] ~ Mapping attributeInfo
clusterName (GraphToTypedInstanceMapper:144)
2017-08-26 06:35:39,650 DEBUG - [NotificationHookConsumer thread-0:] ~ Adding primitive {name=clusterName,
dataType={name=string, description=null}, multiplicity={lower=1, upper=1, isUnique=false},
isComposite=false, isUnique=false, isIndexable=true, reverseAttributeName=null} from vertex
Titan0Vertex [id=2560256] (GraphToTypedInstanceMapper:387)
2017-08-26 06:35:39,651 DEBUG - [NotificationHookConsumer thread-0:] ~ Reading property hive_db.clusterName
from vertex[id=2560256 type=hive_db guid=6e1a1742-4727-49b1-a530-835974a01d14] (GraphHelper:495)
2017-08-26 06:35:39,653 DEBUG - [NotificationHookConsumer thread-0:] ~ Reading property hive_db.clusterName
from vertex[id=2560256 type=hive_db guid=6e1a1742-4727-49b1-a530-835974a01d14] (GraphHelper:495)
2017-08-26 06:35:39,654 DEBUG - [NotificationHookConsumer thread-0:] ~ Mapping attributeInfo
location (GraphToTypedInstanceMapper:144)
2017-08-26 06:35:39,654 DEBUG - [NotificationHookConsumer thread-0:] ~ Adding primitive {name=location,
dataType={name=string, description=null}, multiplicity={lower=0, upper=1, isUnique=false},
isComposite=false, isUnique=false, isIndexable=false, reverseAttributeName=null} from vertex
Titan0Vertex [id=2560256] (GraphToTypedInstanceMapper:387)
2017-08-26 06:35:39,655 DEBUG - [NotificationHookConsumer thread-0:] ~ Reading property hive_db.location
from vertex[id=2560256 type=hive_db guid=6e1a1742-4727-49b1-a530-835974a01d14] (GraphHelper:495)
2017-08-26 06:35:39,657 DEBUG - [NotificationHookConsumer thread-0:] ~ Reading property hive_db.location
from vertex[id=2560256 type=hive_db guid=6e1a1742-4727-49b1-a530-835974a01d14] (GraphHelper:495)
2017-08-26 06:35:39,657 DEBUG - [NotificationHookConsumer thread-0:] ~ Mapping attributeInfo
parameters (GraphToTypedInstanceMapper:144)
2017-08-26 06:35:39,658 DEBUG - [NotificationHookConsumer thread-0:] ~ mapping vertex Titan0Vertex
[id=2560256] to array parameters (GraphToTypedInstanceMapper:301)
2017-08-26 06:35:39,658 DEBUG - [NotificationHookConsumer thread-0:] ~ Mapping attributeInfo
ownerType (GraphToTypedInstanceMapper:144)
2017-08-26 06:35:39,659 DEBUG - [NotificationHookConsumer thread-0:] ~ Reading property hive_db.ownerType
from vertex[id=2560256 type=hive_db guid=6e1a1742-4727-49b1-a530-835974a01d14] (GraphHelper:506)
2017-08-26 06:35:39,660 DEBUG - [NotificationHookConsumer thread-0:] ~ Mapping attributeInfo
qualifiedName (GraphToTypedInstanceMapper:144)
2017-08-26 06:35:39,660 DEBUG - [NotificationHookConsumer thread-0:] ~ Adding primitive {name=qualifiedName,
dataType={name=string, description=null}, multiplicity={lower=1, upper=1, isUnique=false},
isComposite=false, isUnique=true, isIndexable=true, reverseAttributeName=null} from vertex
Titan0Vertex [id=2560256] (GraphToTypedInstanceMapper:387)
2017-08-26 06:35:39,661 DEBUG - [NotificationHookConsumer thread-0:] ~ Reading property Referenceable.qualifiedName
from vertex[id=2560256 type=hive_db guid=6e1a1742-4727-49b1-a530-835974a01d14] (GraphHelper:495)
2017-08-26 06:35:39,663 DEBUG - [NotificationHookConsumer thread-0:] ~ Reading property Referenceable.qualifiedName
from vertex[id=2560256 type=hive_db guid=6e1a1742-4727-49b1-a530-835974a01d14] (GraphHelper:495)
2017-08-26 06:35:39,664 DEBUG - [NotificationHookConsumer thread-0:] ~ Mapping attributeInfo
name (GraphToTypedInstanceMapper:144)
2017-08-26 06:35:39,664 DEBUG - [NotificationHookConsumer thread-0:] ~ Adding primitive {name=name,
dataType={name=string, description=null}, multiplicity={lower=1, upper=1, isUnique=false},
isComposite=false, isUnique=false, isIndexable=true, reverseAttributeName=null} from vertex
Titan0Vertex [id=2560256] (GraphToTypedInstanceMapper:387)
2017-08-26 06:35:39,665 DEBUG - [NotificationHookConsumer thread-0:] ~ Reading property Asset.name
from vertex[id=2560256 type=hive_db guid=6e1a1742-4727-49b1-a530-835974a01d14] (GraphHelper:495)
2017-08-26 06:35:39,667 DEBUG - [NotificationHookConsumer thread-0:] ~ Reading property Asset.name
from vertex[id=2560256 type=hive_db guid=6e1a1742-4727-49b1-a530-835974a01d14] (GraphHelper:495)
2017-08-26 06:35:39,668 DEBUG - [NotificationHookConsumer thread-0:] ~ Mapping attributeInfo
description (GraphToTypedInstanceMapper:144)
2017-08-26 06:35:39,668 DEBUG - [NotificationHookConsumer thread-0:] ~ Adding primitive {name=description,
dataType={name=string, description=null}, multiplicity={lower=0, upper=1, isUnique=false},
isComposite=false, isUnique=false, isIndexable=false, reverseAttributeName=null} from vertex
Titan0Vertex [id=2560256] (GraphToTypedInstanceMapper:387)
2017-08-26 06:35:39,669 DEBUG - [NotificationHookConsumer thread-0:] ~ Reading property Asset.description
from vertex[id=2560256 type=hive_db guid=6e1a1742-4727-49b1-a530-835974a01d14] (GraphHelper:495)
2017-08-26 06:35:39,671 DEBUG - [NotificationHookConsumer thread-0:] ~ Reading property Asset.description
from vertex[id=2560256 type=hive_db guid=6e1a1742-4727-49b1-a530-835974a01d14] (GraphHelper:495)
2017-08-26 06:35:39,672 DEBUG - [NotificationHookConsumer thread-0:] ~ Mapping attributeInfo
owner (GraphToTypedInstanceMapper:144)
2017-08-26 06:35:39,673 DEBUG - [NotificationHookConsumer thread-0:] ~ Adding primitive {name=owner,
dataType={name=string, description=null}, multiplicity={lower=0, upper=1, isUnique=false},
isComposite=false, isUnique=false, isIndexable=true, reverseAttributeName=null} from vertex
Titan0Vertex [id=2560256] (GraphToTypedInstanceMapper:387)
2017-08-26 06:35:39,674 DEBUG - [NotificationHookConsumer thread-0:] ~ Reading property Asset.owner
from vertex[id=2560256 type=hive_db guid=6e1a1742-4727-49b1-a530-835974a01d14] (GraphHelper:495)
2017-08-26 06:35:39,675 DEBUG - [NotificationHookConsumer thread-0:] ~ Reading property Asset.owner
from vertex[id=2560256 type=hive_db guid=6e1a1742-4727-49b1-a530-835974a01d14] (GraphHelper:495)
2017-08-26 06:35:39,676 DEBUG - [NotificationHookConsumer thread-0:] ~ Retrieving entities
with guids=[6997b154-1d80-43b8-b05c-6264e507fcea] (GraphBackedMetadataRepository:179)
2017-08-26 06:35:39,677 DEBUG - [NotificationHookConsumer thread-0:] ~ Retrieving entities
with guids=[5fc50de4-813e-44e6-b91e-9a0467a391b3] (GraphBackedMetadataRepository:179)
2017-08-26 06:35:39,677 DEBUG - [NotificationHookConsumer thread-0:] ~ Retrieving entities
with guids=[0a44e307-0b41-4286-803f-101a5e7788ef] (GraphBackedMetadataRepository:179)
2017-08-26 06:35:39,677 DEBUG - [NotificationHookConsumer thread-0:] ~ Retrieving entities
with guids=[1adbac11-2774-4900-94f9-f67898af2a7c] (GraphBackedMetadataRepository:179)
2017-08-26 06:35:39,677 DEBUG - [NotificationHookConsumer thread-0:] ~ Retrieving entities
with guids=[1c4e05ab-1b11-417d-8b07-b00903a7cf33] (GraphBackedMetadataRepository:179)
2017-08-26 06:35:39,758 DEBUG - [NotificationHookConsumer thread-0:] ~ Sending message for
topic ATLAS_ENTITIES: {"version":{"version":"1.0.0"},"message":{"entity":{"jsonClass":"org.apache.atlas.typesystem.json.InstanceSerialization$_Reference","id":{"jsonClass":"org.apache.atlas.typesystem.json.InstanceSerialization$_Id","id":"6e1a1742-4727-49b1-a530-835974a01d14","version":0,"typeName":"hive_db","state":"ACTIVE"},"typeName":"hive_db","values":{"name":"default","location":"<https://builds.apache.org/job/Atlas-master-IntegrationTests/ws/target/metastore","description">:"Default
Hive database","ownerType":{"value":"ROLE","ordinal":2},"qualifiedName":"default@primary","owner":"public","clusterName":"primary"},"traitNames":[],"traits":{},"systemAttributes":{}},"operationType":"ENTITY_UPDATE","traits":[]}}
(KafkaNotification:218)
2017-08-26 06:35:39,759 DEBUG - [NotificationHookConsumer thread-0:] ~ Sending message for
topic ATLAS_ENTITIES: {"version":{"version":"1.0.0"},"message":{"entity":{"jsonClass":"org.apache.atlas.typesystem.json.InstanceSerialization$_Reference","id":{"jsonClass":"org.apache.atlas.typesystem.json.InstanceSerialization$_Id","id":"6997b154-1d80-43b8-b05c-6264e507fcea","version":0,"typeName":"hive_column","state":"ACTIVE"},"typeName":"hive_column","values":{"name":"id","qualifiedName":"default.tableg8zmvi0qty.id@primary","position":0,"owner":"jenkins","type":"int","table":{"jsonClass":"org.apache.atlas.typesystem.json.InstanceSerialization$_Id","id":"1c4e05ab-1b11-417d-8b07-b00903a7cf33","version":0,"typeName":"hive_table","state":"ACTIVE"}},"traitNames":[],"traits":{},"systemAttributes":{}},"operationType":"ENTITY_UPDATE","traits":[]}}
(KafkaNotification:218)
2017-08-26 06:35:39,759 DEBUG - [NotificationHookConsumer thread-0:] ~ Sending message for
topic ATLAS_ENTITIES: {"version":{"version":"1.0.0"},"message":{"entity":{"jsonClass":"org.apache.atlas.typesystem.json.InstanceSerialization$_Reference","id":{"jsonClass":"org.apache.atlas.typesystem.json.InstanceSerialization$_Id","id":"5fc50de4-813e-44e6-b91e-9a0467a391b3","version":0,"typeName":"hive_column","state":"ACTIVE"},"typeName":"hive_column","values":{"name":"name","qualifiedName":"default.tableg8zmvi0qty.name@primary","position":1,"owner":"jenkins","type":"string","table":{"jsonClass":"org.apache.atlas.typesystem.json.InstanceSerialization$_Id","id":"1c4e05ab-1b11-417d-8b07-b00903a7cf33","version":0,"typeName":"hive_table","state":"ACTIVE"}},"traitNames":[],"traits":{},"systemAttributes":{}},"operationType":"ENTITY_UPDATE","traits":[]}}
(KafkaNotification:218)
2017-08-26 06:35:39,760 DEBUG - [NotificationHookConsumer thread-0:] ~ Sending message for
topic ATLAS_ENTITIES: {"version":{"version":"1.0.0"},"message":{"entity":{"jsonClass":"org.apache.atlas.typesystem.json.InstanceSerialization$_Reference","id":{"jsonClass":"org.apache.atlas.typesystem.json.InstanceSerialization$_Id","id":"0a44e307-0b41-4286-803f-101a5e7788ef","version":0,"typeName":"hive_storagedesc","state":"ACTIVE"},"typeName":"hive_storagedesc","values":{"location":"p<https://builds.apache.org/job/Atlas-master-IntegrationTests/ws/addons/hive-bridge/target/someTestPath-data-pi3WQ6NTb9","serdeInfo">:{"jsonClass":"org.apache.atlas.typesystem.json.InstanceSerialization$_Struct","typeName":"hive_serde","values":{"serializationLib":"org.apache.hadoop.hive.serde2.lazy.LazySimpleSerDe","parameters":{"serialization.format":"1"}}},"qualifiedName":"default.tableg8zmvi0qty@primary_storage","outputFormat":"org.apache.hadoop.hive.ql.io.HiveIgnoreKeyTextOutputFormat","compressed":false,"numBuckets":-1,"inputFormat":"org.apache.hadoop.mapred.TextInputFormat","storedAsSubDirectories":false,"table":{"jsonClass":"org.apache.atlas.typesystem.json.InstanceSerialization$_Id","id":"1c4e05ab-1b11-417d-8b07-b00903a7cf33","version":0,"typeName":"hive_table","state":"ACTIVE"}},"traitNames":[],"traits":{},"systemAttributes":{}},"operationType":"ENTITY_UPDATE","traits":[]}}
(KafkaNotification:218)
2017-08-26 06:35:39,760 DEBUG - [NotificationHookConsumer thread-0:] ~ Sending message for
topic ATLAS_ENTITIES: {"version":{"version":"1.0.0"},"message":{"entity":{"jsonClass":"org.apache.atlas.typesystem.json.InstanceSerialization$_Reference","id":{"jsonClass":"org.apache.atlas.typesystem.json.InstanceSerialization$_Id","id":"1adbac11-2774-4900-94f9-f67898af2a7c","version":0,"typeName":"hive_column","state":"ACTIVE"},"typeName":"hive_column","values":{"name":"dt","qualifiedName":"default.tableg8zmvi0qty.dt@primary","position":0,"owner":"jenkins","type":"string","table":{"jsonClass":"org.apache.atlas.typesystem.json.InstanceSerialization$_Id","id":"1c4e05ab-1b11-417d-8b07-b00903a7cf33","version":0,"typeName":"hive_table","state":"ACTIVE"}},"traitNames":[],"traits":{},"systemAttributes":{}},"operationType":"ENTITY_UPDATE","traits":[]}}
(KafkaNotification:218)
2017-08-26 06:35:39,761 DEBUG - [NotificationHookConsumer thread-0:] ~ Sending message for
topic ATLAS_ENTITIES: {"version":{"version":"1.0.0"},"message":{"entity":{"jsonClass":"org.apache.atlas.typesystem.json.InstanceSerialization$_Reference","id":{"jsonClass":"org.apache.atlas.typesystem.json.InstanceSerialization$_Id","id":"1c4e05ab-1b11-417d-8b07-b00903a7cf33","version":0,"typeName":"hive_table","state":"ACTIVE"},"typeName":"hive_table","values":{"tableType":"EXTERNAL_TABLE","name":"tableg8zmvi0qty","createTime":"2017-08-26T06:33:25.000Z","temporary":false,"db":{"jsonClass":"org.apache.atlas.typesystem.json.InstanceSerialization$_Id","id":"6e1a1742-4727-49b1-a530-835974a01d14","version":0,"typeName":"hive_db","state":"ACTIVE"},"retention":0,"qualifiedName":"default.tableg8zmvi0qty@primary","columns":[{"jsonClass":"org.apache.atlas.typesystem.json.InstanceSerialization$_Reference","id":{"jsonClass":"org.apache.atlas.typesystem.json.InstanceSerialization$_Id","id":"6997b154-1d80-43b8-b05c-6264e507fcea","version":0,"typeName":"hive_column","state":"ACTIVE"},"typeName":"hive_column","values":{"name":"id","qualifiedName":"default.tableg8zmvi0qty.id@primary","position":0,"owner":"jenkins","type":"int","table":{"jsonClass":"org.apache.atlas.typesystem.json.InstanceSerialization$_Id","id":"1c4e05ab-1b11-417d-8b07-b00903a7cf33","version":0,"typeName":"hive_table","state":"ACTIVE"}},"traitNames":[],"traits":{},"systemAttributes":{"createdBy":"jenkins","modifiedBy":"jenkins","createdTime":"2017-08-26T06:35:36.952Z","modifiedTime":"2017-08-26T06:35:36.952Z"}},{"jsonClass":"org.apache.atlas.typesystem.json.InstanceSerialization$_Reference","id":{"jsonClass":"org.apache.atlas.typesystem.json.InstanceSerialization$_Id","id":"5fc50de4-813e-44e6-b91e-9a0467a391b3","version":0,"typeName":"hive_column","state":"ACTIVE"},"typeName":"hive_column","values":{"name":"name","qualifiedName":"default.tableg8zmvi0qty.name@primary","position":1,"owner":"jenkins","type":"string","table":{"jsonClass":"org.apache.atlas.typesystem.json.InstanceSerialization$_Id","id":"1c4e05ab-1b11-417d-8b07-b00903a7cf33","version":0,"typeName":"hive_table","state":"ACTIVE"}},"traitNames":[],"traits":{},"systemAttributes":{"createdBy":"jenkins","modifiedBy":"jenkins","createdTime":"2017-08-26T06:35:36.952Z","modifiedTime":"2017-08-26T06:35:36.952Z"}}],"comment":"table
comment","lastAccessTime":"2017-08-26T06:33:25.000Z","owner":"jenkins","sd":{"jsonClass":"org.apache.atlas.typesystem.json.InstanceSerialization$_Reference","id":{"jsonClass":"org.apache.atlas.typesystem.json.InstanceSerialization$_Id","id":"0a44e307-0b41-4286-803f-101a5e7788ef","version":0,"typeName":"hive_storagedesc","state":"ACTIVE"},"typeName":"hive_storagedesc","values":{"location":"p<https://builds.apache.org/job/Atlas-master-IntegrationTests/ws/addons/hive-bridge/target/someTestPath-data-pi3WQ6NTb9","serdeInfo">:{"jsonClass":"org.apache.atlas.typesystem.json.InstanceSerialization$_Struct","typeName":"hive_serde","values":{"serializationLib":"org.apache.hadoop.hive.serde2.lazy.LazySimpleSerDe","parameters":{"serialization.format":"1"}}},"qualifiedName":"default.tableg8zmvi0qty@primary_storage","outputFormat":"org.apache.hadoop.hive.ql.io.HiveIgnoreKeyTextOutputFormat","compressed":false,"numBuckets":-1,"inputFormat":"org.apache.hadoop.mapred.TextInputFormat","storedAsSubDirectories":false,"table":{"jsonClass":"org.apache.atlas.typesystem.json.InstanceSerialization$_Id","id":"1c4e05ab-1b11-417d-8b07-b00903a7cf33","version":0,"typeName":"hive_table","state":"ACTIVE"}},"traitNames":[],"traits":{},"systemAttributes":{"createdBy":"jenkins","modifiedBy":"jenkins","createdTime":"2017-08-26T06:35:36.952Z","modifiedTime":"2017-08-26T06:35:36.952Z"}},"parameters":{"comment":"table
comment","EXTERNAL":"TRUE","transient_lastDdlTime":"1503729205"},"partitionKeys":[{"jsonClass":"org.apache.atlas.typesystem.json.InstanceSerialization$_Reference","id":{"jsonClass":"org.apache.atlas.typesystem.json.InstanceSerialization$_Id","id":"1adbac11-2774-4900-94f9-f67898af2a7c","version":0,"typeName":"hive_column","state":"ACTIVE"},"typeName":"hive_column","values":{"name":"dt","qualifiedName":"default.tableg8zmvi0qty.dt@primary","position":0,"owner":"jenkins","type":"string","table":{"jsonClass":"org.apache.atlas.typesystem.json.InstanceSerialization$_Id","id":"1c4e05ab-1b11-417d-8b07-b00903a7cf33","version":0,"typeName":"hive_table","state":"ACTIVE"}},"traitNames":[],"traits":{},"systemAttributes":{"createdBy":"jenkins","modifiedBy":"jenkins","createdTime":"2017-08-26T06:35:36.952Z","modifiedTime":"2017-08-26T06:35:36.952Z"}}]},"traitNames":[],"traits":{},"systemAttributes":{}},"operationType":"ENTITY_UPDATE","traits":[]}}
(KafkaNotification:218)
2017-08-26 06:35:39,802 DEBUG - [NotificationHookConsumer thread-0:] ~ Sent message for topic
- ATLAS_ENTITIES, partition - 0, offset - 1117 (KafkaNotification:228)
2017-08-26 06:35:39,868 DEBUG - [NotificationHookConsumer thread-0:] ~ Sent message for topic
- ATLAS_ENTITIES, partition - 0, offset - 1118 (KafkaNotification:228)
2017-08-26 06:35:39,921 DEBUG - [NotificationHookConsumer thread-0:] ~ Sent message for topic
- ATLAS_ENTITIES, partition - 0, offset - 1119 (KafkaNotification:228)
2017-08-26 06:35:39,974 DEBUG - [NotificationHookConsumer thread-0:] ~ Sent message for topic
- ATLAS_ENTITIES, partition - 0, offset - 1120 (KafkaNotification:228)
2017-08-26 06:35:40,013 DEBUG - [NotificationHookConsumer thread-0:] ~ Sent message for topic
- ATLAS_ENTITIES, partition - 0, offset - 1121 (KafkaNotification:228)
2017-08-26 06:35:40,081 DEBUG - [NotificationHookConsumer thread-0:] ~ Sent message for topic
- ATLAS_ENTITIES, partition - 0, offset - 1122 (KafkaNotification:228)
[INFO] Closing Spring root WebApplicationContext
2017-08-26 06:35:40,146 DEBUG - [ShutdownMonitor:] ~ ==> AtlasAuthorizationFilter destroy
(AtlasAuthorizationFilter:78)
2017-08-26 06:35:40,146 DEBUG - [ShutdownMonitor:] ~ ==> +SimpleAtlasAuthorizer cleanUp
(SimpleAtlasAuthorizer:327)
2017-08-26 06:35:40,147 DEBUG - [ShutdownMonitor:] ~ <== +SimpleAtlasAuthorizer cleanUp
(SimpleAtlasAuthorizer:338)
2017-08-26 06:35:40,147 INFO  - [ShutdownMonitor:] ~ Stopping service org.apache.atlas.web.service.ActiveInstanceElectorService
(Services:65)
2017-08-26 06:35:40,147 INFO  - [ShutdownMonitor:] ~ HA is not enabled, no need to stop leader
election service (ActiveInstanceElectorService:124)
2017-08-26 06:35:40,147 INFO  - [ShutdownMonitor:] ~ Stopping service org.apache.atlas.kafka.KafkaNotification
(Services:65)
2017-08-26 06:35:40,884 DEBUG - [NotificationHookConsumer thread-0:] ~ graph commit (GraphTransactionInterceptor:65)
2017-08-26 06:35:40,885 DEBUG - [NotificationHookConsumer thread-0:] ~ ==> releaseLockedObjects():
lockedGuids.size: 0 (GraphTransactionInterceptor$ObjectUpdateSynchronizer:187)
2017-08-26 06:35:40,885 DEBUG - [NotificationHookConsumer thread-0:] ~ <== releaseLockedObjects():
lockedGuids.size: 0 (GraphTransactionInterceptor$ObjectUpdateSynchronizer:197)
2017-08-26 06:35:40,885 INFO  - [NotificationHookConsumer thread-0:] ~  commiting the offset
==>> 99 (AtlasKafkaConsumer:87)
2017-08-26 06:35:42,092 INFO  - [ShutdownMonitor:] ~ Stopping service org.apache.atlas.notification.NotificationHookConsumer
(Services:65)
2017-08-26 06:35:42,092 INFO  - [ShutdownMonitor:] ~ ==> stopConsumerThreads() (NotificationHookConsumer:175)
2017-08-26 06:35:42,092 INFO  - [ShutdownMonitor:] ~ ==> HookConsumer shutdown() (NotificationHookConsumer$HookConsumer:423)
2017-08-26 06:35:42,093 INFO  - [ShutdownMonitor:] ~ [atlas-hook-consumer-thread], Shutting
down (Logging$class:68)
2017-08-26 06:35:42,093 DEBUG - [NotificationHookConsumer thread-0:] ~ PERF|ENTITY_FULL_UPDATE|5141
(AtlasPerfTracer:77)
2017-08-26 06:35:42,093 INFO  - [NotificationHookConsumer thread-0:] ~ closing NotificationConsumer
(NotificationHookConsumer$HookConsumer:253)
2017-08-26 06:35:42,096 INFO  - [NotificationHookConsumer thread-0:] ~ <== HookConsumer
doWork() (NotificationHookConsumer$HookConsumer:258)
2017-08-26 06:35:42,096 INFO  - [NotificationHookConsumer thread-0:] ~ [atlas-hook-consumer-thread],
Stopped  (Logging$class:68)
2017-08-26 06:35:42,096 INFO  - [ShutdownMonitor:] ~ [atlas-hook-consumer-thread], Shutdown
completed (Logging$class:68)
2017-08-26 06:35:42,097 INFO  - [ShutdownMonitor:] ~ <== HookConsumer shutdown() (NotificationHookConsumer$HookConsumer:438)
2017-08-26 06:35:42,097 INFO  - [ShutdownMonitor:] ~ <== stopConsumerThreads() (NotificationHookConsumer:184)
2017-08-26 06:35:42,220 DEBUG - [main-SendThread(localhost:19026):] ~ ==> InMemoryJAASConfiguration.getAppConfigurationEntry(Client)
(InMemoryJAASConfiguration:208)
2017-08-26 06:35:42,221 DEBUG - [main-SendThread(localhost:19026):] ~ <== InMemoryJAASConfiguration.getAppConfigurationEntry(Client):
{} (InMemoryJAASConfiguration:238)
2017-08-26 06:35:42,222 WARN  - [main-SendThread(localhost:19026):] ~ Session 0x15e1d3b21960000
for server null, unexpected error, closing socket connection and attempting reconnect (ClientCnxn$SendThread:1102)
java.net.ConnectException: Connection refused
	at sun.nio.ch.SocketChannelImpl.checkConnect(Native Method)
	at sun.nio.ch.SocketChannelImpl.finishConnect(SocketChannelImpl.java:744)
	at org.apache.zookeeper.ClientCnxnSocketNIO.doTransport(ClientCnxnSocketNIO.java:361)
	at org.apache.zookeeper.ClientCnxn$SendThread.run(ClientCnxn.java:1081)
[INFO] Shutting down log4j
[INFO] Stopped o.e.j.m.p.JettyWebAppContext@309c2f66{/,<https://builds.apache.org/job/Atlas-master-IntegrationTests/ws/webapp/target/atlas-webapp-0.9-SNAPSHOT/,UNAVAILABLE}{/home/jenkins/jenkins-slave/workspace/Atlas-master-IntegrationTests/webapp/target/atlas-webapp-0.9-SNAPSHOT.war}>
[INFO] Server reports itself as stopped
[INFO] 
[INFO] --- maven-source-plugin:2.4:jar-no-fork (attach-sources) @ hive-bridge ---
log4j:WARN No appenders could be found for logger (org.apache.atlas.security.InMemoryJAASConfiguration).
log4j:WARN Please initialize the log4j system properly.
log4j:WARN See http://logging.apache.org/log4j/1.2/faq.html#noconfig for more info.
[INFO] Building jar: <https://builds.apache.org/job/Atlas-master-IntegrationTests/ws/addons/hive-bridge/target/hive-bridge-0.9-SNAPSHOT-sources.jar>
[INFO] 
[INFO] --- maven-source-plugin:2.4:test-jar-no-fork (attach-sources) @ hive-bridge ---
[INFO] Building jar: <https://builds.apache.org/job/Atlas-master-IntegrationTests/ws/addons/hive-bridge/target/hive-bridge-0.9-SNAPSHOT-test-sources.jar>
[INFO] 
[INFO] --- maven-failsafe-plugin:2.19.1:verify (verify) @ hive-bridge ---
[INFO] ------------------------------------------------------------------------
[INFO] Reactor Summary:
[INFO] 
[INFO] Apache Atlas Server Build Tools .................... SUCCESS [  2.002 s]
[INFO] apache-atlas ....................................... SUCCESS [ 12.694 s]
[INFO] Apache Atlas Integration ........................... SUCCESS [ 38.634 s]
[INFO] Apache Atlas Common ................................ SUCCESS [ 17.318 s]
[INFO] Apache Atlas Typesystem ............................ SUCCESS [01:28 min]
[INFO] Apache Atlas Client ................................ SUCCESS [ 20.941 s]
[INFO] Apache Atlas Server API ............................ SUCCESS [ 12.103 s]
[INFO] Apache Atlas Notification .......................... SUCCESS [ 20.785 s]
[INFO] Apache Atlas Graph Database Projects ............... SUCCESS [  0.800 s]
[INFO] Apache Atlas Graph Database API .................... SUCCESS [  9.430 s]
[INFO] Graph Database Common Code ......................... SUCCESS [ 10.485 s]
[INFO] Apache Atlas Titan 1.0.0 GraphDB Impl .............. SUCCESS [01:00 min]
[INFO] Shaded version of Apache hbase client .............. SUCCESS [ 13.101 s]
[INFO] Apache Atlas Titan 0.5.4 Graph DB Impl ............. SUCCESS [01:04 min]
[INFO] Apache Atlas Graph Database Implementation Dependencies SUCCESS [  1.026 s]
[INFO] Shaded version of Apache hbase server .............. SUCCESS [ 40.421 s]
[INFO] Apache Atlas Repository ............................ SUCCESS [02:07 min]
[INFO] Apache Atlas Authorization ......................... SUCCESS [ 13.291 s]
[INFO] Apache Atlas Business Catalog ...................... SUCCESS [ 19.135 s]
[INFO] Apache Atlas UI .................................... SUCCESS [01:42 min]
[INFO] Apache Atlas Web Application ....................... SUCCESS [07:10 min]
[INFO] Apache Atlas Documentation ......................... SUCCESS [ 31.262 s]
[INFO] Apache Atlas FileSystem Model ...................... SUCCESS [  3.042 s]
[INFO] Apache Atlas Plugin Classloader .................... SUCCESS [ 11.502 s]
[INFO] Apache Atlas Hive Bridge Shim ...................... SUCCESS [ 16.818 s]
[INFO] Apache Atlas Hive Bridge ........................... FAILURE [09:34 min]
[INFO] Apache Atlas Falcon Bridge Shim .................... SKIPPED
[INFO] Apache Atlas Falcon Bridge ......................... SKIPPED
[INFO] Apache Atlas Sqoop Bridge Shim ..................... SKIPPED
[INFO] Apache Atlas Sqoop Bridge .......................... SKIPPED
[INFO] Apache Atlas Storm Bridge Shim ..................... SKIPPED
[INFO] Apache Atlas Storm Bridge .......................... SKIPPED
[INFO] Apache Atlas Distribution .......................... SKIPPED
[INFO] ------------------------------------------------------------------------
[INFO] BUILD FAILURE
[INFO] ------------------------------------------------------------------------
[INFO] Total time: 29:06 min
[INFO] Finished at: 2017-08-26T06:35:42Z
[INFO] Final Memory: 563M/2359M
[INFO] ------------------------------------------------------------------------
[ERROR] Failed to execute goal org.apache.maven.plugins:maven-failsafe-plugin:2.19.1:verify
(verify) on project hive-bridge: There are test failures.
[ERROR] 
[ERROR] Please refer to <https://builds.apache.org/job/Atlas-master-IntegrationTests/ws/addons/hive-bridge/target/failsafe-reports>
for the individual test results.
[ERROR] -> [Help 1]
[ERROR] 
[ERROR] To see the full stack trace of the errors, re-run Maven with the -e switch.
[ERROR] Re-run Maven using the -X switch to enable full debug logging.
[ERROR] 
[ERROR] For more information about the errors and possible solutions, please read the following
articles:
[ERROR] [Help 1] http://cwiki.apache.org/confluence/display/MAVEN/MojoFailureException
[ERROR] 
[ERROR] After correcting the problems, you can resume the build with the command
[ERROR]   mvn <goals> -rf :hive-bridge
Build step 'Execute shell' marked build as failure
[CHECKSTYLE] Collecting checkstyle analysis files...
[CHECKSTYLE] Searching for all files in <https://builds.apache.org/job/Atlas-master-IntegrationTests/ws/>
that match the pattern **/target/checkstyle-result.xml
[CHECKSTYLE] Parsing 24 files in <https://builds.apache.org/job/Atlas-master-IntegrationTests/ws/>
[CHECKSTYLE] Successfully parsed file <https://builds.apache.org/job/Atlas-master-IntegrationTests/ws/addons/hdfs-model/target/checkstyle-result.xml>
with 0 unique warnings and 0 duplicates.
[CHECKSTYLE] Successfully parsed file <https://builds.apache.org/job/Atlas-master-IntegrationTests/ws/addons/hive-bridge-shim/target/checkstyle-result.xml>
with 15 unique warnings and 0 duplicates.
[CHECKSTYLE] Successfully parsed file <https://builds.apache.org/job/Atlas-master-IntegrationTests/ws/authorization/target/checkstyle-result.xml>
with 482 unique warnings and 0 duplicates.
[CHECKSTYLE] Successfully parsed file <https://builds.apache.org/job/Atlas-master-IntegrationTests/ws/catalog/target/checkstyle-result.xml>
with 2619 unique warnings and 0 duplicates.
[CHECKSTYLE] Successfully parsed file <https://builds.apache.org/job/Atlas-master-IntegrationTests/ws/client/target/checkstyle-result.xml>
with 4256 unique warnings and 0 duplicates.
[CHECKSTYLE] Successfully parsed file <https://builds.apache.org/job/Atlas-master-IntegrationTests/ws/common/target/checkstyle-result.xml>
with 5468 unique warnings and 0 duplicates.
[CHECKSTYLE] Successfully parsed file <https://builds.apache.org/job/Atlas-master-IntegrationTests/ws/dashboardv2/target/checkstyle-result.xml>
with 5468 unique warnings and 0 duplicates.
[CHECKSTYLE] Successfully parsed file <https://builds.apache.org/job/Atlas-master-IntegrationTests/ws/docs/target/checkstyle-result.xml>
with 5468 unique warnings and 0 duplicates.
[CHECKSTYLE] Successfully parsed file <https://builds.apache.org/job/Atlas-master-IntegrationTests/ws/graphdb/api/target/checkstyle-result.xml>
with 5737 unique warnings and 0 duplicates.
[CHECKSTYLE] Successfully parsed file <https://builds.apache.org/job/Atlas-master-IntegrationTests/ws/graphdb/common/target/checkstyle-result.xml>
with 5924 unique warnings and 0 duplicates.
[CHECKSTYLE] Successfully parsed file <https://builds.apache.org/job/Atlas-master-IntegrationTests/ws/graphdb/graphdb-impls/target/checkstyle-result.xml>
with 5924 unique warnings and 0 duplicates.
[CHECKSTYLE] Successfully parsed file <https://builds.apache.org/job/Atlas-master-IntegrationTests/ws/graphdb/target/checkstyle-result.xml>
with 5924 unique warnings and 0 duplicates.
[CHECKSTYLE] Successfully parsed file <https://builds.apache.org/job/Atlas-master-IntegrationTests/ws/graphdb/titan0/target/checkstyle-result.xml>
with 8198 unique warnings and 0 duplicates.
[CHECKSTYLE] Successfully parsed file <https://builds.apache.org/job/Atlas-master-IntegrationTests/ws/graphdb/titan1/target/checkstyle-result.xml>
with 9146 unique warnings and 0 duplicates.
[CHECKSTYLE] Successfully parsed file <https://builds.apache.org/job/Atlas-master-IntegrationTests/ws/intg/target/checkstyle-result.xml>
with 16683 unique warnings and 0 duplicates.
[CHECKSTYLE] Successfully parsed file <https://builds.apache.org/job/Atlas-master-IntegrationTests/ws/notification/target/checkstyle-result.xml>
with 17893 unique warnings and 0 duplicates.
[CHECKSTYLE] Successfully parsed file <https://builds.apache.org/job/Atlas-master-IntegrationTests/ws/plugin-classloader/target/checkstyle-result.xml>
with 18001 unique warnings and 0 duplicates.
[CHECKSTYLE] Successfully parsed file <https://builds.apache.org/job/Atlas-master-IntegrationTests/ws/repository/target/checkstyle-result.xml>
with 37533 unique warnings and 0 duplicates.
[CHECKSTYLE] Successfully parsed file <https://builds.apache.org/job/Atlas-master-IntegrationTests/ws/server-api/target/checkstyle-result.xml>
with 37912 unique warnings and 0 duplicates.
[CHECKSTYLE] Successfully parsed file <https://builds.apache.org/job/Atlas-master-IntegrationTests/ws/shaded/hbase-client-shaded/target/checkstyle-result.xml>
with 37912 unique warnings and 0 duplicates.
[CHECKSTYLE] Successfully parsed file <https://builds.apache.org/job/Atlas-master-IntegrationTests/ws/shaded/hbase-server-shaded/target/checkstyle-result.xml>
with 37912 unique warnings and 0 duplicates.
[CHECKSTYLE] Successfully parsed file <https://builds.apache.org/job/Atlas-master-IntegrationTests/ws/target/checkstyle-result.xml>
with 37912 unique warnings and 0 duplicates.
[CHECKSTYLE] Successfully parsed file <https://builds.apache.org/job/Atlas-master-IntegrationTests/ws/typesystem/target/checkstyle-result.xml>
with 42130 unique warnings and 0 duplicates.
[CHECKSTYLE] Successfully parsed file <https://builds.apache.org/job/Atlas-master-IntegrationTests/ws/webapp/target/checkstyle-result.xml>
with 50218 unique warnings and 0 duplicates.
<Git Blamer> Using GitBlamer to create author and commit information for all warnings.
<Git Blamer> GIT_COMMIT=c6155816c51ebdbce8bef0069a8bccca1418c7d0, workspace=<https://builds.apache.org/job/Atlas-master-IntegrationTests/ws/>
 > git rev-parse c6155816c51ebdbce8bef0069a8bccca1418c7d0^{commit} # timeout=10
[FINDBUGS] Collecting findbugs analysis files...
[FINDBUGS] Searching for all files in <https://builds.apache.org/job/Atlas-master-IntegrationTests/ws/>
that match the pattern **/target/findbugs.xml
[FINDBUGS] Parsing 15 files in <https://builds.apache.org/job/Atlas-master-IntegrationTests/ws/>
[FINDBUGS] Successfully parsed file <https://builds.apache.org/job/Atlas-master-IntegrationTests/ws/addons/hive-bridge-shim/target/findbugs.xml>
with 0 unique warnings and 0 duplicates.
[FINDBUGS] Successfully parsed file <https://builds.apache.org/job/Atlas-master-IntegrationTests/ws/authorization/target/findbugs.xml>
with 0 unique warnings and 0 duplicates.
[FINDBUGS] Successfully parsed file <https://builds.apache.org/job/Atlas-master-IntegrationTests/ws/catalog/target/findbugs.xml>
with 0 unique warnings and 0 duplicates.
[FINDBUGS] Successfully parsed file <https://builds.apache.org/job/Atlas-master-IntegrationTests/ws/client/target/findbugs.xml>
with 0 unique warnings and 0 duplicates.
[FINDBUGS] Successfully parsed file <https://builds.apache.org/job/Atlas-master-IntegrationTests/ws/common/target/findbugs.xml>
with 0 unique warnings and 0 duplicates.
[FINDBUGS] Successfully parsed file <https://builds.apache.org/job/Atlas-master-IntegrationTests/ws/graphdb/api/target/findbugs.xml>
with 0 unique warnings and 0 duplicates.
[FINDBUGS] Successfully parsed file <https://builds.apache.org/job/Atlas-master-IntegrationTests/ws/graphdb/common/target/findbugs.xml>
with 0 unique warnings and 0 duplicates.
[FINDBUGS] Successfully parsed file <https://builds.apache.org/job/Atlas-master-IntegrationTests/ws/graphdb/titan0/target/findbugs.xml>
with 0 unique warnings and 0 duplicates.
[FINDBUGS] Successfully parsed file <https://builds.apache.org/job/Atlas-master-IntegrationTests/ws/intg/target/findbugs.xml>
with 0 unique warnings and 0 duplicates.
[FINDBUGS] Successfully parsed file <https://builds.apache.org/job/Atlas-master-IntegrationTests/ws/notification/target/findbugs.xml>
with 0 unique warnings and 0 duplicates.
[FINDBUGS] Successfully parsed file <https://builds.apache.org/job/Atlas-master-IntegrationTests/ws/plugin-classloader/target/findbugs.xml>
with 0 unique warnings and 0 duplicates.
[FINDBUGS] Successfully parsed file <https://builds.apache.org/job/Atlas-master-IntegrationTests/ws/repository/target/findbugs.xml>
with 0 unique warnings and 0 duplicates.
[FINDBUGS] Successfully parsed file <https://builds.apache.org/job/Atlas-master-IntegrationTests/ws/server-api/target/findbugs.xml>
with 0 unique warnings and 0 duplicates.
[FINDBUGS] Successfully parsed file <https://builds.apache.org/job/Atlas-master-IntegrationTests/ws/typesystem/target/findbugs.xml>
with 0 unique warnings and 0 duplicates.
[FINDBUGS] Successfully parsed file <https://builds.apache.org/job/Atlas-master-IntegrationTests/ws/webapp/target/findbugs.xml>
with 0 unique warnings and 0 duplicates.
<Git Blamer> Using GitBlamer to create author and commit information for all warnings.
<Git Blamer> GIT_COMMIT=c6155816c51ebdbce8bef0069a8bccca1418c7d0, workspace=<https://builds.apache.org/job/Atlas-master-IntegrationTests/ws/>
Archiving artifacts
[Fast Archiver] No prior successful build to compare, so performing full copy of artifacts
TestNG Reports Processing: START
Looking for TestNG results report in workspace using pattern: **/target/surefire-reports/testng-results.xml,**/target/failsafe-reports/testng-results.xml
Saving reports...
Processing '/x1/jenkins/jenkins-home/jobs/Atlas-master-IntegrationTests/builds/39/testng/testng-results-1.xml'
Processing '/x1/jenkins/jenkins-home/jobs/Atlas-master-IntegrationTests/builds/39/testng/testng-results.xml'
21.910112% of tests failed, which exceeded threshold of 0%. Marking build as UNSTABLE
TestNG Reports Processing: FINISH

Mime
View raw message