atlas-dev mailing list archives

Site index · List index
Message view « Date » · « Thread »
Top « Date » · « Thread »
From Apache Jenkins Server <jenk...@builds.apache.org>
Subject Build failed in Jenkins: apache-atlas-UT #3
Date Mon, 21 Aug 2017 19:14:45 GMT
See <https://builds.apache.org/job/apache-atlas-UT/3/display/redirect?page=changes>

Changes:

[amestry] ATLAS-2038: Minor refactoring to use

------------------------------------------
[...truncated 682.47 KB...]
127.0.0.1 - - [21/Aug/2017:19:10:06 +0000] "POST /api/atlas/v2/entity/ HTTP/1.1" 200 - "-"
"Java/1.7.0_80"
127.0.0.1 - - [21/Aug/2017:19:10:06 +0000] "POST /api/atlas/v2/entity/guid/random/classifications
HTTP/1.1" 404 - "-" "Java/1.7.0_80"
127.0.0.1 - - [21/Aug/2017:19:10:06 +0000] "POST /api/atlas/v2/entity/bulk/ HTTP/1.1" 200
- "-" "Java/1.7.0_80"
127.0.0.1 - - [21/Aug/2017:19:10:06 +0000] "POST /api/atlas/v2/entity/ HTTP/1.1" 200 - "-"
"Java/1.7.0_80"
127.0.0.1 - - [21/Aug/2017:19:10:06 +0000] "POST /api/atlas/v2/entity/ HTTP/1.1" 200 - "-"
"Java/1.7.0_80"
127.0.0.1 - - [21/Aug/2017:19:10:06 +0000] "DELETE /api/atlas/v2/entity/bulk/?guid=f51187c1-d3bc-4344-95cb-a02709ae27cd&guid=d6c52263-e578-40c0-88dc-c08aaacb4604
HTTP/1.1" 200 - "-" "Java/1.7.0_80"
127.0.0.1 - - [21/Aug/2017:19:10:06 +0000] "POST /api/atlas/v2/entity/ HTTP/1.1" 200 - "-"
"Java/1.7.0_80"
127.0.0.1 - - [21/Aug/2017:19:10:06 +0000] "DELETE /api/atlas/v2/entity/uniqueAttribute/type/hive_db_v2?attr:name=dbujPzC40QDa%EE%BB%84%EF%98%88%E7%97%82%EA%85%A2%E6%93%B0%EE%B4%A8%D7%BC%E2%9D%B1%E9%94%AF%EB%83%A2
HTTP/1.1" 200 - "-" "Java/1.7.0_80"
127.0.0.1 - - [21/Aug/2017:19:10:06 +0000] "DELETE /api/atlas/v2/entity/guid/random/classification/blah_trait
HTTP/1.1" 400 - "-" "Java/1.7.0_80"
127.0.0.1 - - [21/Aug/2017:19:10:06 +0000] "GET /api/atlas/discovery/search/dsl?query=hive_db_v2+where+name%3D'dbujPzC40QDa'&limit=10&offset=0
HTTP/1.1" 200 - "-" "Java/1.7.0_80"
127.0.0.1 - - [21/Aug/2017:19:10:07 +0000] "GET /api/atlas/discovery/search/dsl?query=hive_db_v2+where+name%3D'dbujPzC40QDa'&limit=10&offset=0
HTTP/1.1" 200 - "-" "Java/1.7.0_80"
127.0.0.1 - - [21/Aug/2017:19:10:08 +0000] "POST /api/atlas/v2/entity/ HTTP/1.1" 200 - "-"
"Java/1.7.0_80"
127.0.0.1 - - [21/Aug/2017:19:10:08 +0000] "GET /api/atlas/discovery/search/dsl?query=hive_db_v2+where+name%3D'dbujPzC40QDa'&limit=10&offset=0
HTTP/1.1" 200 - "-" "Java/1.7.0_80"
127.0.0.1 - - [21/Aug/2017:19:10:09 +0000] "POST /api/atlas/v2/types/typedefs/ HTTP/1.1" 200
- "-" "Java/1.7.0_80"
127.0.0.1 - - [21/Aug/2017:19:10:09 +0000] "POST /api/atlas/v2/entity/ HTTP/1.1" 200 - "-"
"Java/1.7.0_80"
127.0.0.1 - - [21/Aug/2017:19:10:09 +0000] "PUT /api/atlas/v2/types/typedefs/ HTTP/1.1" 200
- "-" "Java/1.7.0_80"
127.0.0.1 - - [21/Aug/2017:19:10:09 +0000] "GET /api/atlas/v2/entity/guid/2b431bb9-41eb-47aa-af68-60ace9c5c4b9
HTTP/1.1" 200 - "-" "Java/1.7.0_80"
127.0.0.1 - - [21/Aug/2017:19:10:09 +0000] "POST /api/atlas/v2/entity/ HTTP/1.1" 404 - "-"
"Java/1.7.0_80"
127.0.0.1 - - [21/Aug/2017:19:10:10 +0000] "POST /api/atlas/v2/entity/ HTTP/1.1" 200 - "-"
"Java/1.7.0_80"
127.0.0.1 - - [21/Aug/2017:19:10:10 +0000] "POST /api/atlas/v2/entity/ HTTP/1.1" 200 - "-"
"Java/1.7.0_80"
127.0.0.1 - - [21/Aug/2017:19:10:10 +0000] "GET /api/atlas/v2/entity/uniqueAttribute/type/hive_db_v2?attr:name=dbujPzC40QDa
HTTP/1.1" 200 - "-" "Java/1.7.0_80"
127.0.0.1 - - [21/Aug/2017:19:10:10 +0000] "POST /api/atlas/v2/entity/ HTTP/1.1" 200 - "-"
"Java/1.7.0_80"
127.0.0.1 - - [21/Aug/2017:19:10:10 +0000] "POST /api/atlas/v2/entity/ HTTP/1.1" 200 - "-"
"Java/1.7.0_80"
127.0.0.1 - - [21/Aug/2017:19:10:10 +0000] "GET /api/atlas/v2/types/typedef/name/X9k4cwBERl
HTTP/1.1" 404 - "-" "Java/1.7.0_80"
127.0.0.1 - - [21/Aug/2017:19:10:10 +0000] "POST /api/atlas/v2/types/typedefs/ HTTP/1.1" 200
- "-" "Java/1.7.0_80"
127.0.0.1 - - [21/Aug/2017:19:10:10 +0000] "POST /api/atlas/v2/entity/ HTTP/1.1" 200 - "-"
"Java/1.7.0_80"
127.0.0.1 - - [21/Aug/2017:19:10:10 +0000] "GET /api/atlas/v2/entity/guid/6aefd997-90c7-4c63-b1b7-6247254d5207
HTTP/1.1" 200 - "-" "Java/1.7.0_80"
127.0.0.1 - - [21/Aug/2017:19:10:10 +0000] "GET /api/atlas/v2/entity/guid/blah HTTP/1.1" 404
- "-" "Java/1.7.0_80"
127.0.0.1 - - [21/Aug/2017:19:10:10 +0000] "POST /api/atlas/v2/entity/ HTTP/1.1" 200 - "-"
"Java/1.7.0_80"
127.0.0.1 - - [21/Aug/2017:19:10:10 +0000] "GET /api/atlas/entities/425fdcdb-0799-45b0-865d-cbf65760e32f/audit?count=10
HTTP/1.1" 200 - "-" "Java/1.7.0_80"
127.0.0.1 - - [21/Aug/2017:19:10:10 +0000] "GET /api/atlas/discovery/search/dsl?query=from+hive_db_v1+name%3D%22dboGDDAazSfa%22
HTTP/1.1" 200 - "-" "Java/1.7.0_80"
127.0.0.1 - - [21/Aug/2017:19:10:11 +0000] "GET /api/atlas/discovery/search/dsl?query=from+blah
HTTP/1.1" 400 - "-" "Java/1.7.0_80"
127.0.0.1 - - [21/Aug/2017:19:10:11 +0000] "GET /api/atlas/discovery/search?query=* HTTP/1.1"
200 - "-" "Java/1.7.0_80"
127.0.0.1 - - [21/Aug/2017:19:10:11 +0000] "GET /api/atlas/discovery/search?query=from+hive_db_v1+name%3D%22dboGDDAazSfa%22
HTTP/1.1" 200 - "-" "Java/1.7.0_80"
127.0.0.1 - - [21/Aug/2017:19:10:12 +0000] "GET /api/atlas/discovery/search/gremlin?query=g.V.has('type',+'hive_table_v1').toList()
HTTP/1.1" 400 - "-" "Java/1.7.0_80"
127.0.0.1 - - [21/Aug/2017:19:10:12 +0000] "POST /api/atlas/v2/types/typedefs/ HTTP/1.1" 200
- "-" "Java/1.7.0_80"
127.0.0.1 - - [21/Aug/2017:19:10:12 +0000] "POST /api/atlas/v2/types/typedefs/ HTTP/1.1" 409
- "-" "Java/1.7.0_80"
127.0.0.1 - - [21/Aug/2017:19:10:12 +0000] "GET /api/atlas/v2/types/enumdef/name/blah HTTP/1.1"
404 - "-" "Java/1.7.0_80"
127.0.0.1 - - [21/Aug/2017:19:10:12 +0000] "GET /api/atlas/v2/types/enumdef/guid/blah HTTP/1.1"
404 - "-" "Java/1.7.0_80"
127.0.0.1 - - [21/Aug/2017:19:10:12 +0000] "GET /api/atlas/v2/types/structdef/name/blah HTTP/1.1"
404 - "-" "Java/1.7.0_80"
127.0.0.1 - - [21/Aug/2017:19:10:12 +0000] "GET /api/atlas/v2/types/structdef/guid/blah HTTP/1.1"
404 - "-" "Java/1.7.0_80"
127.0.0.1 - - [21/Aug/2017:19:10:12 +0000] "GET /api/atlas/v2/types/classificationdef/name/blah
HTTP/1.1" 404 - "-" "Java/1.7.0_80"
127.0.0.1 - - [21/Aug/2017:19:10:12 +0000] "GET /api/atlas/v2/types/classificationdef/guid/blah
HTTP/1.1" 404 - "-" "Java/1.7.0_80"
127.0.0.1 - - [21/Aug/2017:19:10:12 +0000] "GET /api/atlas/v2/types/entitydef/name/blah HTTP/1.1"
404 - "-" "Java/1.7.0_80"
127.0.0.1 - - [21/Aug/2017:19:10:12 +0000] "GET /api/atlas/v2/types/entitydef/guid/blah HTTP/1.1"
404 - "-" "Java/1.7.0_80"
127.0.0.1 - - [21/Aug/2017:19:10:12 +0000] "POST /api/atlas/v2/types/typedefs/ HTTP/1.1" 200
- "-" "Java/1.7.0_80"
127.0.0.1 - - [21/Aug/2017:19:10:12 +0000] "GET /api/atlas/v2/types/typedefs/?supertype=AkEIrTVWcMm&type=CLASS
HTTP/1.1" 200 - "-" "Java/1.7.0_80"
127.0.0.1 - - [21/Aug/2017:19:10:12 +0000] "GET /api/atlas/v2/types/typedefs/?notsupertype=BYw9BjQtAGP&supertype=AkEIrTVWcMm&type=CLASS
HTTP/1.1" 200 - "-" "Java/1.7.0_80"
127.0.0.1 - - [21/Aug/2017:19:10:12 +0000] "POST /api/atlas/v2/types/typedefs/ HTTP/1.1" 200
- "-" "Java/1.7.0_80"
127.0.0.1 - - [21/Aug/2017:19:10:13 +0000] "PUT /api/atlas/v2/types/typedefs/ HTTP/1.1" 200
- "-" "Java/1.7.0_80"
127.0.0.1 - - [21/Aug/2017:19:10:13 +0000] "GET /api/atlas/v2/types/typedefs/?type=ENTITY
HTTP/1.1" 200 - "-" "Java/1.7.0_80"
127.0.0.1 - - [21/Aug/2017:19:10:13 +0000] "POST /api/atlas/types HTTP/1.1" 201 - "-" "Java/1.7.0_80"
127.0.0.1 - - [21/Aug/2017:19:10:13 +0000] "POST /api/atlas/types HTTP/1.1" 409 - "-" "Java/1.7.0_80"
127.0.0.1 - - [21/Aug/2017:19:10:13 +0000] "GET /api/atlas/types/blah HTTP/1.1" 404 - "-"
"Java/1.7.0_80"
127.0.0.1 - - [21/Aug/2017:19:10:13 +0000] "GET /api/atlas/v2/types/typedef/name/class_trait
HTTP/1.1" 404 - "-" "Java/1.7.0_80"
127.0.0.1 - - [21/Aug/2017:19:10:13 +0000] "POST /api/atlas/types HTTP/1.1" 201 - "-" "Java/1.7.0_80"
127.0.0.1 - - [21/Aug/2017:19:10:13 +0000] "GET /api/atlas/v2/types/typedef/name/secure_trait
HTTP/1.1" 404 - "-" "Java/1.7.0_80"
127.0.0.1 - - [21/Aug/2017:19:10:13 +0000] "POST /api/atlas/types HTTP/1.1" 201 - "-" "Java/1.7.0_80"
127.0.0.1 - - [21/Aug/2017:19:10:13 +0000] "GET /api/atlas/v2/types/typedef/name/pii_trait
HTTP/1.1" 404 - "-" "Java/1.7.0_80"
127.0.0.1 - - [21/Aug/2017:19:10:13 +0000] "POST /api/atlas/types HTTP/1.1" 201 - "-" "Java/1.7.0_80"
127.0.0.1 - - [21/Aug/2017:19:10:13 +0000] "GET /api/atlas/v2/types/typedef/name/ssn_trait
HTTP/1.1" 404 - "-" "Java/1.7.0_80"
127.0.0.1 - - [21/Aug/2017:19:10:13 +0000] "POST /api/atlas/types HTTP/1.1" 201 - "-" "Java/1.7.0_80"
127.0.0.1 - - [21/Aug/2017:19:10:13 +0000] "GET /api/atlas/v2/types/typedef/name/salary_trait
HTTP/1.1" 404 - "-" "Java/1.7.0_80"
127.0.0.1 - - [21/Aug/2017:19:10:13 +0000] "POST /api/atlas/types HTTP/1.1" 201 - "-" "Java/1.7.0_80"
127.0.0.1 - - [21/Aug/2017:19:10:14 +0000] "GET /api/atlas/v2/types/typedef/name/sox_trait
HTTP/1.1" 404 - "-" "Java/1.7.0_80"
127.0.0.1 - - [21/Aug/2017:19:10:14 +0000] "POST /api/atlas/types HTTP/1.1" 201 - "-" "Java/1.7.0_80"
127.0.0.1 - - [21/Aug/2017:19:10:14 +0000] "GET /api/atlas/types?type=TRAIT HTTP/1.1" 200
- "-" "Java/1.7.0_80"
127.0.0.1 - - [21/Aug/2017:19:10:14 +0000] "GET /api/atlas/v2/types/typedef/name/AYau3Uiusqc
HTTP/1.1" 404 - "-" "Java/1.7.0_80"
127.0.0.1 - - [21/Aug/2017:19:10:14 +0000] "POST /api/atlas/types HTTP/1.1" 201 - "-" "Java/1.7.0_80"
127.0.0.1 - - [21/Aug/2017:19:10:14 +0000] "GET /api/atlas/v2/types/typedef/name/A1iGMrTIQMvS
HTTP/1.1" 404 - "-" "Java/1.7.0_80"
127.0.0.1 - - [21/Aug/2017:19:10:14 +0000] "POST /api/atlas/types HTTP/1.1" 201 - "-" "Java/1.7.0_80"
127.0.0.1 - - [21/Aug/2017:19:10:14 +0000] "GET /api/atlas/v2/types/typedef/name/BGqSfNqRJGw
HTTP/1.1" 404 - "-" "Java/1.7.0_80"
127.0.0.1 - - [21/Aug/2017:19:10:14 +0000] "POST /api/atlas/types HTTP/1.1" 201 - "-" "Java/1.7.0_80"
127.0.0.1 - - [21/Aug/2017:19:10:14 +0000] "GET /api/atlas/v2/types/typedef/name/CKY0nJg2GEY
HTTP/1.1" 404 - "-" "Java/1.7.0_80"
127.0.0.1 - - [21/Aug/2017:19:10:14 +0000] "POST /api/atlas/types HTTP/1.1" 201 - "-" "Java/1.7.0_80"
127.0.0.1 - - [21/Aug/2017:19:10:14 +0000] "GET /api/atlas/types?type=CLASS&supertype=AYau3Uiusqc&notsupertype=BGqSfNqRJGw
HTTP/1.1" 200 - "-" "Java/1.7.0_80"
127.0.0.1 - - [21/Aug/2017:19:10:14 +0000] "POST /api/atlas/types HTTP/1.1" 201 - "-" "Java/1.7.0_80"
127.0.0.1 - - [21/Aug/2017:19:10:15 +0000] "PUT /api/atlas/types HTTP/1.1" 200 - "-" "Java/1.7.0_80"
127.0.0.1 - - [21/Aug/2017:19:10:15 +0000] "GET /api/atlas/types/V4kG3Qqh8H HTTP/1.1" 200
- "-" "Java/1.7.0_80"
127.0.0.1 - - [21/Aug/2017:19:10:19 +0000] "POST /api/atlas/v2/types/typedefs/ HTTP/1.1" 409
- "-" "Java/1.7.0_80"
Tests run: 133, Failures: 5, Errors: 0, Skipped: 5, Time elapsed: 241.385 sec <<<
FAILURE! - in TestSuite
testDeleteByQualifiedName(org.apache.atlas.notification.NotificationHookConsumerIT)  Time
elapsed: 60.101 sec  <<< FAILURE!
java.lang.Exception: Waiting timed out after 60000 msec
	at org.apache.atlas.notification.NotificationHookConsumerIT.testDeleteByQualifiedName(NotificationHookConsumerIT.java:184)

testUpdateEntityPartial(org.apache.atlas.notification.NotificationHookConsumerIT)  Time elapsed:
60.084 sec  <<< FAILURE!
java.lang.Exception: Waiting timed out after 60000 msec
	at org.apache.atlas.notification.NotificationHookConsumerIT.testUpdateEntityPartial(NotificationHookConsumerIT.java:127)

testPartialUpdate(org.apache.atlas.web.integration.EntityJerseyResourceIT)  Time elapsed:
0.203 sec  <<< FAILURE!
java.lang.AssertionError: expected:<1> but was:<3>
	at org.apache.atlas.web.integration.EntityJerseyResourceIT.testPartialUpdate(EntityJerseyResourceIT.java:881)

testSearchUsingGremlin(org.apache.atlas.web.integration.MetadataDiscoveryJerseyResourceIT)
 Time elapsed: 0.006 sec  <<< FAILURE!
org.apache.atlas.AtlasServiceException: Metadata service API org.apache.atlas.AtlasBaseClient$APIInfo@63ef52
failed with status 400 (Bad Request) Response Body ({"error":"Gremlin search is not enabled."})
	at org.apache.atlas.web.integration.MetadataDiscoveryJerseyResourceIT.testSearchUsingGremlin(MetadataDiscoveryJerseyResourceIT.java:153)

runQuickStart(org.apache.atlas.examples.QuickStartV2IT)  Time elapsed: 4.427 sec  <<<
FAILURE!
org.apache.atlas.AtlasServiceException: Metadata service API org.apache.atlas.AtlasBaseClient$APIInfo@5f8c682b
failed with status 409 (Conflict) Response Body ({"errorCode":"ATLAS-409-00-001","errorMessage":"Given
type Dimension already exists"})
	at org.apache.atlas.examples.QuickStartV2IT.runQuickStart(QuickStartV2IT.java:49)


Results :

Failed tests: 
  QuickStartV2IT.runQuickStart:49 » AtlasService Metadata service API org.apache...
  NotificationHookConsumerIT.testDeleteByQualifiedName:184->BaseResourceIT.waitFor:626
» 
  NotificationHookConsumerIT.testUpdateEntityPartial:127->BaseResourceIT.waitFor:626 »

  EntityJerseyResourceIT.testPartialUpdate:881 expected:<1> but was:<3>
  MetadataDiscoveryJerseyResourceIT.testSearchUsingGremlin:153 » AtlasService Me...

Tests run: 133, Failures: 5, Errors: 0, Skipped: 5

[INFO] 
[INFO] --- jetty-maven-plugin:9.2.12.v20150709:stop (stop-jetty) @ atlas-webapp ---
[INFO] Waiting 10 seconds for jetty to stop
[INFO] Stopped ServerConnector@b2526f2{HTTP/1.1}{0.0.0.0:31000}
[INFO] Closing Spring root WebApplicationContext
[INFO] Shutting down log4j
[INFO] Stopped o.e.j.m.p.JettyWebAppContext@6e3a0c41{/,<https://builds.apache.org/job/apache-atlas-UT/ws/webapp/target/atlas-webapp-0.9-SNAPSHOT/,UNAVAILABLE}{/home/jenkins/jenkins-slave/workspace/apache-atlas-UT/webapp/target/atlas-webapp-0.9-SNAPSHOT.war}>
[INFO] Server reports itself as stopped
[INFO] 
[INFO] --- maven-source-plugin:2.4:jar-no-fork (attach-sources) @ atlas-webapp ---
[INFO] Building jar: <https://builds.apache.org/job/apache-atlas-UT/ws/webapp/target/atlas-webapp-0.9-SNAPSHOT-sources.jar>
[INFO] 
[INFO] --- maven-source-plugin:2.4:test-jar-no-fork (attach-sources) @ atlas-webapp ---
[INFO] Building jar: <https://builds.apache.org/job/apache-atlas-UT/ws/webapp/target/atlas-webapp-0.9-SNAPSHOT-test-sources.jar>
[INFO] 
[INFO] --- maven-failsafe-plugin:2.19.1:verify (verify) @ atlas-webapp ---
[INFO] ------------------------------------------------------------------------
[INFO] Reactor Summary:
[INFO] 
[INFO] Apache Atlas Server Build Tools .................... SUCCESS [  0.976 s]
[INFO] apache-atlas ....................................... SUCCESS [  8.001 s]
[INFO] Apache Atlas Integration ........................... SUCCESS [ 39.905 s]
[INFO] Apache Atlas Common ................................ SUCCESS [ 17.106 s]
[INFO] Apache Atlas Typesystem ............................ SUCCESS [01:15 min]
[INFO] Apache Atlas Client ................................ SUCCESS [ 19.720 s]
[INFO] Apache Atlas Server API ............................ SUCCESS [ 10.321 s]
[INFO] Apache Atlas Notification .......................... SUCCESS [ 21.704 s]
[INFO] Apache Atlas Graph Database Projects ............... SUCCESS [  0.615 s]
[INFO] Apache Atlas Graph Database API .................... SUCCESS [  7.551 s]
[INFO] Graph Database Common Code ......................... SUCCESS [  7.415 s]
[INFO] Apache Atlas Titan 1.0.0 GraphDB Impl .............. SUCCESS [ 30.286 s]
[INFO] Shaded version of Apache hbase client .............. SUCCESS [  8.254 s]
[INFO] Apache Atlas Titan 0.5.4 Graph DB Impl ............. SUCCESS [01:19 min]
[INFO] Apache Atlas Graph Database Implementation Dependencies SUCCESS [  0.699 s]
[INFO] Shaded version of Apache hbase server .............. SUCCESS [ 22.910 s]
[INFO] Apache Atlas Repository ............................ SUCCESS [06:35 min]
[INFO] Apache Atlas Authorization ......................... SUCCESS [ 14.291 s]
[INFO] Apache Atlas Business Catalog ...................... SUCCESS [ 20.334 s]
[INFO] Apache Atlas UI .................................... SUCCESS [01:02 min]
[INFO] Apache Atlas Web Application ....................... FAILURE [09:06 min]
[INFO] Apache Atlas Documentation ......................... SKIPPED
[INFO] Apache Atlas FileSystem Model ...................... SKIPPED
[INFO] Apache Atlas Plugin Classloader .................... SKIPPED
[INFO] Apache Atlas Hive Bridge Shim ...................... SKIPPED
[INFO] Apache Atlas Hive Bridge ........................... SKIPPED
[INFO] Apache Atlas Falcon Bridge Shim .................... SKIPPED
[INFO] Apache Atlas Falcon Bridge ......................... SKIPPED
[INFO] Apache Atlas Sqoop Bridge Shim ..................... SKIPPED
[INFO] Apache Atlas Sqoop Bridge .......................... SKIPPED
[INFO] Apache Atlas Storm Bridge Shim ..................... SKIPPED
[INFO] Apache Atlas Storm Bridge .......................... SKIPPED
[INFO] Apache Atlas Distribution .......................... SKIPPED
[INFO] ------------------------------------------------------------------------
[INFO] BUILD FAILURE
[INFO] ------------------------------------------------------------------------
[INFO] Total time: 23:11 min
[INFO] Finished at: 2017-08-21T19:10:25Z
[INFO] Final Memory: 367M/2052M
[INFO] ------------------------------------------------------------------------
[ERROR] Failed to execute goal org.apache.maven.plugins:maven-failsafe-plugin:2.19.1:verify
(verify) on project atlas-webapp: There are test failures.
[ERROR] 
[ERROR] Please refer to <https://builds.apache.org/job/apache-atlas-UT/ws/webapp/target/failsafe-reports>
for the individual test results.
[ERROR] -> [Help 1]
[ERROR] 
[ERROR] To see the full stack trace of the errors, re-run Maven with the -e switch.
[ERROR] Re-run Maven using the -X switch to enable full debug logging.
[ERROR] 
[ERROR] For more information about the errors and possible solutions, please read the following
articles:
log4j:WARN No appenders could be found for logger (org.apache.zookeeper.ClientCnxn).
log4j:WARN Please initialize the log4j system properly.
[ERROR] [Help 1] http://cwiki.apache.org/confluence/display/MAVEN/MojoFailureException
log4j:WARN See http://logging.apache.org/log4j/1.2/faq.html#noconfig for more info.
[ERROR] 
[ERROR] After correcting the problems, you can resume the build with the command
[ERROR]   mvn <goals> -rf :atlas-webapp
Build step 'Execute shell' marked build as failure
[CHECKSTYLE] Collecting checkstyle analysis files...
[CHECKSTYLE] Searching for all files in <https://builds.apache.org/job/apache-atlas-UT/ws/>
that match the pattern **/target/checkstyle-result.xml
[CHECKSTYLE] Parsing 19 files in <https://builds.apache.org/job/apache-atlas-UT/ws/>
[CHECKSTYLE] Successfully parsed file <https://builds.apache.org/job/apache-atlas-UT/ws/authorization/target/checkstyle-result.xml>
with 467 unique warnings and 0 duplicates.
[CHECKSTYLE] Successfully parsed file <https://builds.apache.org/job/apache-atlas-UT/ws/catalog/target/checkstyle-result.xml>
with 2612 unique warnings and 0 duplicates.
[CHECKSTYLE] Successfully parsed file <https://builds.apache.org/job/apache-atlas-UT/ws/client/target/checkstyle-result.xml>
with 4249 unique warnings and 0 duplicates.
[CHECKSTYLE] Successfully parsed file <https://builds.apache.org/job/apache-atlas-UT/ws/common/target/checkstyle-result.xml>
with 5461 unique warnings and 0 duplicates.
[CHECKSTYLE] Successfully parsed file <https://builds.apache.org/job/apache-atlas-UT/ws/dashboardv2/target/checkstyle-result.xml>
with 5461 unique warnings and 0 duplicates.
[CHECKSTYLE] Successfully parsed file <https://builds.apache.org/job/apache-atlas-UT/ws/graphdb/api/target/checkstyle-result.xml>
with 5730 unique warnings and 0 duplicates.
[CHECKSTYLE] Successfully parsed file <https://builds.apache.org/job/apache-atlas-UT/ws/graphdb/common/target/checkstyle-result.xml>
with 5917 unique warnings and 0 duplicates.
[CHECKSTYLE] Successfully parsed file <https://builds.apache.org/job/apache-atlas-UT/ws/graphdb/graphdb-impls/target/checkstyle-result.xml>
with 5917 unique warnings and 0 duplicates.
[CHECKSTYLE] Successfully parsed file <https://builds.apache.org/job/apache-atlas-UT/ws/graphdb/target/checkstyle-result.xml>
with 5917 unique warnings and 0 duplicates.
[CHECKSTYLE] Successfully parsed file <https://builds.apache.org/job/apache-atlas-UT/ws/graphdb/titan0/target/checkstyle-result.xml>
with 8191 unique warnings and 0 duplicates.
[CHECKSTYLE] Successfully parsed file <https://builds.apache.org/job/apache-atlas-UT/ws/graphdb/titan1/target/checkstyle-result.xml>
with 9139 unique warnings and 0 duplicates.
[CHECKSTYLE] Successfully parsed file <https://builds.apache.org/job/apache-atlas-UT/ws/intg/target/checkstyle-result.xml>
with 16649 unique warnings and 0 duplicates.
[CHECKSTYLE] Successfully parsed file <https://builds.apache.org/job/apache-atlas-UT/ws/notification/target/checkstyle-result.xml>
with 17859 unique warnings and 0 duplicates.
[CHECKSTYLE] Successfully parsed file <https://builds.apache.org/job/apache-atlas-UT/ws/repository/target/checkstyle-result.xml>
with 37362 unique warnings and 0 duplicates.
[CHECKSTYLE] Successfully parsed file <https://builds.apache.org/job/apache-atlas-UT/ws/server-api/target/checkstyle-result.xml>
with 37741 unique warnings and 0 duplicates.
[CHECKSTYLE] Successfully parsed file <https://builds.apache.org/job/apache-atlas-UT/ws/shaded/hbase-client-shaded/target/checkstyle-result.xml>
with 37741 unique warnings and 0 duplicates.
[CHECKSTYLE] Successfully parsed file <https://builds.apache.org/job/apache-atlas-UT/ws/shaded/hbase-server-shaded/target/checkstyle-result.xml>
with 37741 unique warnings and 0 duplicates.
[CHECKSTYLE] Successfully parsed file <https://builds.apache.org/job/apache-atlas-UT/ws/target/checkstyle-result.xml>
with 37741 unique warnings and 0 duplicates.
[CHECKSTYLE] Successfully parsed file <https://builds.apache.org/job/apache-atlas-UT/ws/typesystem/target/checkstyle-result.xml>
with 41959 unique warnings and 0 duplicates.
<Git Blamer> Using GitBlamer to create author and commit information for all warnings.
<Git Blamer> GIT_COMMIT=1496257312abf06a471efc54c844634d7200b9dd, workspace=<https://builds.apache.org/job/apache-atlas-UT/ws/>
 > git rev-parse 1496257312abf06a471efc54c844634d7200b9dd^{commit} # timeout=10
[FINDBUGS] Collecting findbugs analysis files...
[FINDBUGS] Searching for all files in <https://builds.apache.org/job/apache-atlas-UT/ws/>
that match the pattern **/target/findbugs.xml
[FINDBUGS] Parsing 12 files in <https://builds.apache.org/job/apache-atlas-UT/ws/>
[FINDBUGS] Successfully parsed file <https://builds.apache.org/job/apache-atlas-UT/ws/authorization/target/findbugs.xml>
with 0 unique warnings and 0 duplicates.
[FINDBUGS] Successfully parsed file <https://builds.apache.org/job/apache-atlas-UT/ws/catalog/target/findbugs.xml>
with 0 unique warnings and 0 duplicates.
[FINDBUGS] Successfully parsed file <https://builds.apache.org/job/apache-atlas-UT/ws/client/target/findbugs.xml>
with 0 unique warnings and 0 duplicates.
[FINDBUGS] Successfully parsed file <https://builds.apache.org/job/apache-atlas-UT/ws/common/target/findbugs.xml>
with 0 unique warnings and 0 duplicates.
[FINDBUGS] Successfully parsed file <https://builds.apache.org/job/apache-atlas-UT/ws/graphdb/api/target/findbugs.xml>
with 0 unique warnings and 0 duplicates.
[FINDBUGS] Successfully parsed file <https://builds.apache.org/job/apache-atlas-UT/ws/graphdb/common/target/findbugs.xml>
with 0 unique warnings and 0 duplicates.
[FINDBUGS] Successfully parsed file <https://builds.apache.org/job/apache-atlas-UT/ws/graphdb/titan0/target/findbugs.xml>
with 0 unique warnings and 0 duplicates.
[FINDBUGS] Successfully parsed file <https://builds.apache.org/job/apache-atlas-UT/ws/intg/target/findbugs.xml>
with 0 unique warnings and 0 duplicates.
[FINDBUGS] Successfully parsed file <https://builds.apache.org/job/apache-atlas-UT/ws/notification/target/findbugs.xml>
with 0 unique warnings and 0 duplicates.
[FINDBUGS] Successfully parsed file <https://builds.apache.org/job/apache-atlas-UT/ws/repository/target/findbugs.xml>
with 0 unique warnings and 0 duplicates.
[FINDBUGS] Successfully parsed file <https://builds.apache.org/job/apache-atlas-UT/ws/server-api/target/findbugs.xml>
with 0 unique warnings and 0 duplicates.
[FINDBUGS] Successfully parsed file <https://builds.apache.org/job/apache-atlas-UT/ws/typesystem/target/findbugs.xml>
with 0 unique warnings and 0 duplicates.
<Git Blamer> Using GitBlamer to create author and commit information for all warnings.
<Git Blamer> GIT_COMMIT=1496257312abf06a471efc54c844634d7200b9dd, workspace=<https://builds.apache.org/job/apache-atlas-UT/ws/>
Archiving artifacts
[Fast Archiver] No prior successful build to compare, so performing full copy of artifacts
TestNG Reports Processing: START
Looking for TestNG results report in workspace using pattern: **/target/surefire-reports/testng-results.xml,**/target/failsafe-reports/testng-results.xml
Saving reports...
Processing '/x1/jenkins/jenkins-home/jobs/apache-atlas-UT/builds/3/testng/testng-results-1.xml'
Processing '/x1/jenkins/jenkins-home/jobs/apache-atlas-UT/builds/3/testng/testng-results-10.xml'
Processing '/x1/jenkins/jenkins-home/jobs/apache-atlas-UT/builds/3/testng/testng-results-2.xml'
Processing '/x1/jenkins/jenkins-home/jobs/apache-atlas-UT/builds/3/testng/testng-results-3.xml'
Processing '/x1/jenkins/jenkins-home/jobs/apache-atlas-UT/builds/3/testng/testng-results-4.xml'
Processing '/x1/jenkins/jenkins-home/jobs/apache-atlas-UT/builds/3/testng/testng-results-5.xml'
Processing '/x1/jenkins/jenkins-home/jobs/apache-atlas-UT/builds/3/testng/testng-results-6.xml'
Processing '/x1/jenkins/jenkins-home/jobs/apache-atlas-UT/builds/3/testng/testng-results-7.xml'
Processing '/x1/jenkins/jenkins-home/jobs/apache-atlas-UT/builds/3/testng/testng-results-8.xml'
Processing '/x1/jenkins/jenkins-home/jobs/apache-atlas-UT/builds/3/testng/testng-results-9.xml'
Processing '/x1/jenkins/jenkins-home/jobs/apache-atlas-UT/builds/3/testng/testng-results.xml'
0.753296% of tests failed, which exceeded threshold of 0%. Marking build as UNSTABLE
TestNG Reports Processing: FINISH

Mime
View raw message