atlas-dev mailing list archives

Site index · List index
Message view « Date » · « Thread »
Top « Date » · « Thread »
From Apache Jenkins Server <jenk...@builds.apache.org>
Subject Build failed in Jenkins: Atlas-master-IntegrationTests #50
Date Wed, 30 Aug 2017 18:19:39 GMT
See <https://builds.apache.org/job/Atlas-master-IntegrationTests/50/display/redirect>

------------------------------------------
[...truncated 36.95 MB...]
2017-08-30 18:14:37,118 DEBUG - [NotificationHookConsumer thread-0:] ~ Retrieving entities
with guids=[df74c1bb-c714-4612-b4bf-a8e65b088143] (GraphBackedMetadataRepository:179)
2017-08-30 18:14:37,118 DEBUG - [NotificationHookConsumer thread-0:] ~ Retrieving entities
with guids=[26e466c8-d9b3-400b-bd54-ebaede868496] (GraphBackedMetadataRepository:179)
2017-08-30 18:14:37,118 DEBUG - [NotificationHookConsumer thread-0:] ~ Retrieving entities
with guids=[b509daa7-9ad5-4533-98f1-5e18abf612cd] (GraphBackedMetadataRepository:179)
2017-08-30 18:14:37,154 DEBUG - [NotificationHookConsumer thread-0:] ~ Sending message for
topic ATLAS_ENTITIES: {"version":{"version":"1.0.0"},"message":{"entity":{"jsonClass":"org.apache.atlas.typesystem.json.InstanceSerialization$_Reference","id":{"jsonClass":"org.apache.atlas.typesystem.json.InstanceSerialization$_Id","id":"5957c51d-7ae1-46fe-891c-c4389e70122a","version":0,"typeName":"hive_table","state":"DELETED"},"typeName":"hive_table","values":{"tableType":"EXTERNAL_TABLE","name":"tablev4gkzts5oc","createTime":"2017-08-30T18:12:45.000Z","temporary":false,"db":{"jsonClass":"org.apache.atlas.typesystem.json.InstanceSerialization$_Id","id":"3e2cbe67-ffe6-4794-a4e6-f661b946b714","version":0,"typeName":"hive_db","state":"ACTIVE"},"retention":0,"qualifiedName":"default.tablev4gkzts5oc@primary","columns":[{"jsonClass":"org.apache.atlas.typesystem.json.InstanceSerialization$_Reference","id":{"jsonClass":"org.apache.atlas.typesystem.json.InstanceSerialization$_Id","id":"b509daa7-9ad5-4533-98f1-5e18abf612cd","version":0,"typeName":"hive_column","state":"DELETED"},"typeName":"hive_column","values":{"name":"id","qualifiedName":"default.tablev4gkzts5oc.id@primary","position":0,"owner":"jenkins","type":"int","table":{"jsonClass":"org.apache.atlas.typesystem.json.InstanceSerialization$_Id","id":"5957c51d-7ae1-46fe-891c-c4389e70122a","version":0,"typeName":"hive_table","state":"DELETED"}},"traitNames":[],"traits":{},"systemAttributes":{"createdBy":"jenkins","modifiedBy":"jenkins","createdTime":"2017-08-30T18:14:29.639Z","modifiedTime":"2017-08-30T18:14:36.196Z"}},{"jsonClass":"org.apache.atlas.typesystem.json.InstanceSerialization$_Reference","id":{"jsonClass":"org.apache.atlas.typesystem.json.InstanceSerialization$_Id","id":"26e466c8-d9b3-400b-bd54-ebaede868496","version":0,"typeName":"hive_column","state":"DELETED"},"typeName":"hive_column","values":{"name":"name","qualifiedName":"default.tablev4gkzts5oc.name@primary","position":1,"owner":"jenkins","type":"string","table":{"jsonClass":"org.apache.atlas.typesystem.json.InstanceSerialization$_Id","id":"5957c51d-7ae1-46fe-891c-c4389e70122a","version":0,"typeName":"hive_table","state":"DELETED"}},"traitNames":[],"traits":{},"systemAttributes":{"createdBy":"jenkins","modifiedBy":"jenkins","createdTime":"2017-08-30T18:14:29.639Z","modifiedTime":"2017-08-30T18:14:36.196Z"}}],"comment":"table
comment","lastAccessTime":"2017-08-30T18:12:45.000Z","owner":"jenkins","sd":{"jsonClass":"org.apache.atlas.typesystem.json.InstanceSerialization$_Reference","id":{"jsonClass":"org.apache.atlas.typesystem.json.InstanceSerialization$_Id","id":"df74c1bb-c714-4612-b4bf-a8e65b088143","version":0,"typeName":"hive_storagedesc","state":"DELETED"},"typeName":"hive_storagedesc","values":{"location":"p<https://builds.apache.org/job/Atlas-master-IntegrationTests/ws/addons/hive-bridge/target/someTestPath-data-vQ3GvjeVed","serdeInfo">:{"jsonClass":"org.apache.atlas.typesystem.json.InstanceSerialization$_Struct","typeName":"hive_serde","values":{"serializationLib":"org.apache.hadoop.hive.serde2.lazy.LazySimpleSerDe","parameters":{"serialization.format":"1"}}},"qualifiedName":"default.tablev4gkzts5oc@primary_storage","outputFormat":"org.apache.hadoop.hive.ql.io.HiveIgnoreKeyTextOutputFormat","compressed":false,"numBuckets":-1,"inputFormat":"org.apache.hadoop.mapred.TextInputFormat","storedAsSubDirectories":false,"table":{"jsonClass":"org.apache.atlas.typesystem.json.InstanceSerialization$_Id","id":"5957c51d-7ae1-46fe-891c-c4389e70122a","version":0,"typeName":"hive_table","state":"DELETED"}},"traitNames":[],"traits":{},"systemAttributes":{"createdBy":"jenkins","modifiedBy":"jenkins","createdTime":"2017-08-30T18:14:29.639Z","modifiedTime":"2017-08-30T18:14:36.196Z"}},"parameters":{"comment":"table
comment","EXTERNAL":"TRUE","transient_lastDdlTime":"1504116765"},"partitionKeys":[{"jsonClass":"org.apache.atlas.typesystem.json.InstanceSerialization$_Reference","id":{"jsonClass":"org.apache.atlas.typesystem.json.InstanceSerialization$_Id","id":"bfeba4f6-ddd5-4eb2-81f5-597843d36495","version":0,"typeName":"hive_column","state":"DELETED"},"typeName":"hive_column","values":{"name":"dt","qualifiedName":"default.tablev4gkzts5oc.dt@primary","position":0,"owner":"jenkins","type":"string","table":{"jsonClass":"org.apache.atlas.typesystem.json.InstanceSerialization$_Id","id":"5957c51d-7ae1-46fe-891c-c4389e70122a","version":0,"typeName":"hive_table","state":"DELETED"}},"traitNames":[],"traits":{},"systemAttributes":{"createdBy":"jenkins","modifiedBy":"jenkins","createdTime":"2017-08-30T18:14:29.639Z","modifiedTime":"2017-08-30T18:14:36.196Z"}}]},"traitNames":[],"traits":{},"systemAttributes":{}},"operationType":"ENTITY_DELETE","traits":[]}}
(KafkaNotification:218)
2017-08-30 18:14:37,155 DEBUG - [NotificationHookConsumer thread-0:] ~ Sending message for
topic ATLAS_ENTITIES: {"version":{"version":"1.0.0"},"message":{"entity":{"jsonClass":"org.apache.atlas.typesystem.json.InstanceSerialization$_Reference","id":{"jsonClass":"org.apache.atlas.typesystem.json.InstanceSerialization$_Id","id":"bfeba4f6-ddd5-4eb2-81f5-597843d36495","version":0,"typeName":"hive_column","state":"DELETED"},"typeName":"hive_column","values":{"name":"dt","qualifiedName":"default.tablev4gkzts5oc.dt@primary","position":0,"owner":"jenkins","type":"string","table":{"jsonClass":"org.apache.atlas.typesystem.json.InstanceSerialization$_Id","id":"5957c51d-7ae1-46fe-891c-c4389e70122a","version":0,"typeName":"hive_table","state":"DELETED"}},"traitNames":[],"traits":{},"systemAttributes":{}},"operationType":"ENTITY_DELETE","traits":[]}}
(KafkaNotification:218)
2017-08-30 18:14:37,156 DEBUG - [NotificationHookConsumer thread-0:] ~ Sending message for
topic ATLAS_ENTITIES: {"version":{"version":"1.0.0"},"message":{"entity":{"jsonClass":"org.apache.atlas.typesystem.json.InstanceSerialization$_Reference","id":{"jsonClass":"org.apache.atlas.typesystem.json.InstanceSerialization$_Id","id":"df74c1bb-c714-4612-b4bf-a8e65b088143","version":0,"typeName":"hive_storagedesc","state":"DELETED"},"typeName":"hive_storagedesc","values":{"location":"p<https://builds.apache.org/job/Atlas-master-IntegrationTests/ws/addons/hive-bridge/target/someTestPath-data-vQ3GvjeVed","serdeInfo">:{"jsonClass":"org.apache.atlas.typesystem.json.InstanceSerialization$_Struct","typeName":"hive_serde","values":{"serializationLib":"org.apache.hadoop.hive.serde2.lazy.LazySimpleSerDe","parameters":{"serialization.format":"1"}}},"qualifiedName":"default.tablev4gkzts5oc@primary_storage","outputFormat":"org.apache.hadoop.hive.ql.io.HiveIgnoreKeyTextOutputFormat","compressed":false,"numBuckets":-1,"inputFormat":"org.apache.hadoop.mapred.TextInputFormat","storedAsSubDirectories":false,"table":{"jsonClass":"org.apache.atlas.typesystem.json.InstanceSerialization$_Id","id":"5957c51d-7ae1-46fe-891c-c4389e70122a","version":0,"typeName":"hive_table","state":"DELETED"}},"traitNames":[],"traits":{},"systemAttributes":{}},"operationType":"ENTITY_DELETE","traits":[]}}
(KafkaNotification:218)
2017-08-30 18:14:37,156 DEBUG - [NotificationHookConsumer thread-0:] ~ Sending message for
topic ATLAS_ENTITIES: {"version":{"version":"1.0.0"},"message":{"entity":{"jsonClass":"org.apache.atlas.typesystem.json.InstanceSerialization$_Reference","id":{"jsonClass":"org.apache.atlas.typesystem.json.InstanceSerialization$_Id","id":"26e466c8-d9b3-400b-bd54-ebaede868496","version":0,"typeName":"hive_column","state":"DELETED"},"typeName":"hive_column","values":{"name":"name","qualifiedName":"default.tablev4gkzts5oc.name@primary","position":1,"owner":"jenkins","type":"string","table":{"jsonClass":"org.apache.atlas.typesystem.json.InstanceSerialization$_Id","id":"5957c51d-7ae1-46fe-891c-c4389e70122a","version":0,"typeName":"hive_table","state":"DELETED"}},"traitNames":[],"traits":{},"systemAttributes":{}},"operationType":"ENTITY_DELETE","traits":[]}}
(KafkaNotification:218)
2017-08-30 18:14:37,157 DEBUG - [NotificationHookConsumer thread-0:] ~ Sending message for
topic ATLAS_ENTITIES: {"version":{"version":"1.0.0"},"message":{"entity":{"jsonClass":"org.apache.atlas.typesystem.json.InstanceSerialization$_Reference","id":{"jsonClass":"org.apache.atlas.typesystem.json.InstanceSerialization$_Id","id":"b509daa7-9ad5-4533-98f1-5e18abf612cd","version":0,"typeName":"hive_column","state":"DELETED"},"typeName":"hive_column","values":{"name":"id","qualifiedName":"default.tablev4gkzts5oc.id@primary","position":0,"owner":"jenkins","type":"int","table":{"jsonClass":"org.apache.atlas.typesystem.json.InstanceSerialization$_Id","id":"5957c51d-7ae1-46fe-891c-c4389e70122a","version":0,"typeName":"hive_table","state":"DELETED"}},"traitNames":[],"traits":{},"systemAttributes":{}},"operationType":"ENTITY_DELETE","traits":[]}}
(KafkaNotification:218)
2017-08-30 18:14:39,137 INFO  - [ShutdownMonitor:] ~ Stopping service org.apache.atlas.notification.NotificationHookConsumer
(Services:65)
2017-08-30 18:14:39,138 INFO  - [ShutdownMonitor:] ~ ==> stopConsumerThreads() (NotificationHookConsumer:175)
2017-08-30 18:14:39,138 INFO  - [ShutdownMonitor:] ~ ==> HookConsumer shutdown() (NotificationHookConsumer$HookConsumer:423)
2017-08-30 18:14:39,138 INFO  - [ShutdownMonitor:] ~ [atlas-hook-consumer-thread], Shutting
down (Logging$class:68)
2017-08-30 18:14:39,823 DEBUG - [main-SendThread(localhost:19026):] ~ ==> InMemoryJAASConfiguration.getAppConfigurationEntry(Client)
(InMemoryJAASConfiguration:208)
2017-08-30 18:14:39,823 DEBUG - [main-SendThread(localhost:19026):] ~ <== InMemoryJAASConfiguration.getAppConfigurationEntry(Client):
{} (InMemoryJAASConfiguration:238)
2017-08-30 18:14:39,824 WARN  - [main-SendThread(localhost:19026):] ~ Session 0x15e34550a190002
for server null, unexpected error, closing socket connection and attempting reconnect (ClientCnxn$SendThread:1102)
java.net.ConnectException: Connection refused
	at sun.nio.ch.SocketChannelImpl.checkConnect(Native Method)
	at sun.nio.ch.SocketChannelImpl.finishConnect(SocketChannelImpl.java:744)
	at org.apache.zookeeper.ClientCnxnSocketNIO.doTransport(ClientCnxnSocketNIO.java:361)
	at org.apache.zookeeper.ClientCnxn$SendThread.run(ClientCnxn.java:1081)
2017-08-30 18:14:39,991 DEBUG - [Curator-Framework-0-SendThread(localhost:19026):] ~ ==>
InMemoryJAASConfiguration.getAppConfigurationEntry(Client) (InMemoryJAASConfiguration:208)
2017-08-30 18:14:39,991 DEBUG - [Curator-Framework-0-SendThread(localhost:19026):] ~ <==
InMemoryJAASConfiguration.getAppConfigurationEntry(Client): {} (InMemoryJAASConfiguration:238)
2017-08-30 18:14:41,086 DEBUG - [main-SendThread(localhost:19026):] ~ ==> InMemoryJAASConfiguration.getAppConfigurationEntry(Client)
(InMemoryJAASConfiguration:208)
2017-08-30 18:14:41,087 DEBUG - [main-SendThread(localhost:19026):] ~ <== InMemoryJAASConfiguration.getAppConfigurationEntry(Client):
{} (InMemoryJAASConfiguration:238)
2017-08-30 18:14:41,087 WARN  - [main-SendThread(localhost:19026):] ~ Session 0x15e34550a190002
for server null, unexpected error, closing socket connection and attempting reconnect (ClientCnxn$SendThread:1102)
java.net.ConnectException: Connection refused
	at sun.nio.ch.SocketChannelImpl.checkConnect(Native Method)
	at sun.nio.ch.SocketChannelImpl.finishConnect(SocketChannelImpl.java:744)
	at org.apache.zookeeper.ClientCnxnSocketNIO.doTransport(ClientCnxnSocketNIO.java:361)
	at org.apache.zookeeper.ClientCnxn$SendThread.run(ClientCnxn.java:1081)
2017-08-30 18:14:41,881 DEBUG - [main-SendThread(localhost:19026):] ~ ==> InMemoryJAASConfiguration.getAppConfigurationEntry(Client)
(InMemoryJAASConfiguration:208)
2017-08-30 18:14:41,881 DEBUG - [main-SendThread(localhost:19026):] ~ <== InMemoryJAASConfiguration.getAppConfigurationEntry(Client):
{} (InMemoryJAASConfiguration:238)
2017-08-30 18:14:41,882 WARN  - [main-SendThread(localhost:19026):] ~ Session 0x15e34550a190002
for server null, unexpected error, closing socket connection and attempting reconnect (ClientCnxn$SendThread:1102)
java.net.ConnectException: Connection refused
	at sun.nio.ch.SocketChannelImpl.checkConnect(Native Method)
	at sun.nio.ch.SocketChannelImpl.finishConnect(SocketChannelImpl.java:744)
	at org.apache.zookeeper.ClientCnxnSocketNIO.doTransport(ClientCnxnSocketNIO.java:361)
	at org.apache.zookeeper.ClientCnxn$SendThread.run(ClientCnxn.java:1081)
2017-08-30 18:14:41,958 DEBUG - [Curator-Framework-0-SendThread(localhost:19026):] ~ ==>
InMemoryJAASConfiguration.getAppConfigurationEntry(Client) (InMemoryJAASConfiguration:208)
2017-08-30 18:14:41,958 DEBUG - [Curator-Framework-0-SendThread(localhost:19026):] ~ <==
InMemoryJAASConfiguration.getAppConfigurationEntry(Client): {} (InMemoryJAASConfiguration:238)
2017-08-30 18:14:42,186 DEBUG - [Curator-Framework-0-SendThread(localhost:19026):] ~ ==>
InMemoryJAASConfiguration.getAppConfigurationEntry(Client) (InMemoryJAASConfiguration:208)
2017-08-30 18:14:42,187 DEBUG - [Curator-Framework-0-SendThread(localhost:19026):] ~ <==
InMemoryJAASConfiguration.getAppConfigurationEntry(Client): {} (InMemoryJAASConfiguration:238)
2017-08-30 18:14:43,798 DEBUG - [main-SendThread(localhost:19026):] ~ ==> InMemoryJAASConfiguration.getAppConfigurationEntry(Client)
(InMemoryJAASConfiguration:208)
2017-08-30 18:14:43,799 DEBUG - [main-SendThread(localhost:19026):] ~ <== InMemoryJAASConfiguration.getAppConfigurationEntry(Client):
{} (InMemoryJAASConfiguration:238)
2017-08-30 18:14:43,799 WARN  - [main-SendThread(localhost:19026):] ~ Session 0x15e34550a190002
for server null, unexpected error, closing socket connection and attempting reconnect (ClientCnxn$SendThread:1102)
java.net.ConnectException: Connection refused
	at sun.nio.ch.SocketChannelImpl.checkConnect(Native Method)
	at sun.nio.ch.SocketChannelImpl.finishConnect(SocketChannelImpl.java:744)
	at org.apache.zookeeper.ClientCnxnSocketNIO.doTransport(ClientCnxnSocketNIO.java:361)
	at org.apache.zookeeper.ClientCnxn$SendThread.run(ClientCnxn.java:1081)
2017-08-30 18:14:44,150 DEBUG - [Curator-Framework-0-SendThread(localhost:19026):] ~ ==>
InMemoryJAASConfiguration.getAppConfigurationEntry(Client) (InMemoryJAASConfiguration:208)
2017-08-30 18:14:44,151 DEBUG - [Curator-Framework-0-SendThread(localhost:19026):] ~ <==
InMemoryJAASConfiguration.getAppConfigurationEntry(Client): {} (InMemoryJAASConfiguration:238)
2017-08-30 18:14:44,400 DEBUG - [Curator-Framework-0-SendThread(localhost:19026):] ~ ==>
InMemoryJAASConfiguration.getAppConfigurationEntry(Client) (InMemoryJAASConfiguration:208)
2017-08-30 18:14:44,400 DEBUG - [Curator-Framework-0-SendThread(localhost:19026):] ~ <==
InMemoryJAASConfiguration.getAppConfigurationEntry(Client): {} (InMemoryJAASConfiguration:238)
2017-08-30 18:14:44,507 DEBUG - [main-SendThread(localhost:19026):] ~ ==> InMemoryJAASConfiguration.getAppConfigurationEntry(Client)
(InMemoryJAASConfiguration:208)
2017-08-30 18:14:44,507 DEBUG - [main-SendThread(localhost:19026):] ~ <== InMemoryJAASConfiguration.getAppConfigurationEntry(Client):
{} (InMemoryJAASConfiguration:238)
2017-08-30 18:14:44,508 WARN  - [main-SendThread(localhost:19026):] ~ Session 0x15e34550a190002
for server null, unexpected error, closing socket connection and attempting reconnect (ClientCnxn$SendThread:1102)
java.net.ConnectException: Connection refused
	at sun.nio.ch.SocketChannelImpl.checkConnect(Native Method)
	at sun.nio.ch.SocketChannelImpl.finishConnect(SocketChannelImpl.java:744)
	at org.apache.zookeeper.ClientCnxnSocketNIO.doTransport(ClientCnxnSocketNIO.java:361)
	at org.apache.zookeeper.ClientCnxn$SendThread.run(ClientCnxn.java:1081)
2017-08-30 18:14:46,062 DEBUG - [main-SendThread(localhost:19026):] ~ ==> InMemoryJAASConfiguration.getAppConfigurationEntry(Client)
(InMemoryJAASConfiguration:208)
2017-08-30 18:14:46,063 DEBUG - [main-SendThread(localhost:19026):] ~ <== InMemoryJAASConfiguration.getAppConfigurationEntry(Client):
{} (InMemoryJAASConfiguration:238)
2017-08-30 18:14:46,063 WARN  - [main-SendThread(localhost:19026):] ~ Session 0x15e34550a190002
for server null, unexpected error, closing socket connection and attempting reconnect (ClientCnxn$SendThread:1102)
java.net.ConnectException: Connection refused
	at sun.nio.ch.SocketChannelImpl.checkConnect(Native Method)
	at sun.nio.ch.SocketChannelImpl.finishConnect(SocketChannelImpl.java:744)
	at org.apache.zookeeper.ClientCnxnSocketNIO.doTransport(ClientCnxnSocketNIO.java:361)
	at org.apache.zookeeper.ClientCnxn$SendThread.run(ClientCnxn.java:1081)
2017-08-30 18:14:46,092 DEBUG - [Curator-Framework-0-SendThread(localhost:19026):] ~ ==>
InMemoryJAASConfiguration.getAppConfigurationEntry(Client) (InMemoryJAASConfiguration:208)
2017-08-30 18:14:46,093 DEBUG - [Curator-Framework-0-SendThread(localhost:19026):] ~ <==
InMemoryJAASConfiguration.getAppConfigurationEntry(Client): {} (InMemoryJAASConfiguration:238)
2017-08-30 18:14:46,277 DEBUG - [main-SendThread(localhost:19026):] ~ ==> InMemoryJAASConfiguration.getAppConfigurationEntry(Client)
(InMemoryJAASConfiguration:208)
2017-08-30 18:14:46,278 DEBUG - [main-SendThread(localhost:19026):] ~ <== InMemoryJAASConfiguration.getAppConfigurationEntry(Client):
{} (InMemoryJAASConfiguration:238)
2017-08-30 18:14:46,278 WARN  - [main-SendThread(localhost:19026):] ~ Session 0x15e34550a190002
for server null, unexpected error, closing socket connection and attempting reconnect (ClientCnxn$SendThread:1102)
java.net.ConnectException: Connection refused
	at sun.nio.ch.SocketChannelImpl.checkConnect(Native Method)
	at sun.nio.ch.SocketChannelImpl.finishConnect(SocketChannelImpl.java:744)
	at org.apache.zookeeper.ClientCnxnSocketNIO.doTransport(ClientCnxnSocketNIO.java:361)
	at org.apache.zookeeper.ClientCnxn$SendThread.run(ClientCnxn.java:1081)
[ERROR] 
java.net.SocketTimeoutException: Read timed out
	at java.net.SocketInputStream.socketRead0(Native Method)
	at java.net.SocketInputStream.read(SocketInputStream.java:152)
	at java.net.SocketInputStream.read(SocketInputStream.java:122)
	at sun.nio.cs.StreamDecoder.readBytes(StreamDecoder.java:283)
	at sun.nio.cs.StreamDecoder.implRead(StreamDecoder.java:325)
	at sun.nio.cs.StreamDecoder.read(StreamDecoder.java:177)
	at java.io.InputStreamReader.read(InputStreamReader.java:184)
	at java.io.BufferedReader.fill(BufferedReader.java:154)
	at java.io.BufferedReader.readLine(BufferedReader.java:317)
	at java.io.LineNumberReader.readLine(LineNumberReader.java:199)
	at org.eclipse.jetty.maven.plugin.JettyStopMojo.execute(JettyStopMojo.java:100)
	at org.apache.maven.plugin.DefaultBuildPluginManager.executeMojo(DefaultBuildPluginManager.java:134)
	at org.apache.maven.lifecycle.internal.MojoExecutor.execute(MojoExecutor.java:208)
	at org.apache.maven.lifecycle.internal.MojoExecutor.execute(MojoExecutor.java:154)
	at org.apache.maven.lifecycle.internal.MojoExecutor.execute(MojoExecutor.java:146)
	at org.apache.maven.lifecycle.internal.LifecycleModuleBuilder.buildProject(LifecycleModuleBuilder.java:117)
	at org.apache.maven.lifecycle.internal.LifecycleModuleBuilder.buildProject(LifecycleModuleBuilder.java:81)
	at org.apache.maven.lifecycle.internal.builder.singlethreaded.SingleThreadedBuilder.build(SingleThreadedBuilder.java:51)
	at org.apache.maven.lifecycle.internal.LifecycleStarter.execute(LifecycleStarter.java:128)
	at org.apache.maven.DefaultMaven.doExecute(DefaultMaven.java:309)
	at org.apache.maven.DefaultMaven.doExecute(DefaultMaven.java:194)
	at org.apache.maven.DefaultMaven.execute(DefaultMaven.java:107)
	at org.apache.maven.cli.MavenCli.execute(MavenCli.java:993)
	at org.apache.maven.cli.MavenCli.doMain(MavenCli.java:345)
	at org.apache.maven.cli.MavenCli.main(MavenCli.java:191)
	at sun.reflect.NativeMethodAccessorImpl.invoke0(Native Method)
	at sun.reflect.NativeMethodAccessorImpl.invoke(NativeMethodAccessorImpl.java:57)
	at sun.reflect.DelegatingMethodAccessorImpl.invoke(DelegatingMethodAccessorImpl.java:43)
	at java.lang.reflect.Method.invoke(Method.java:606)
	at org.codehaus.plexus.classworlds.launcher.Launcher.launchEnhanced(Launcher.java:289)
	at org.codehaus.plexus.classworlds.launcher.Launcher.launch(Launcher.java:229)
	at org.codehaus.plexus.classworlds.launcher.Launcher.mainWithExitCode(Launcher.java:415)
	at org.codehaus.plexus.classworlds.launcher.Launcher.main(Launcher.java:356)
[INFO] 
[INFO] --- maven-source-plugin:2.4:jar-no-fork (attach-sources) @ hive-bridge ---
[INFO] Building jar: <https://builds.apache.org/job/Atlas-master-IntegrationTests/ws/addons/hive-bridge/target/hive-bridge-0.9-SNAPSHOT-sources.jar>
[INFO] 
[INFO] --- maven-source-plugin:2.4:test-jar-no-fork (attach-sources) @ hive-bridge ---
[INFO] Building jar: <https://builds.apache.org/job/Atlas-master-IntegrationTests/ws/addons/hive-bridge/target/hive-bridge-0.9-SNAPSHOT-test-sources.jar>
[INFO] 
[INFO] --- maven-failsafe-plugin:2.19.1:verify (verify) @ hive-bridge ---
[INFO] ------------------------------------------------------------------------
[INFO] Reactor Summary:
[INFO] 
[INFO] Apache Atlas Server Build Tools .................... SUCCESS [  0.971 s]
[INFO] apache-atlas ....................................... SUCCESS [  6.400 s]
[INFO] Apache Atlas Integration ........................... SUCCESS [ 28.910 s]
[INFO] Apache Atlas Common ................................ SUCCESS [ 14.045 s]
[INFO] Apache Atlas Typesystem ............................ SUCCESS [01:05 min]
[INFO] Apache Atlas Client ................................ SUCCESS [ 17.117 s]
[INFO] Apache Atlas Server API ............................ SUCCESS [  9.401 s]
[INFO] Apache Atlas Notification .......................... SUCCESS [ 15.903 s]
[INFO] Apache Atlas Graph Database Projects ............... SUCCESS [  0.585 s]
[INFO] Apache Atlas Graph Database API .................... SUCCESS [  7.518 s]
[INFO] Graph Database Common Code ......................... SUCCESS [  7.693 s]
[INFO] Apache Atlas Titan 1.0.0 GraphDB Impl .............. SUCCESS [ 33.844 s]
[INFO] Shaded version of Apache hbase client .............. SUCCESS [  8.728 s]
[INFO] Apache Atlas Titan 0.5.4 Graph DB Impl ............. SUCCESS [ 43.521 s]
[INFO] Apache Atlas Graph Database Implementation Dependencies SUCCESS [  0.711 s]
[INFO] Shaded version of Apache hbase server .............. SUCCESS [ 23.961 s]
[INFO] Apache Atlas Repository ............................ SUCCESS [01:46 min]
[INFO] Apache Atlas Authorization ......................... SUCCESS [ 10.550 s]
[INFO] Apache Atlas Business Catalog ...................... SUCCESS [ 16.024 s]
[INFO] Apache Atlas UI .................................... SUCCESS [01:33 min]
[INFO] Apache Atlas Web Application ....................... SUCCESS [05:32 min]
[INFO] Apache Atlas Documentation ......................... SUCCESS [ 22.380 s]
[INFO] Apache Atlas FileSystem Model ...................... SUCCESS [  2.712 s]
[INFO] Apache Atlas Plugin Classloader .................... SUCCESS [  9.798 s]
[INFO] Apache Atlas Hive Bridge Shim ...................... SUCCESS [  8.820 s]
[INFO] Apache Atlas Hive Bridge ........................... FAILURE [08:33 min]
[INFO] Apache Atlas Falcon Bridge Shim .................... SKIPPED
[INFO] Apache Atlas Falcon Bridge ......................... SKIPPED
[INFO] Apache Atlas Sqoop Bridge Shim ..................... SKIPPED
[INFO] Apache Atlas Sqoop Bridge .......................... SKIPPED
[INFO] Apache Atlas Storm Bridge Shim ..................... SKIPPED
[INFO] Apache Atlas Storm Bridge .......................... SKIPPED
[INFO] Apache Atlas Distribution .......................... SKIPPED
[INFO] ------------------------------------------------------------------------
[INFO] BUILD FAILURE
[INFO] ------------------------------------------------------------------------
[INFO] Total time: 23:23 min
[INFO] Finished at: 2017-08-30T18:14:46Z
[INFO] Final Memory: 582M/2041M
[INFO] ------------------------------------------------------------------------
2017-08-30 18:14:48,159 DEBUG - [main-SendThread(localhost:19026):] ~ ==> InMemoryJAASConfiguration.getAppConfigurationEntry(Client)
(InMemoryJAASConfiguration:208)
2017-08-30 18:14:48,160 DEBUG - [main-SendThread(localhost:19026):] ~ <== InMemoryJAASConfiguration.getAppConfigurationEntry(Client):
{} (InMemoryJAASConfiguration:238)
2017-08-30 18:14:48,160 WARN  - [main-SendThread(localhost:19026):] ~ Session 0x15e34550a190002
for server null, unexpected error, closing socket connection and attempting reconnect (ClientCnxn$SendThread:1102)
java.net.ConnectException: Connection refused
	at sun.nio.ch.SocketChannelImpl.checkConnect(Native Method)
	at sun.nio.ch.SocketChannelImpl.finishConnect(SocketChannelImpl.java:744)
	at org.apache.zookeeper.ClientCnxnSocketNIO.doTransport(ClientCnxnSocketNIO.java:361)
	at org.apache.zookeeper.ClientCnxn$SendThread.run(ClientCnxn.java:1081)
2017-08-30 18:14:48,161 DEBUG - [Curator-Framework-0-SendThread(localhost:19026):] ~ ==>
InMemoryJAASConfiguration.getAppConfigurationEntry(Client) (InMemoryJAASConfiguration:208)
2017-08-30 18:14:48,161 DEBUG - [Curator-Framework-0-SendThread(localhost:19026):] ~ <==
InMemoryJAASConfiguration.getAppConfigurationEntry(Client): {} (InMemoryJAASConfiguration:238)
[ERROR] Failed to execute goal org.apache.maven.plugins:maven-failsafe-plugin:2.19.1:verify
(verify) on project hive-bridge: There are test failures.
[ERROR] 
[ERROR] Please refer to <https://builds.apache.org/job/Atlas-master-IntegrationTests/ws/addons/hive-bridge/target/failsafe-reports>
for the individual test results.
[ERROR] -> [Help 1]
[ERROR] 
[ERROR] To see the full stack trace of the errors, re-run Maven with the -e switch.
[ERROR] Re-run Maven using the -X switch to enable full debug logging.
[ERROR] 
[ERROR] For more information about the errors and possible solutions, please read the following
articles:
[ERROR] [Help 1] http://cwiki.apache.org/confluence/display/MAVEN/MojoFailureException
[ERROR] 
[ERROR] After correcting the problems, you can resume the build with the command
[ERROR]   mvn <goals> -rf :hive-bridge
Build step 'Execute shell' marked build as failure
[CHECKSTYLE] Collecting checkstyle analysis files...
[CHECKSTYLE] Searching for all files in <https://builds.apache.org/job/Atlas-master-IntegrationTests/ws/>
that match the pattern **/target/checkstyle-result.xml
[CHECKSTYLE] Parsing 24 files in <https://builds.apache.org/job/Atlas-master-IntegrationTests/ws/>
[CHECKSTYLE] Successfully parsed file <https://builds.apache.org/job/Atlas-master-IntegrationTests/ws/addons/hdfs-model/target/checkstyle-result.xml>
with 0 unique warnings and 0 duplicates.
[CHECKSTYLE] Successfully parsed file <https://builds.apache.org/job/Atlas-master-IntegrationTests/ws/addons/hive-bridge-shim/target/checkstyle-result.xml>
with 15 unique warnings and 0 duplicates.
[CHECKSTYLE] Successfully parsed file <https://builds.apache.org/job/Atlas-master-IntegrationTests/ws/authorization/target/checkstyle-result.xml>
with 482 unique warnings and 0 duplicates.
[CHECKSTYLE] Successfully parsed file <https://builds.apache.org/job/Atlas-master-IntegrationTests/ws/catalog/target/checkstyle-result.xml>
with 2619 unique warnings and 0 duplicates.
[CHECKSTYLE] Successfully parsed file <https://builds.apache.org/job/Atlas-master-IntegrationTests/ws/client/target/checkstyle-result.xml>
with 4256 unique warnings and 0 duplicates.
[CHECKSTYLE] Successfully parsed file <https://builds.apache.org/job/Atlas-master-IntegrationTests/ws/common/target/checkstyle-result.xml>
with 5468 unique warnings and 0 duplicates.
[CHECKSTYLE] Successfully parsed file <https://builds.apache.org/job/Atlas-master-IntegrationTests/ws/dashboardv2/target/checkstyle-result.xml>
with 5468 unique warnings and 0 duplicates.
[CHECKSTYLE] Successfully parsed file <https://builds.apache.org/job/Atlas-master-IntegrationTests/ws/docs/target/checkstyle-result.xml>
with 5468 unique warnings and 0 duplicates.
[CHECKSTYLE] Successfully parsed file <https://builds.apache.org/job/Atlas-master-IntegrationTests/ws/graphdb/api/target/checkstyle-result.xml>
with 5737 unique warnings and 0 duplicates.
[CHECKSTYLE] Successfully parsed file <https://builds.apache.org/job/Atlas-master-IntegrationTests/ws/graphdb/common/target/checkstyle-result.xml>
with 5924 unique warnings and 0 duplicates.
[CHECKSTYLE] Successfully parsed file <https://builds.apache.org/job/Atlas-master-IntegrationTests/ws/graphdb/graphdb-impls/target/checkstyle-result.xml>
with 5924 unique warnings and 0 duplicates.
[CHECKSTYLE] Successfully parsed file <https://builds.apache.org/job/Atlas-master-IntegrationTests/ws/graphdb/target/checkstyle-result.xml>
with 5924 unique warnings and 0 duplicates.
[CHECKSTYLE] Successfully parsed file <https://builds.apache.org/job/Atlas-master-IntegrationTests/ws/graphdb/titan0/target/checkstyle-result.xml>
with 8198 unique warnings and 0 duplicates.
[CHECKSTYLE] Successfully parsed file <https://builds.apache.org/job/Atlas-master-IntegrationTests/ws/graphdb/titan1/target/checkstyle-result.xml>
with 9146 unique warnings and 0 duplicates.
[CHECKSTYLE] Successfully parsed file <https://builds.apache.org/job/Atlas-master-IntegrationTests/ws/intg/target/checkstyle-result.xml>
with 16711 unique warnings and 0 duplicates.
[CHECKSTYLE] Successfully parsed file <https://builds.apache.org/job/Atlas-master-IntegrationTests/ws/notification/target/checkstyle-result.xml>
with 17921 unique warnings and 0 duplicates.
[CHECKSTYLE] Successfully parsed file <https://builds.apache.org/job/Atlas-master-IntegrationTests/ws/plugin-classloader/target/checkstyle-result.xml>
with 18029 unique warnings and 0 duplicates.
[CHECKSTYLE] Successfully parsed file <https://builds.apache.org/job/Atlas-master-IntegrationTests/ws/repository/target/checkstyle-result.xml>
with 37546 unique warnings and 0 duplicates.
[CHECKSTYLE] Successfully parsed file <https://builds.apache.org/job/Atlas-master-IntegrationTests/ws/server-api/target/checkstyle-result.xml>
with 37925 unique warnings and 0 duplicates.
[CHECKSTYLE] Successfully parsed file <https://builds.apache.org/job/Atlas-master-IntegrationTests/ws/shaded/hbase-client-shaded/target/checkstyle-result.xml>
with 37925 unique warnings and 0 duplicates.
[CHECKSTYLE] Successfully parsed file <https://builds.apache.org/job/Atlas-master-IntegrationTests/ws/shaded/hbase-server-shaded/target/checkstyle-result.xml>
with 37925 unique warnings and 0 duplicates.
[CHECKSTYLE] Successfully parsed file <https://builds.apache.org/job/Atlas-master-IntegrationTests/ws/target/checkstyle-result.xml>
with 37925 unique warnings and 0 duplicates.
[CHECKSTYLE] Successfully parsed file <https://builds.apache.org/job/Atlas-master-IntegrationTests/ws/typesystem/target/checkstyle-result.xml>
with 42143 unique warnings and 0 duplicates.
[CHECKSTYLE] Successfully parsed file <https://builds.apache.org/job/Atlas-master-IntegrationTests/ws/webapp/target/checkstyle-result.xml>
with 50242 unique warnings and 0 duplicates.
<Git Blamer> Using GitBlamer to create author and commit information for all warnings.
<Git Blamer> GIT_COMMIT=20742f1e685a9a58b9c5ef4ba0ac9fbaadf9f8e6, workspace=<https://builds.apache.org/job/Atlas-master-IntegrationTests/ws/>
 > git rev-parse 20742f1e685a9a58b9c5ef4ba0ac9fbaadf9f8e6^{commit} # timeout=10
[FINDBUGS] Collecting findbugs analysis files...
[FINDBUGS] Searching for all files in <https://builds.apache.org/job/Atlas-master-IntegrationTests/ws/>
that match the pattern **/target/findbugs.xml
[FINDBUGS] Parsing 15 files in <https://builds.apache.org/job/Atlas-master-IntegrationTests/ws/>
[FINDBUGS] Successfully parsed file <https://builds.apache.org/job/Atlas-master-IntegrationTests/ws/addons/hive-bridge-shim/target/findbugs.xml>
with 0 unique warnings and 0 duplicates.
[FINDBUGS] Successfully parsed file <https://builds.apache.org/job/Atlas-master-IntegrationTests/ws/authorization/target/findbugs.xml>
with 0 unique warnings and 0 duplicates.
[FINDBUGS] Successfully parsed file <https://builds.apache.org/job/Atlas-master-IntegrationTests/ws/catalog/target/findbugs.xml>
with 0 unique warnings and 0 duplicates.
[FINDBUGS] Successfully parsed file <https://builds.apache.org/job/Atlas-master-IntegrationTests/ws/client/target/findbugs.xml>
with 0 unique warnings and 0 duplicates.
[FINDBUGS] Successfully parsed file <https://builds.apache.org/job/Atlas-master-IntegrationTests/ws/common/target/findbugs.xml>
with 0 unique warnings and 0 duplicates.
[FINDBUGS] Successfully parsed file <https://builds.apache.org/job/Atlas-master-IntegrationTests/ws/graphdb/api/target/findbugs.xml>
with 0 unique warnings and 0 duplicates.
[FINDBUGS] Successfully parsed file <https://builds.apache.org/job/Atlas-master-IntegrationTests/ws/graphdb/common/target/findbugs.xml>
with 0 unique warnings and 0 duplicates.
[FINDBUGS] Successfully parsed file <https://builds.apache.org/job/Atlas-master-IntegrationTests/ws/graphdb/titan0/target/findbugs.xml>
with 0 unique warnings and 0 duplicates.
[FINDBUGS] Successfully parsed file <https://builds.apache.org/job/Atlas-master-IntegrationTests/ws/intg/target/findbugs.xml>
with 0 unique warnings and 0 duplicates.
[FINDBUGS] Successfully parsed file <https://builds.apache.org/job/Atlas-master-IntegrationTests/ws/notification/target/findbugs.xml>
with 0 unique warnings and 0 duplicates.
[FINDBUGS] Successfully parsed file <https://builds.apache.org/job/Atlas-master-IntegrationTests/ws/plugin-classloader/target/findbugs.xml>
with 0 unique warnings and 0 duplicates.
[FINDBUGS] Successfully parsed file <https://builds.apache.org/job/Atlas-master-IntegrationTests/ws/repository/target/findbugs.xml>
with 0 unique warnings and 0 duplicates.
[FINDBUGS] Successfully parsed file <https://builds.apache.org/job/Atlas-master-IntegrationTests/ws/server-api/target/findbugs.xml>
with 0 unique warnings and 0 duplicates.
[FINDBUGS] Successfully parsed file <https://builds.apache.org/job/Atlas-master-IntegrationTests/ws/typesystem/target/findbugs.xml>
with 0 unique warnings and 0 duplicates.
[FINDBUGS] Successfully parsed file <https://builds.apache.org/job/Atlas-master-IntegrationTests/ws/webapp/target/findbugs.xml>
with 0 unique warnings and 0 duplicates.
<Git Blamer> Using GitBlamer to create author and commit information for all warnings.
<Git Blamer> GIT_COMMIT=20742f1e685a9a58b9c5ef4ba0ac9fbaadf9f8e6, workspace=<https://builds.apache.org/job/Atlas-master-IntegrationTests/ws/>
Archiving artifacts
[Fast Archiver] No prior successful build to compare, so performing full copy of artifacts
TestNG Reports Processing: START
Looking for TestNG results report in workspace using pattern: **/target/surefire-reports/testng-results.xml,**/target/failsafe-reports/testng-results.xml
Saving reports...
Processing '/x1/jenkins/jenkins-home/jobs/Atlas-master-IntegrationTests/builds/50/testng/testng-results-1.xml'
Processing '/x1/jenkins/jenkins-home/jobs/Atlas-master-IntegrationTests/builds/50/testng/testng-results.xml'
21.348314% of tests failed, which exceeded threshold of 0%. Marking build as UNSTABLE
TestNG Reports Processing: FINISH

Mime
View raw message