atlas-dev mailing list archives

Site index · List index
Message view « Date » · « Thread »
Top « Date » · « Thread »
From Apache Jenkins Server <jenk...@builds.apache.org>
Subject Build failed in Jenkins: Atlas-master-IntegrationTests #25
Date Wed, 23 Aug 2017 06:31:47 GMT
See <https://builds.apache.org/job/Atlas-master-IntegrationTests/25/display/redirect?page=changes>

Changes:

[ssubramanian] ATLAS-2078: Type update using v1 API doesn't route to

[ssubramanian] ATLAS-2079: Fix coverity scan issue and IT failures introduced by

------------------------------------------
[...truncated 510.60 KB...]
127.0.0.1 - - [23/Aug/2017:06:27:23 +0000] "GET /api/atlas/entities?type=testH2gmDpK1wH HTTP/1.1"
200 - "-" "Java/1.7.0_80"
127.0.0.1 - - [23/Aug/2017:06:27:23 +0000] "GET /api/atlas/entities/blah HTTP/1.1" 404 - "-"
"Java/1.7.0_80"
127.0.0.1 - - [23/Aug/2017:06:27:23 +0000] "POST /api/atlas/entities HTTP/1.1" 201 - "-" "Java/1.7.0_80"
127.0.0.1 - - [23/Aug/2017:06:27:23 +0000] "POST /api/atlas/entities HTTP/1.1" 201 - "-" "Java/1.7.0_80"
127.0.0.1 - - [23/Aug/2017:06:27:23 +0000] "GET /api/atlas/v2/types/typedef/name/PII_TraitVFBJfP4vzK
HTTP/1.1" 404 - "-" "Java/1.7.0_80"
127.0.0.1 - - [23/Aug/2017:06:27:23 +0000] "POST /api/atlas/types HTTP/1.1" 201 - "-" "Java/1.7.0_80"
127.0.0.1 - - [23/Aug/2017:06:27:24 +0000] "POST /api/atlas/entities/7eb5915e-6e66-46a0-82e8-b1b76fb803f3/traits
HTTP/1.1" 201 - "-" "Java/1.7.0_80"
127.0.0.1 - - [23/Aug/2017:06:27:24 +0000] "GET /api/atlas/entities/7eb5915e-6e66-46a0-82e8-b1b76fb803f3/traitDefinitions/PII_TraitVFBJfP4vzK
HTTP/1.1" 200 - "-" "Java/1.7.0_80"
127.0.0.1 - - [23/Aug/2017:06:27:24 +0000] "GET /api/atlas/entities/7eb5915e-6e66-46a0-82e8-b1b76fb803f3/traitDefinitions
HTTP/1.1" 200 - "-" "Java/1.7.0_80"
127.0.0.1 - - [23/Aug/2017:06:27:24 +0000] "POST /api/atlas/entities HTTP/1.1" 201 - "-" "Java/1.7.0_80"
127.0.0.1 - - [23/Aug/2017:06:27:24 +0000] "POST /api/atlas/entities HTTP/1.1" 201 - "-" "Java/1.7.0_80"
127.0.0.1 - - [23/Aug/2017:06:27:24 +0000] "GET /api/atlas/entities/0c060373-8f97-4820-b945-06895eea50fa/traits
HTTP/1.1" 200 - "-" "Java/1.7.0_80"
127.0.0.1 - - [23/Aug/2017:06:27:24 +0000] "POST /api/atlas/entities HTTP/1.1" 201 - "-" "Java/1.7.0_80"
127.0.0.1 - - [23/Aug/2017:06:27:24 +0000] "POST /api/atlas/entities HTTP/1.1" 201 - "-" "Java/1.7.0_80"
127.0.0.1 - - [23/Aug/2017:06:27:24 +0000] "POST /api/atlas/entities/d13e0213-f814-4543-a89f-7a967428f0ed
HTTP/1.1" 200 - "-" "Java/1.7.0_80"
127.0.0.1 - - [23/Aug/2017:06:27:24 +0000] "GET /api/atlas/entities/d13e0213-f814-4543-a89f-7a967428f0ed
HTTP/1.1" 200 - "-" "Java/1.7.0_80"
127.0.0.1 - - [23/Aug/2017:06:27:24 +0000] "POST /api/atlas/entities HTTP/1.1" 201 - "-" "Java/1.7.0_80"
127.0.0.1 - - [23/Aug/2017:06:27:24 +0000] "POST /api/atlas/entities HTTP/1.1" 201 - "-" "Java/1.7.0_80"
127.0.0.1 - - [23/Aug/2017:06:27:24 +0000] "POST /api/atlas/entities/qualifiedName?type=hive_table&property=qualifiedName&value=tableNqMejYFODI
HTTP/1.1" 200 - "-" "Java/1.7.0_80"
127.0.0.1 - - [23/Aug/2017:06:27:24 +0000] "GET /api/atlas/entities/1535487c-2a10-4e87-890a-1c027916959f
HTTP/1.1" 200 - "-" "Java/1.7.0_80"
127.0.0.1 - - [23/Aug/2017:06:27:24 +0000] "POST /api/atlas/entities HTTP/1.1" 201 - "-" "Java/1.7.0_80"
127.0.0.1 - - [23/Aug/2017:06:27:24 +0000] "GET /api/atlas/entities/bd336609-70fe-4212-b8dc-127d3bfbb330/audit?count=10
HTTP/1.1" 200 - "-" "Java/1.7.0_80"
127.0.0.1 - - [23/Aug/2017:06:27:24 +0000] "POST /api/atlas/entities HTTP/1.1" 201 - "-" "Java/1.7.0_80"
127.0.0.1 - - [23/Aug/2017:06:27:24 +0000] "POST /api/atlas/entities HTTP/1.1" 201 - "-" "Java/1.7.0_80"
127.0.0.1 - - [23/Aug/2017:06:27:24 +0000] "POST /api/atlas/entities HTTP/1.1" 201 - "-" "Java/1.7.0_80"
127.0.0.1 - - [23/Aug/2017:06:27:24 +0000] "POST /api/atlas/entities HTTP/1.1" 400 - "-" "Java/1.7.0_80"
127.0.0.1 - - [23/Aug/2017:06:27:24 +0000] "POST /api/atlas/entities HTTP/1.1" 201 - "-" "Java/1.7.0_80"
127.0.0.1 - - [23/Aug/2017:06:27:24 +0000] "GET /api/atlas/v2/types/typedef/name/BQzqPcf99g
HTTP/1.1" 404 - "-" "Java/1.7.0_80"
127.0.0.1 - - [23/Aug/2017:06:27:24 +0000] "POST /api/atlas/types HTTP/1.1" 201 - "-" "Java/1.7.0_80"
127.0.0.1 - - [23/Aug/2017:06:27:24 +0000] "POST /api/atlas/entities HTTP/1.1" 201 - "-" "Java/1.7.0_80"
127.0.0.1 - - [23/Aug/2017:06:27:24 +0000] "GET /api/atlas/entities/4a528c2e-2ce3-488f-b70b-4472f02ff769
HTTP/1.1" 200 - "-" "Java/1.7.0_80"
127.0.0.1 - - [23/Aug/2017:06:27:25 +0000] "GET /api/atlas/v2/entity/guid/56c331a6-a6fb-4034-9019-3f3b7e41fe88
HTTP/1.1" 200 - "-" "Java/1.7.0_80"
127.0.0.1 - - [23/Aug/2017:06:27:25 +0000] "POST /api/atlas/v2/entity/ HTTP/1.1" 200 - "-"
"Java/1.7.0_80"
127.0.0.1 - - [23/Aug/2017:06:27:25 +0000] "POST /api/atlas/v2/entity/guid/random/classifications
HTTP/1.1" 404 - "-" "Java/1.7.0_80"
127.0.0.1 - - [23/Aug/2017:06:27:25 +0000] "POST /api/atlas/v2/entity/bulk/ HTTP/1.1" 200
- "-" "Java/1.7.0_80"
127.0.0.1 - - [23/Aug/2017:06:27:25 +0000] "POST /api/atlas/v2/entity/ HTTP/1.1" 200 - "-"
"Java/1.7.0_80"
127.0.0.1 - - [23/Aug/2017:06:27:25 +0000] "POST /api/atlas/v2/entity/ HTTP/1.1" 200 - "-"
"Java/1.7.0_80"
127.0.0.1 - - [23/Aug/2017:06:27:25 +0000] "DELETE /api/atlas/v2/entity/bulk/?guid=426ace66-d780-43c3-9300-2264960cc466&guid=d36e19a8-6d1e-420a-9014-c5490c61ee75
HTTP/1.1" 200 - "-" "Java/1.7.0_80"
127.0.0.1 - - [23/Aug/2017:06:27:25 +0000] "POST /api/atlas/v2/entity/ HTTP/1.1" 200 - "-"
"Java/1.7.0_80"
127.0.0.1 - - [23/Aug/2017:06:27:25 +0000] "DELETE /api/atlas/v2/entity/uniqueAttribute/type/hive_db_v2?attr:name=dbSYiduAkXON%EA%96%B6%E4%9A%99%E2%88%BF%E7%85%BB%ED%9B%81%ED%87%AB%E8%9E%A3%E7%AE%BA%E1%8E%98%E1%8B%89
HTTP/1.1" 200 - "-" "Java/1.7.0_80"
127.0.0.1 - - [23/Aug/2017:06:27:25 +0000] "DELETE /api/atlas/v2/entity/guid/random/classification/blah_trait
HTTP/1.1" 400 - "-" "Java/1.7.0_80"
127.0.0.1 - - [23/Aug/2017:06:27:25 +0000] "GET /api/atlas/discovery/search/dsl?query=hive_db_v2+where+name%3D'dbSYiduAkXON'&limit=10&offset=0
HTTP/1.1" 200 - "-" "Java/1.7.0_80"
127.0.0.1 - - [23/Aug/2017:06:27:26 +0000] "GET /api/atlas/discovery/search/dsl?query=hive_db_v2+where+name%3D'dbSYiduAkXON'&limit=10&offset=0
HTTP/1.1" 200 - "-" "Java/1.7.0_80"
127.0.0.1 - - [23/Aug/2017:06:27:27 +0000] "POST /api/atlas/v2/entity/ HTTP/1.1" 200 - "-"
"Java/1.7.0_80"
127.0.0.1 - - [23/Aug/2017:06:27:27 +0000] "GET /api/atlas/discovery/search/dsl?query=hive_db_v2+where+name%3D'dbSYiduAkXON'&limit=10&offset=0
HTTP/1.1" 200 - "-" "Java/1.7.0_80"
127.0.0.1 - - [23/Aug/2017:06:27:27 +0000] "POST /api/atlas/v2/types/typedefs/ HTTP/1.1" 200
- "-" "Java/1.7.0_80"
127.0.0.1 - - [23/Aug/2017:06:27:28 +0000] "POST /api/atlas/v2/entity/ HTTP/1.1" 200 - "-"
"Java/1.7.0_80"
127.0.0.1 - - [23/Aug/2017:06:27:28 +0000] "PUT /api/atlas/v2/types/typedefs/ HTTP/1.1" 200
- "-" "Java/1.7.0_80"
127.0.0.1 - - [23/Aug/2017:06:27:28 +0000] "GET /api/atlas/v2/entity/guid/c0e1bf8e-944e-419f-95f3-3b7783173daf
HTTP/1.1" 200 - "-" "Java/1.7.0_80"
127.0.0.1 - - [23/Aug/2017:06:27:28 +0000] "POST /api/atlas/v2/entity/ HTTP/1.1" 404 - "-"
"Java/1.7.0_80"
127.0.0.1 - - [23/Aug/2017:06:27:28 +0000] "POST /api/atlas/v2/entity/ HTTP/1.1" 200 - "-"
"Java/1.7.0_80"
127.0.0.1 - - [23/Aug/2017:06:27:28 +0000] "POST /api/atlas/v2/entity/ HTTP/1.1" 200 - "-"
"Java/1.7.0_80"
127.0.0.1 - - [23/Aug/2017:06:27:28 +0000] "GET /api/atlas/v2/entity/uniqueAttribute/type/hive_db_v2?attr:name=dbSYiduAkXON
HTTP/1.1" 200 - "-" "Java/1.7.0_80"
127.0.0.1 - - [23/Aug/2017:06:27:28 +0000] "POST /api/atlas/v2/entity/ HTTP/1.1" 200 - "-"
"Java/1.7.0_80"
127.0.0.1 - - [23/Aug/2017:06:27:28 +0000] "POST /api/atlas/v2/entity/ HTTP/1.1" 200 - "-"
"Java/1.7.0_80"
127.0.0.1 - - [23/Aug/2017:06:27:28 +0000] "GET /api/atlas/v2/types/typedef/name/jiR5i6FjOU
HTTP/1.1" 404 - "-" "Java/1.7.0_80"
127.0.0.1 - - [23/Aug/2017:06:27:28 +0000] "POST /api/atlas/v2/types/typedefs/ HTTP/1.1" 200
- "-" "Java/1.7.0_80"
127.0.0.1 - - [23/Aug/2017:06:27:28 +0000] "POST /api/atlas/v2/entity/ HTTP/1.1" 200 - "-"
"Java/1.7.0_80"
127.0.0.1 - - [23/Aug/2017:06:27:28 +0000] "GET /api/atlas/v2/entity/guid/365b20cc-532f-4288-8378-ce84ff238616
HTTP/1.1" 200 - "-" "Java/1.7.0_80"
127.0.0.1 - - [23/Aug/2017:06:27:28 +0000] "GET /api/atlas/v2/entity/guid/blah HTTP/1.1" 404
- "-" "Java/1.7.0_80"
127.0.0.1 - - [23/Aug/2017:06:27:28 +0000] "POST /api/atlas/v2/entity/ HTTP/1.1" 200 - "-"
"Java/1.7.0_80"
127.0.0.1 - - [23/Aug/2017:06:27:28 +0000] "GET /api/atlas/entities/901e54c2-5c54-4133-9c2e-2f7c708f215e/audit?count=10
HTTP/1.1" 200 - "-" "Java/1.7.0_80"
127.0.0.1 - - [23/Aug/2017:06:27:28 +0000] "GET /api/atlas/discovery/search/dsl?query=from+hive_db_v1+name%3D%22dbHLRXFrsc6L%22
HTTP/1.1" 200 - "-" "Java/1.7.0_80"
127.0.0.1 - - [23/Aug/2017:06:27:29 +0000] "GET /api/atlas/discovery/search/dsl?query=from+blah
HTTP/1.1" 400 - "-" "Java/1.7.0_80"
127.0.0.1 - - [23/Aug/2017:06:27:29 +0000] "GET /api/atlas/discovery/search?query=* HTTP/1.1"
200 - "-" "Java/1.7.0_80"
127.0.0.1 - - [23/Aug/2017:06:27:29 +0000] "GET /api/atlas/discovery/search?query=from+hive_db_v1+name%3D%22dbHLRXFrsc6L%22
HTTP/1.1" 200 - "-" "Java/1.7.0_80"
127.0.0.1 - - [23/Aug/2017:06:27:30 +0000] "GET /api/atlas/discovery/search/gremlin?query=g.V.has('type',+'hive_table_v1').toList()
HTTP/1.1" 200 - "-" "Java/1.7.0_80"
127.0.0.1 - - [23/Aug/2017:06:27:31 +0000] "POST /api/atlas/v2/types/typedefs/ HTTP/1.1" 200
- "-" "Java/1.7.0_80"
127.0.0.1 - - [23/Aug/2017:06:27:31 +0000] "POST /api/atlas/v2/types/typedefs/ HTTP/1.1" 409
- "-" "Java/1.7.0_80"
127.0.0.1 - - [23/Aug/2017:06:27:31 +0000] "GET /api/atlas/v2/types/enumdef/name/blah HTTP/1.1"
404 - "-" "Java/1.7.0_80"
127.0.0.1 - - [23/Aug/2017:06:27:31 +0000] "GET /api/atlas/v2/types/enumdef/guid/blah HTTP/1.1"
404 - "-" "Java/1.7.0_80"
127.0.0.1 - - [23/Aug/2017:06:27:31 +0000] "GET /api/atlas/v2/types/structdef/name/blah HTTP/1.1"
404 - "-" "Java/1.7.0_80"
127.0.0.1 - - [23/Aug/2017:06:27:31 +0000] "GET /api/atlas/v2/types/structdef/guid/blah HTTP/1.1"
404 - "-" "Java/1.7.0_80"
127.0.0.1 - - [23/Aug/2017:06:27:31 +0000] "GET /api/atlas/v2/types/classificationdef/name/blah
HTTP/1.1" 404 - "-" "Java/1.7.0_80"
127.0.0.1 - - [23/Aug/2017:06:27:31 +0000] "GET /api/atlas/v2/types/classificationdef/guid/blah
HTTP/1.1" 404 - "-" "Java/1.7.0_80"
127.0.0.1 - - [23/Aug/2017:06:27:31 +0000] "GET /api/atlas/v2/types/entitydef/name/blah HTTP/1.1"
404 - "-" "Java/1.7.0_80"
127.0.0.1 - - [23/Aug/2017:06:27:31 +0000] "GET /api/atlas/v2/types/entitydef/guid/blah HTTP/1.1"
404 - "-" "Java/1.7.0_80"
127.0.0.1 - - [23/Aug/2017:06:27:31 +0000] "POST /api/atlas/v2/types/typedefs/ HTTP/1.1" 200
- "-" "Java/1.7.0_80"
127.0.0.1 - - [23/Aug/2017:06:27:31 +0000] "GET /api/atlas/v2/types/typedefs/?supertype=Ac9mzhD6QO2&type=CLASS
HTTP/1.1" 200 - "-" "Java/1.7.0_80"
127.0.0.1 - - [23/Aug/2017:06:27:31 +0000] "GET /api/atlas/v2/types/typedefs/?notsupertype=BOqistUOVqJ&supertype=Ac9mzhD6QO2&type=CLASS
HTTP/1.1" 200 - "-" "Java/1.7.0_80"
127.0.0.1 - - [23/Aug/2017:06:27:31 +0000] "POST /api/atlas/v2/types/typedefs/ HTTP/1.1" 200
- "-" "Java/1.7.0_80"
127.0.0.1 - - [23/Aug/2017:06:27:31 +0000] "PUT /api/atlas/v2/types/typedefs/ HTTP/1.1" 200
- "-" "Java/1.7.0_80"
127.0.0.1 - - [23/Aug/2017:06:27:31 +0000] "GET /api/atlas/v2/types/typedefs/?type=ENTITY
HTTP/1.1" 200 - "-" "Java/1.7.0_80"
127.0.0.1 - - [23/Aug/2017:06:27:32 +0000] "POST /api/atlas/types HTTP/1.1" 201 - "-" "Java/1.7.0_80"
127.0.0.1 - - [23/Aug/2017:06:27:32 +0000] "POST /api/atlas/types HTTP/1.1" 409 - "-" "Java/1.7.0_80"
127.0.0.1 - - [23/Aug/2017:06:27:32 +0000] "GET /api/atlas/types/blah HTTP/1.1" 404 - "-"
"Java/1.7.0_80"
127.0.0.1 - - [23/Aug/2017:06:27:32 +0000] "GET /api/atlas/v2/types/typedef/name/class_trait
HTTP/1.1" 404 - "-" "Java/1.7.0_80"
127.0.0.1 - - [23/Aug/2017:06:27:32 +0000] "POST /api/atlas/types HTTP/1.1" 201 - "-" "Java/1.7.0_80"
127.0.0.1 - - [23/Aug/2017:06:27:32 +0000] "GET /api/atlas/v2/types/typedef/name/secure_trait
HTTP/1.1" 404 - "-" "Java/1.7.0_80"
127.0.0.1 - - [23/Aug/2017:06:27:32 +0000] "POST /api/atlas/types HTTP/1.1" 201 - "-" "Java/1.7.0_80"
127.0.0.1 - - [23/Aug/2017:06:27:32 +0000] "GET /api/atlas/v2/types/typedef/name/pii_trait
HTTP/1.1" 404 - "-" "Java/1.7.0_80"
127.0.0.1 - - [23/Aug/2017:06:27:32 +0000] "POST /api/atlas/types HTTP/1.1" 201 - "-" "Java/1.7.0_80"
127.0.0.1 - - [23/Aug/2017:06:27:32 +0000] "GET /api/atlas/v2/types/typedef/name/ssn_trait
HTTP/1.1" 404 - "-" "Java/1.7.0_80"
127.0.0.1 - - [23/Aug/2017:06:27:32 +0000] "POST /api/atlas/types HTTP/1.1" 201 - "-" "Java/1.7.0_80"
127.0.0.1 - - [23/Aug/2017:06:27:32 +0000] "GET /api/atlas/v2/types/typedef/name/salary_trait
HTTP/1.1" 404 - "-" "Java/1.7.0_80"
127.0.0.1 - - [23/Aug/2017:06:27:32 +0000] "POST /api/atlas/types HTTP/1.1" 201 - "-" "Java/1.7.0_80"
127.0.0.1 - - [23/Aug/2017:06:27:32 +0000] "GET /api/atlas/v2/types/typedef/name/sox_trait
HTTP/1.1" 404 - "-" "Java/1.7.0_80"
127.0.0.1 - - [23/Aug/2017:06:27:32 +0000] "POST /api/atlas/types HTTP/1.1" 201 - "-" "Java/1.7.0_80"
127.0.0.1 - - [23/Aug/2017:06:27:33 +0000] "GET /api/atlas/types?type=TRAIT HTTP/1.1" 200
- "-" "Java/1.7.0_80"
127.0.0.1 - - [23/Aug/2017:06:27:33 +0000] "GET /api/atlas/v2/types/typedef/name/AJhOR9WELAP
HTTP/1.1" 404 - "-" "Java/1.7.0_80"
127.0.0.1 - - [23/Aug/2017:06:27:33 +0000] "POST /api/atlas/types HTTP/1.1" 201 - "-" "Java/1.7.0_80"
127.0.0.1 - - [23/Aug/2017:06:27:33 +0000] "GET /api/atlas/v2/types/typedef/name/A1E7iFvrjXT0
HTTP/1.1" 404 - "-" "Java/1.7.0_80"
127.0.0.1 - - [23/Aug/2017:06:27:33 +0000] "POST /api/atlas/types HTTP/1.1" 201 - "-" "Java/1.7.0_80"
127.0.0.1 - - [23/Aug/2017:06:27:33 +0000] "GET /api/atlas/v2/types/typedef/name/BUUJRrcSrsd
HTTP/1.1" 404 - "-" "Java/1.7.0_80"
127.0.0.1 - - [23/Aug/2017:06:27:33 +0000] "POST /api/atlas/types HTTP/1.1" 201 - "-" "Java/1.7.0_80"
127.0.0.1 - - [23/Aug/2017:06:27:33 +0000] "GET /api/atlas/v2/types/typedef/name/CUEdiyzhxQA
HTTP/1.1" 404 - "-" "Java/1.7.0_80"
127.0.0.1 - - [23/Aug/2017:06:27:33 +0000] "POST /api/atlas/types HTTP/1.1" 201 - "-" "Java/1.7.0_80"
127.0.0.1 - - [23/Aug/2017:06:27:33 +0000] "GET /api/atlas/types?type=CLASS&supertype=AJhOR9WELAP&notsupertype=BUUJRrcSrsd
HTTP/1.1" 200 - "-" "Java/1.7.0_80"
127.0.0.1 - - [23/Aug/2017:06:27:33 +0000] "POST /api/atlas/types HTTP/1.1" 201 - "-" "Java/1.7.0_80"
127.0.0.1 - - [23/Aug/2017:06:27:33 +0000] "PUT /api/atlas/types HTTP/1.1" 200 - "-" "Java/1.7.0_80"
Tests run: 133, Failures: 1, Errors: 0, Skipped: 0, Time elapsed: 165.394 sec <<<
FAILURE! - in TestSuite
testUpdate(org.apache.atlas.web.integration.TypesJerseyResourceIT)  Time elapsed: 0.35 sec
 <<< FAILURE!
java.lang.AssertionError: expected:<1> but was:<0>
	at org.apache.atlas.web.integration.TypesJerseyResourceIT.testUpdate(TypesJerseyResourceIT.java:130)


Results :

Failed tests: 
  TypesJerseyResourceIT.testUpdate:130 expected:<1> but was:<0>

Tests run: 133, Failures: 1, Errors: 0, Skipped: 0

[INFO] 
[INFO] --- jetty-maven-plugin:9.2.12.v20150709:stop (stop-jetty) @ atlas-webapp ---
[INFO] Waiting 10 seconds for jetty to stop
[INFO] Stopped ServerConnector@337a9168{HTTP/1.1}{0.0.0.0:31000}
[INFO] Closing Spring root WebApplicationContext
[INFO] Shutting down log4j
[INFO] Stopped o.e.j.m.p.JettyWebAppContext@4c342e45{/,<https://builds.apache.org/job/Atlas-master-IntegrationTests/ws/webapp/target/atlas-webapp-0.9-SNAPSHOT/,UNAVAILABLE}{/home/jenkins/jenkins-slave/workspace/Atlas-master-IntegrationTests/webapp/target/atlas-webapp-0.9-SNAPSHOT.war}>
[INFO] Server reports itself as stopped
[INFO] 
[INFO] --- maven-source-plugin:2.4:jar-no-fork (attach-sources) @ atlas-webapp ---
[INFO] Building jar: <https://builds.apache.org/job/Atlas-master-IntegrationTests/ws/webapp/target/atlas-webapp-0.9-SNAPSHOT-sources.jar>
[INFO] 
[INFO] --- maven-source-plugin:2.4:test-jar-no-fork (attach-sources) @ atlas-webapp ---
[INFO] Building jar: <https://builds.apache.org/job/Atlas-master-IntegrationTests/ws/webapp/target/atlas-webapp-0.9-SNAPSHOT-test-sources.jar>
[INFO] 
[INFO] --- maven-failsafe-plugin:2.19.1:verify (verify) @ atlas-webapp ---
[INFO] ------------------------------------------------------------------------
[INFO] Reactor Summary:
[INFO] 
[INFO] Apache Atlas Server Build Tools .................... SUCCESS [  0.922 s]
[INFO] apache-atlas ....................................... SUCCESS [ 10.818 s]
[INFO] Apache Atlas Integration ........................... SUCCESS [ 30.196 s]
[INFO] Apache Atlas Common ................................ SUCCESS [ 15.530 s]
[INFO] Apache Atlas Typesystem ............................ SUCCESS [01:11 min]
[INFO] Apache Atlas Client ................................ SUCCESS [ 17.544 s]
[INFO] Apache Atlas Server API ............................ SUCCESS [ 10.454 s]
[INFO] Apache Atlas Notification .......................... SUCCESS [ 15.085 s]
[INFO] Apache Atlas Graph Database Projects ............... SUCCESS [  0.703 s]
[INFO] Apache Atlas Graph Database API .................... SUCCESS [  7.556 s]
[INFO] Graph Database Common Code ......................... SUCCESS [  7.864 s]
[INFO] Apache Atlas Titan 1.0.0 GraphDB Impl .............. SUCCESS [ 33.906 s]
[INFO] Shaded version of Apache hbase client .............. SUCCESS [  8.620 s]
[INFO] Apache Atlas Titan 0.5.4 Graph DB Impl ............. SUCCESS [ 44.255 s]
[INFO] Apache Atlas Graph Database Implementation Dependencies SUCCESS [  0.873 s]
[INFO] Shaded version of Apache hbase server .............. SUCCESS [ 24.101 s]
[INFO] Apache Atlas Repository ............................ SUCCESS [01:53 min]
[INFO] Apache Atlas Authorization ......................... SUCCESS [ 12.568 s]
[INFO] Apache Atlas Business Catalog ...................... SUCCESS [ 17.374 s]
[INFO] Apache Atlas UI .................................... SUCCESS [01:04 min]
[INFO] Apache Atlas Web Application ....................... FAILURE [04:23 min]
[INFO] Apache Atlas Documentation ......................... SKIPPED
[INFO] Apache Atlas FileSystem Model ...................... SKIPPED
[INFO] Apache Atlas Plugin Classloader .................... SKIPPED
[INFO] Apache Atlas Hive Bridge Shim ...................... SKIPPED
[INFO] Apache Atlas Hive Bridge ........................... SKIPPED
[INFO] Apache Atlas Falcon Bridge Shim .................... SKIPPED
[INFO] Apache Atlas Falcon Bridge ......................... SKIPPED
[INFO] Apache Atlas Sqoop Bridge Shim ..................... SKIPPED
[INFO] Apache Atlas Sqoop Bridge .......................... SKIPPED
[INFO] Apache Atlas Storm Bridge Shim ..................... SKIPPED
[INFO] Apache Atlas Storm Bridge .......................... SKIPPED
[INFO] Apache Atlas Distribution .......................... SKIPPED
[INFO] ------------------------------------------------------------------------
[INFO] BUILD FAILURE
[INFO] ------------------------------------------------------------------------
[INFO] Total time: 12:53 min
[INFO] Finished at: 2017-08-23T06:27:41Z
[INFO] Final Memory: 371M/1784M
[INFO] ------------------------------------------------------------------------
log4j:WARN No appenders could be found for logger (org.apache.zookeeper.ClientCnxn).
log4j:WARN Please initialize the log4j system properly.
log4j:WARN See http://logging.apache.org/log4j/1.2/faq.html#noconfig for more info.
[ERROR] Failed to execute goal org.apache.maven.plugins:maven-failsafe-plugin:2.19.1:verify
(verify) on project atlas-webapp: There are test failures.
[ERROR] 
[ERROR] Please refer to <https://builds.apache.org/job/Atlas-master-IntegrationTests/ws/webapp/target/failsafe-reports>
for the individual test results.
[ERROR] -> [Help 1]
[ERROR] 
[ERROR] To see the full stack trace of the errors, re-run Maven with the -e switch.
[ERROR] Re-run Maven using the -X switch to enable full debug logging.
[ERROR] 
[ERROR] For more information about the errors and possible solutions, please read the following
articles:
[ERROR] [Help 1] http://cwiki.apache.org/confluence/display/MAVEN/MojoFailureException
[ERROR] 
[ERROR] After correcting the problems, you can resume the build with the command
[ERROR]   mvn <goals> -rf :atlas-webapp
Build step 'Execute shell' marked build as failure
[CHECKSTYLE] Collecting checkstyle analysis files...
[CHECKSTYLE] Searching for all files in <https://builds.apache.org/job/Atlas-master-IntegrationTests/ws/>
that match the pattern **/target/checkstyle-result.xml
[CHECKSTYLE] Parsing 19 files in <https://builds.apache.org/job/Atlas-master-IntegrationTests/ws/>
[CHECKSTYLE] Successfully parsed file <https://builds.apache.org/job/Atlas-master-IntegrationTests/ws/authorization/target/checkstyle-result.xml>
with 467 unique warnings and 0 duplicates.
[CHECKSTYLE] Successfully parsed file <https://builds.apache.org/job/Atlas-master-IntegrationTests/ws/catalog/target/checkstyle-result.xml>
with 2612 unique warnings and 0 duplicates.
[CHECKSTYLE] Successfully parsed file <https://builds.apache.org/job/Atlas-master-IntegrationTests/ws/client/target/checkstyle-result.xml>
with 4249 unique warnings and 0 duplicates.
[CHECKSTYLE] Successfully parsed file <https://builds.apache.org/job/Atlas-master-IntegrationTests/ws/common/target/checkstyle-result.xml>
with 5461 unique warnings and 0 duplicates.
[CHECKSTYLE] Successfully parsed file <https://builds.apache.org/job/Atlas-master-IntegrationTests/ws/dashboardv2/target/checkstyle-result.xml>
with 5461 unique warnings and 0 duplicates.
[CHECKSTYLE] Successfully parsed file <https://builds.apache.org/job/Atlas-master-IntegrationTests/ws/graphdb/api/target/checkstyle-result.xml>
with 5730 unique warnings and 0 duplicates.
[CHECKSTYLE] Successfully parsed file <https://builds.apache.org/job/Atlas-master-IntegrationTests/ws/graphdb/common/target/checkstyle-result.xml>
with 5917 unique warnings and 0 duplicates.
[CHECKSTYLE] Successfully parsed file <https://builds.apache.org/job/Atlas-master-IntegrationTests/ws/graphdb/graphdb-impls/target/checkstyle-result.xml>
with 5917 unique warnings and 0 duplicates.
[CHECKSTYLE] Successfully parsed file <https://builds.apache.org/job/Atlas-master-IntegrationTests/ws/graphdb/target/checkstyle-result.xml>
with 5917 unique warnings and 0 duplicates.
[CHECKSTYLE] Successfully parsed file <https://builds.apache.org/job/Atlas-master-IntegrationTests/ws/graphdb/titan0/target/checkstyle-result.xml>
with 8191 unique warnings and 0 duplicates.
[CHECKSTYLE] Successfully parsed file <https://builds.apache.org/job/Atlas-master-IntegrationTests/ws/graphdb/titan1/target/checkstyle-result.xml>
with 9139 unique warnings and 0 duplicates.
[CHECKSTYLE] Successfully parsed file <https://builds.apache.org/job/Atlas-master-IntegrationTests/ws/intg/target/checkstyle-result.xml>
with 16657 unique warnings and 0 duplicates.
[CHECKSTYLE] Successfully parsed file <https://builds.apache.org/job/Atlas-master-IntegrationTests/ws/notification/target/checkstyle-result.xml>
with 17867 unique warnings and 0 duplicates.
[CHECKSTYLE] Successfully parsed file <https://builds.apache.org/job/Atlas-master-IntegrationTests/ws/repository/target/checkstyle-result.xml>
with 37375 unique warnings and 0 duplicates.
[CHECKSTYLE] Successfully parsed file <https://builds.apache.org/job/Atlas-master-IntegrationTests/ws/server-api/target/checkstyle-result.xml>
with 37754 unique warnings and 0 duplicates.
[CHECKSTYLE] Successfully parsed file <https://builds.apache.org/job/Atlas-master-IntegrationTests/ws/shaded/hbase-client-shaded/target/checkstyle-result.xml>
with 37754 unique warnings and 0 duplicates.
[CHECKSTYLE] Successfully parsed file <https://builds.apache.org/job/Atlas-master-IntegrationTests/ws/shaded/hbase-server-shaded/target/checkstyle-result.xml>
with 37754 unique warnings and 0 duplicates.
[CHECKSTYLE] Successfully parsed file <https://builds.apache.org/job/Atlas-master-IntegrationTests/ws/target/checkstyle-result.xml>
with 37754 unique warnings and 0 duplicates.
[CHECKSTYLE] Successfully parsed file <https://builds.apache.org/job/Atlas-master-IntegrationTests/ws/typesystem/target/checkstyle-result.xml>
with 41972 unique warnings and 0 duplicates.
<Git Blamer> Using GitBlamer to create author and commit information for all warnings.
<Git Blamer> GIT_COMMIT=024fd221043ae745921d9bfa9e6e689507972f1a, workspace=<https://builds.apache.org/job/Atlas-master-IntegrationTests/ws/>
 > git rev-parse 024fd221043ae745921d9bfa9e6e689507972f1a^{commit} # timeout=10
[FINDBUGS] Collecting findbugs analysis files...
[FINDBUGS] Searching for all files in <https://builds.apache.org/job/Atlas-master-IntegrationTests/ws/>
that match the pattern **/target/findbugs.xml
[FINDBUGS] Parsing 12 files in <https://builds.apache.org/job/Atlas-master-IntegrationTests/ws/>
[FINDBUGS] Successfully parsed file <https://builds.apache.org/job/Atlas-master-IntegrationTests/ws/authorization/target/findbugs.xml>
with 0 unique warnings and 0 duplicates.
[FINDBUGS] Successfully parsed file <https://builds.apache.org/job/Atlas-master-IntegrationTests/ws/catalog/target/findbugs.xml>
with 0 unique warnings and 0 duplicates.
[FINDBUGS] Successfully parsed file <https://builds.apache.org/job/Atlas-master-IntegrationTests/ws/client/target/findbugs.xml>
with 0 unique warnings and 0 duplicates.
[FINDBUGS] Successfully parsed file <https://builds.apache.org/job/Atlas-master-IntegrationTests/ws/common/target/findbugs.xml>
with 0 unique warnings and 0 duplicates.
[FINDBUGS] Successfully parsed file <https://builds.apache.org/job/Atlas-master-IntegrationTests/ws/graphdb/api/target/findbugs.xml>
with 0 unique warnings and 0 duplicates.
[FINDBUGS] Successfully parsed file <https://builds.apache.org/job/Atlas-master-IntegrationTests/ws/graphdb/common/target/findbugs.xml>
with 0 unique warnings and 0 duplicates.
[FINDBUGS] Successfully parsed file <https://builds.apache.org/job/Atlas-master-IntegrationTests/ws/graphdb/titan0/target/findbugs.xml>
with 0 unique warnings and 0 duplicates.
[FINDBUGS] Successfully parsed file <https://builds.apache.org/job/Atlas-master-IntegrationTests/ws/intg/target/findbugs.xml>
with 0 unique warnings and 0 duplicates.
[FINDBUGS] Successfully parsed file <https://builds.apache.org/job/Atlas-master-IntegrationTests/ws/notification/target/findbugs.xml>
with 0 unique warnings and 0 duplicates.
[FINDBUGS] Successfully parsed file <https://builds.apache.org/job/Atlas-master-IntegrationTests/ws/repository/target/findbugs.xml>
with 0 unique warnings and 0 duplicates.
[FINDBUGS] Successfully parsed file <https://builds.apache.org/job/Atlas-master-IntegrationTests/ws/server-api/target/findbugs.xml>
with 0 unique warnings and 0 duplicates.
[FINDBUGS] Successfully parsed file <https://builds.apache.org/job/Atlas-master-IntegrationTests/ws/typesystem/target/findbugs.xml>
with 0 unique warnings and 0 duplicates.
<Git Blamer> Using GitBlamer to create author and commit information for all warnings.
<Git Blamer> GIT_COMMIT=024fd221043ae745921d9bfa9e6e689507972f1a, workspace=<https://builds.apache.org/job/Atlas-master-IntegrationTests/ws/>
Archiving artifacts
[Fast Archiver] No prior successful build to compare, so performing full copy of artifacts
TestNG Reports Processing: START
Looking for TestNG results report in workspace using pattern: **/target/surefire-reports/testng-results.xml,**/target/failsafe-reports/testng-results.xml
Saving reports...
Processing '/x1/jenkins/jenkins-home/jobs/Atlas-master-IntegrationTests/builds/25/testng/testng-results.xml'
0.751880% of tests failed, which exceeded threshold of 0%. Marking build as UNSTABLE
TestNG Reports Processing: FINISH

Mime
View raw message