atlas-dev mailing list archives

Site index · List index
Message view « Date » · « Thread »
Top « Date » · « Thread »
From Apache Jenkins Server <jenk...@builds.apache.org>
Subject Build failed in Jenkins: Atlas-master-IntegrationTests #32
Date Fri, 25 Aug 2017 09:02:17 GMT
See <https://builds.apache.org/job/Atlas-master-IntegrationTests/32/display/redirect?page=changes>

Changes:

[madhan] ATLAS-2076: update type-search to support filter by RELATIONSHIP type

[madhan] ATLAS-2060: Fix logger class name typos

------------------------------------------
[...truncated 35.67 MB...]
	at org.apache.zookeeper.ClientCnxnSocketNIO.doTransport(ClientCnxnSocketNIO.java:361)
	at org.apache.zookeeper.ClientCnxn$SendThread.run(ClientCnxn.java:1081)
2017-08-25 08:57:01,159 DEBUG - [Curator-Framework-0-SendThread(localhost:19026):] ~ ==>
InMemoryJAASConfiguration.getAppConfigurationEntry(Client) (InMemoryJAASConfiguration:208)
2017-08-25 08:57:01,160 DEBUG - [Curator-Framework-0-SendThread(localhost:19026):] ~ <==
InMemoryJAASConfiguration.getAppConfigurationEntry(Client): {} (InMemoryJAASConfiguration:238)
2017-08-25 08:57:01,700 DEBUG - [main-SendThread(localhost:19026):] ~ ==> InMemoryJAASConfiguration.getAppConfigurationEntry(Client)
(InMemoryJAASConfiguration:208)
2017-08-25 08:57:01,701 DEBUG - [main-SendThread(localhost:19026):] ~ <== InMemoryJAASConfiguration.getAppConfigurationEntry(Client):
{} (InMemoryJAASConfiguration:238)
2017-08-25 08:57:01,701 WARN  - [main-SendThread(localhost:19026):] ~ Session 0x15e189681810002
for server null, unexpected error, closing socket connection and attempting reconnect (ClientCnxn$SendThread:1102)
java.net.ConnectException: Connection refused
	at sun.nio.ch.SocketChannelImpl.checkConnect(Native Method)
	at sun.nio.ch.SocketChannelImpl.finishConnect(SocketChannelImpl.java:744)
	at org.apache.zookeeper.ClientCnxnSocketNIO.doTransport(ClientCnxnSocketNIO.java:361)
	at org.apache.zookeeper.ClientCnxn$SendThread.run(ClientCnxn.java:1081)
2017-08-25 08:57:01,824 DEBUG - [Curator-Framework-0-SendThread(localhost:19026):] ~ ==>
InMemoryJAASConfiguration.getAppConfigurationEntry(Client) (InMemoryJAASConfiguration:208)
2017-08-25 08:57:01,824 DEBUG - [Curator-Framework-0-SendThread(localhost:19026):] ~ <==
InMemoryJAASConfiguration.getAppConfigurationEntry(Client): {} (InMemoryJAASConfiguration:238)
2017-08-25 08:57:02,782 DEBUG - [main-SendThread(localhost:19026):] ~ ==> InMemoryJAASConfiguration.getAppConfigurationEntry(Client)
(InMemoryJAASConfiguration:208)
2017-08-25 08:57:02,783 DEBUG - [main-SendThread(localhost:19026):] ~ <== InMemoryJAASConfiguration.getAppConfigurationEntry(Client):
{} (InMemoryJAASConfiguration:238)
2017-08-25 08:57:02,783 WARN  - [main-SendThread(localhost:19026):] ~ Session 0x15e189681810002
for server null, unexpected error, closing socket connection and attempting reconnect (ClientCnxn$SendThread:1102)
java.net.ConnectException: Connection refused
	at sun.nio.ch.SocketChannelImpl.checkConnect(Native Method)
	at sun.nio.ch.SocketChannelImpl.finishConnect(SocketChannelImpl.java:744)
	at org.apache.zookeeper.ClientCnxnSocketNIO.doTransport(ClientCnxnSocketNIO.java:361)
	at org.apache.zookeeper.ClientCnxn$SendThread.run(ClientCnxn.java:1081)
2017-08-25 08:57:03,905 DEBUG - [Curator-Framework-0-SendThread(localhost:19026):] ~ ==>
InMemoryJAASConfiguration.getAppConfigurationEntry(Client) (InMemoryJAASConfiguration:208)
2017-08-25 08:57:03,905 DEBUG - [Curator-Framework-0-SendThread(localhost:19026):] ~ <==
InMemoryJAASConfiguration.getAppConfigurationEntry(Client): {} (InMemoryJAASConfiguration:238)
2017-08-25 08:57:03,958 DEBUG - [main-SendThread(localhost:19026):] ~ ==> InMemoryJAASConfiguration.getAppConfigurationEntry(Client)
(InMemoryJAASConfiguration:208)
2017-08-25 08:57:03,959 DEBUG - [main-SendThread(localhost:19026):] ~ <== InMemoryJAASConfiguration.getAppConfigurationEntry(Client):
{} (InMemoryJAASConfiguration:238)
2017-08-25 08:57:03,960 WARN  - [main-SendThread(localhost:19026):] ~ Session 0x15e189681810002
for server null, unexpected error, closing socket connection and attempting reconnect (ClientCnxn$SendThread:1102)
java.net.ConnectException: Connection refused
	at sun.nio.ch.SocketChannelImpl.checkConnect(Native Method)
	at sun.nio.ch.SocketChannelImpl.finishConnect(SocketChannelImpl.java:744)
	at org.apache.zookeeper.ClientCnxnSocketNIO.doTransport(ClientCnxnSocketNIO.java:361)
	at org.apache.zookeeper.ClientCnxn$SendThread.run(ClientCnxn.java:1081)
2017-08-25 08:57:04,181 DEBUG - [Curator-Framework-0-SendThread(localhost:19026):] ~ ==>
InMemoryJAASConfiguration.getAppConfigurationEntry(Client) (InMemoryJAASConfiguration:208)
2017-08-25 08:57:04,181 DEBUG - [Curator-Framework-0-SendThread(localhost:19026):] ~ <==
InMemoryJAASConfiguration.getAppConfigurationEntry(Client): {} (InMemoryJAASConfiguration:238)
2017-08-25 08:57:04,225 DEBUG - [main-SendThread(localhost:19026):] ~ ==> InMemoryJAASConfiguration.getAppConfigurationEntry(Client)
(InMemoryJAASConfiguration:208)
2017-08-25 08:57:04,226 DEBUG - [main-SendThread(localhost:19026):] ~ <== InMemoryJAASConfiguration.getAppConfigurationEntry(Client):
{} (InMemoryJAASConfiguration:238)
2017-08-25 08:57:04,226 WARN  - [main-SendThread(localhost:19026):] ~ Session 0x15e189681810002
for server null, unexpected error, closing socket connection and attempting reconnect (ClientCnxn$SendThread:1102)
java.net.ConnectException: Connection refused
	at sun.nio.ch.SocketChannelImpl.checkConnect(Native Method)
	at sun.nio.ch.SocketChannelImpl.finishConnect(SocketChannelImpl.java:744)
	at org.apache.zookeeper.ClientCnxnSocketNIO.doTransport(ClientCnxnSocketNIO.java:361)
	at org.apache.zookeeper.ClientCnxn$SendThread.run(ClientCnxn.java:1081)
2017-08-25 08:57:05,750 DEBUG - [Curator-Framework-0-SendThread(localhost:19026):] ~ ==>
InMemoryJAASConfiguration.getAppConfigurationEntry(Client) (InMemoryJAASConfiguration:208)
2017-08-25 08:57:05,751 DEBUG - [Curator-Framework-0-SendThread(localhost:19026):] ~ <==
InMemoryJAASConfiguration.getAppConfigurationEntry(Client): {} (InMemoryJAASConfiguration:238)
2017-08-25 08:57:06,211 DEBUG - [main-SendThread(localhost:19026):] ~ ==> InMemoryJAASConfiguration.getAppConfigurationEntry(Client)
(InMemoryJAASConfiguration:208)
2017-08-25 08:57:06,212 DEBUG - [main-SendThread(localhost:19026):] ~ <== InMemoryJAASConfiguration.getAppConfigurationEntry(Client):
{} (InMemoryJAASConfiguration:238)
2017-08-25 08:57:06,212 WARN  - [main-SendThread(localhost:19026):] ~ Session 0x15e189681810002
for server null, unexpected error, closing socket connection and attempting reconnect (ClientCnxn$SendThread:1102)
java.net.ConnectException: Connection refused
	at sun.nio.ch.SocketChannelImpl.checkConnect(Native Method)
	at sun.nio.ch.SocketChannelImpl.finishConnect(SocketChannelImpl.java:744)
	at org.apache.zookeeper.ClientCnxnSocketNIO.doTransport(ClientCnxnSocketNIO.java:361)
	at org.apache.zookeeper.ClientCnxn$SendThread.run(ClientCnxn.java:1081)
2017-08-25 08:57:06,432 DEBUG - [main-SendThread(localhost:19026):] ~ ==> InMemoryJAASConfiguration.getAppConfigurationEntry(Client)
(InMemoryJAASConfiguration:208)
2017-08-25 08:57:06,433 DEBUG - [main-SendThread(localhost:19026):] ~ <== InMemoryJAASConfiguration.getAppConfigurationEntry(Client):
{} (InMemoryJAASConfiguration:238)
2017-08-25 08:57:06,433 WARN  - [main-SendThread(localhost:19026):] ~ Session 0x15e189681810002
for server null, unexpected error, closing socket connection and attempting reconnect (ClientCnxn$SendThread:1102)
java.net.ConnectException: Connection refused
	at sun.nio.ch.SocketChannelImpl.checkConnect(Native Method)
	at sun.nio.ch.SocketChannelImpl.finishConnect(SocketChannelImpl.java:744)
	at org.apache.zookeeper.ClientCnxnSocketNIO.doTransport(ClientCnxnSocketNIO.java:361)
	at org.apache.zookeeper.ClientCnxn$SendThread.run(ClientCnxn.java:1081)
2017-08-25 08:57:06,542 DEBUG - [Curator-Framework-0-SendThread(localhost:19026):] ~ ==>
InMemoryJAASConfiguration.getAppConfigurationEntry(Client) (InMemoryJAASConfiguration:208)
2017-08-25 08:57:06,543 DEBUG - [Curator-Framework-0-SendThread(localhost:19026):] ~ <==
InMemoryJAASConfiguration.getAppConfigurationEntry(Client): {} (InMemoryJAASConfiguration:238)
[ERROR] 
java.net.SocketTimeoutException: Read timed out
	at java.net.SocketInputStream.socketRead0(Native Method)
	at java.net.SocketInputStream.read(SocketInputStream.java:152)
	at java.net.SocketInputStream.read(SocketInputStream.java:122)
	at sun.nio.cs.StreamDecoder.readBytes(StreamDecoder.java:283)
	at sun.nio.cs.StreamDecoder.implRead(StreamDecoder.java:325)
	at sun.nio.cs.StreamDecoder.read(StreamDecoder.java:177)
	at java.io.InputStreamReader.read(InputStreamReader.java:184)
	at java.io.BufferedReader.fill(BufferedReader.java:154)
	at java.io.BufferedReader.readLine(BufferedReader.java:317)
	at java.io.LineNumberReader.readLine(LineNumberReader.java:199)
	at org.eclipse.jetty.maven.plugin.JettyStopMojo.execute(JettyStopMojo.java:100)
	at org.apache.maven.plugin.DefaultBuildPluginManager.executeMojo(DefaultBuildPluginManager.java:134)
	at org.apache.maven.lifecycle.internal.MojoExecutor.execute(MojoExecutor.java:208)
	at org.apache.maven.lifecycle.internal.MojoExecutor.execute(MojoExecutor.java:154)
	at org.apache.maven.lifecycle.internal.MojoExecutor.execute(MojoExecutor.java:146)
	at org.apache.maven.lifecycle.internal.LifecycleModuleBuilder.buildProject(LifecycleModuleBuilder.java:117)
	at org.apache.maven.lifecycle.internal.LifecycleModuleBuilder.buildProject(LifecycleModuleBuilder.java:81)
	at org.apache.maven.lifecycle.internal.builder.singlethreaded.SingleThreadedBuilder.build(SingleThreadedBuilder.java:51)
	at org.apache.maven.lifecycle.internal.LifecycleStarter.execute(LifecycleStarter.java:128)
	at org.apache.maven.DefaultMaven.doExecute(DefaultMaven.java:309)
	at org.apache.maven.DefaultMaven.doExecute(DefaultMaven.java:194)
	at org.apache.maven.DefaultMaven.execute(DefaultMaven.java:107)
	at org.apache.maven.cli.MavenCli.execute(MavenCli.java:993)
	at org.apache.maven.cli.MavenCli.doMain(MavenCli.java:345)
	at org.apache.maven.cli.MavenCli.main(MavenCli.java:191)
	at sun.reflect.NativeMethodAccessorImpl.invoke0(Native Method)
	at sun.reflect.NativeMethodAccessorImpl.invoke(NativeMethodAccessorImpl.java:57)
	at sun.reflect.DelegatingMethodAccessorImpl.invoke(DelegatingMethodAccessorImpl.java:43)
	at java.lang.reflect.Method.invoke(Method.java:606)
	at org.codehaus.plexus.classworlds.launcher.Launcher.launchEnhanced(Launcher.java:289)
	at org.codehaus.plexus.classworlds.launcher.Launcher.launch(Launcher.java:229)
	at org.codehaus.plexus.classworlds.launcher.Launcher.mainWithExitCode(Launcher.java:415)
	at org.codehaus.plexus.classworlds.launcher.Launcher.main(Launcher.java:356)
[INFO] 
[INFO] --- maven-source-plugin:2.4:jar-no-fork (attach-sources) @ hive-bridge ---
[INFO] Building jar: <https://builds.apache.org/job/Atlas-master-IntegrationTests/ws/addons/hive-bridge/target/hive-bridge-0.9-SNAPSHOT-sources.jar>
[INFO] 
[INFO] --- maven-source-plugin:2.4:test-jar-no-fork (attach-sources) @ hive-bridge ---
[INFO] Building jar: <https://builds.apache.org/job/Atlas-master-IntegrationTests/ws/addons/hive-bridge/target/hive-bridge-0.9-SNAPSHOT-test-sources.jar>
[INFO] 
[INFO] --- maven-failsafe-plugin:2.19.1:verify (verify) @ hive-bridge ---
[INFO] ------------------------------------------------------------------------
[INFO] Reactor Summary:
[INFO] 
[INFO] Apache Atlas Server Build Tools .................... SUCCESS [  1.035 s]
[INFO] apache-atlas ....................................... SUCCESS [  6.383 s]
[INFO] Apache Atlas Integration ........................... SUCCESS [ 30.113 s]
[INFO] Apache Atlas Common ................................ SUCCESS [ 14.942 s]
[INFO] Apache Atlas Typesystem ............................ SUCCESS [01:06 min]
[INFO] Apache Atlas Client ................................ SUCCESS [ 16.419 s]
[INFO] Apache Atlas Server API ............................ SUCCESS [ 10.588 s]
[INFO] Apache Atlas Notification .......................... SUCCESS [ 15.601 s]
[INFO] Apache Atlas Graph Database Projects ............... SUCCESS [  0.589 s]
[INFO] Apache Atlas Graph Database API .................... SUCCESS [  7.826 s]
[INFO] Graph Database Common Code ......................... SUCCESS [  7.891 s]
[INFO] Apache Atlas Titan 1.0.0 GraphDB Impl .............. SUCCESS [ 35.696 s]
[INFO] Shaded version of Apache hbase client .............. SUCCESS [ 10.521 s]
[INFO] Apache Atlas Titan 0.5.4 Graph DB Impl ............. SUCCESS [ 49.696 s]
[INFO] Apache Atlas Graph Database Implementation Dependencies SUCCESS [  0.882 s]
[INFO] Shaded version of Apache hbase server .............. SUCCESS [ 26.545 s]
[INFO] Apache Atlas Repository ............................ SUCCESS [02:01 min]
[INFO] Apache Atlas Authorization ......................... SUCCESS [ 11.265 s]
[INFO] Apache Atlas Business Catalog ...................... SUCCESS [ 17.154 s]
[INFO] Apache Atlas UI .................................... SUCCESS [01:02 min]
[INFO] Apache Atlas Web Application ....................... SUCCESS [05:37 min]
[INFO] Apache Atlas Documentation ......................... SUCCESS [ 20.046 s]
[INFO] Apache Atlas FileSystem Model ...................... SUCCESS [  2.748 s]
[INFO] Apache Atlas Plugin Classloader .................... SUCCESS [ 10.750 s]
[INFO] Apache Atlas Hive Bridge Shim ...................... SUCCESS [  8.957 s]
[INFO] Apache Atlas Hive Bridge ........................... FAILURE [08:53 min]
[INFO] Apache Atlas Falcon Bridge Shim .................... SKIPPED
[INFO] Apache Atlas Falcon Bridge ......................... SKIPPED
[INFO] Apache Atlas Sqoop Bridge Shim ..................... SKIPPED
[INFO] Apache Atlas Sqoop Bridge .......................... SKIPPED
[INFO] Apache Atlas Storm Bridge Shim ..................... SKIPPED
[INFO] Apache Atlas Storm Bridge .......................... SKIPPED
[INFO] Apache Atlas Distribution .......................... SKIPPED
[INFO] ------------------------------------------------------------------------
[INFO] BUILD FAILURE
[INFO] ------------------------------------------------------------------------
[INFO] Total time: 23:49 min
[INFO] Finished at: 2017-08-25T08:57:07Z
[INFO] Final Memory: 575M/2031M
[INFO] ------------------------------------------------------------------------
2017-08-25 08:57:09,423 DEBUG - [main-SendThread(localhost:19026):] ~ ==> InMemoryJAASConfiguration.getAppConfigurationEntry(Client)
(InMemoryJAASConfiguration:208)
2017-08-25 08:57:09,424 DEBUG - [main-SendThread(localhost:19026):] ~ <== InMemoryJAASConfiguration.getAppConfigurationEntry(Client):
{} (InMemoryJAASConfiguration:238)
2017-08-25 08:57:09,424 DEBUG - [Curator-Framework-0-SendThread(localhost:19026):] ~ ==>
InMemoryJAASConfiguration.getAppConfigurationEntry(Client) (InMemoryJAASConfiguration:208)
2017-08-25 08:57:09,424 WARN  - [main-SendThread(localhost:19026):] ~ Session 0x15e189681810002
for server null, unexpected error, closing socket connection and attempting reconnect (ClientCnxn$SendThread:1102)
java.net.ConnectException: Connection refused
	at sun.nio.ch.SocketChannelImpl.checkConnect(Native Method)
	at sun.nio.ch.SocketChannelImpl.finishConnect(SocketChannelImpl.java:744)
	at org.apache.zookeeper.ClientCnxnSocketNIO.doTransport(ClientCnxnSocketNIO.java:361)
	at org.apache.zookeeper.ClientCnxn$SendThread.run(ClientCnxn.java:1081)
[ERROR] Failed to execute goal org.apache.maven.plugins:maven-failsafe-plugin:2.19.1:verify
(verify) on project hive-bridge: There are test failures.
[ERROR] 
[ERROR] Please refer to <https://builds.apache.org/job/Atlas-master-IntegrationTests/ws/addons/hive-bridge/target/failsafe-reports>
for the individual test results.
[ERROR] -> [Help 1]
[ERROR] 
[ERROR] To see the full stack trace of the errors, re-run Maven with the -e switch.
[ERROR] Re-run Maven using the -X switch to enable full debug logging.
[ERROR] 
[ERROR] For more information about the errors and possible solutions, please read the following
articles:
[ERROR] [Help 1] http://cwiki.apache.org/confluence/display/MAVEN/MojoFailureException
[ERROR] 
[ERROR] After correcting the problems, you can resume the build with the command
[ERROR]   mvn <goals> -rf :hive-bridge
2017-08-25 08:57:09,462 DEBUG - [Curator-Framework-0-SendThread(localhost:19026):] ~ <==
InMemoryJAASConfiguration.getAppConfigurationEntry(Client): {} (InMemoryJAASConfiguration:238)
2017-08-25 08:57:09,622 DEBUG - [main-SendThread(localhost:19026):] ~ ==> InMemoryJAASConfiguration.getAppConfigurationEntry(Client)
(InMemoryJAASConfiguration:208)
2017-08-25 08:57:09,622 DEBUG - [main-SendThread(localhost:19026):] ~ <== InMemoryJAASConfiguration.getAppConfigurationEntry(Client):
{} (InMemoryJAASConfiguration:238)
2017-08-25 08:57:09,623 WARN  - [main-SendThread(localhost:19026):] ~ Session 0x15e189681810002
for server null, unexpected error, closing socket connection and attempting reconnect (ClientCnxn$SendThread:1102)
java.net.ConnectException: Connection refused
	at sun.nio.ch.SocketChannelImpl.checkConnect(Native Method)
	at sun.nio.ch.SocketChannelImpl.finishConnect(SocketChannelImpl.java:744)
	at org.apache.zookeeper.ClientCnxnSocketNIO.doTransport(ClientCnxnSocketNIO.java:361)
	at org.apache.zookeeper.ClientCnxn$SendThread.run(ClientCnxn.java:1081)
2017-08-25 08:57:09,844 DEBUG - [Curator-Framework-0-SendThread(localhost:19026):] ~ ==>
InMemoryJAASConfiguration.getAppConfigurationEntry(Client) (InMemoryJAASConfiguration:208)
2017-08-25 08:57:09,844 DEBUG - [Curator-Framework-0-SendThread(localhost:19026):] ~ <==
InMemoryJAASConfiguration.getAppConfigurationEntry(Client): {} (InMemoryJAASConfiguration:238)
2017-08-25 08:57:10,897 DEBUG - [main-SendThread(localhost:19026):] ~ ==> InMemoryJAASConfiguration.getAppConfigurationEntry(Client)
(InMemoryJAASConfiguration:208)
2017-08-25 08:57:10,898 DEBUG - [main-SendThread(localhost:19026):] ~ <== InMemoryJAASConfiguration.getAppConfigurationEntry(Client):
{} (InMemoryJAASConfiguration:238)
2017-08-25 08:57:10,899 WARN  - [main-SendThread(localhost:19026):] ~ Session 0x15e189681810002
for server null, unexpected error, closing socket connection and attempting reconnect (ClientCnxn$SendThread:1102)
java.net.ConnectException: Connection refused
	at sun.nio.ch.SocketChannelImpl.checkConnect(Native Method)
	at sun.nio.ch.SocketChannelImpl.finishConnect(SocketChannelImpl.java:744)
	at org.apache.zookeeper.ClientCnxnSocketNIO.doTransport(ClientCnxnSocketNIO.java:361)
	at org.apache.zookeeper.ClientCnxn$SendThread.run(ClientCnxn.java:1081)
Build step 'Execute shell' marked build as failure
[CHECKSTYLE] Collecting checkstyle analysis files...
[CHECKSTYLE] Searching for all files in <https://builds.apache.org/job/Atlas-master-IntegrationTests/ws/>
that match the pattern **/target/checkstyle-result.xml
[CHECKSTYLE] Parsing 24 files in <https://builds.apache.org/job/Atlas-master-IntegrationTests/ws/>
[CHECKSTYLE] Successfully parsed file <https://builds.apache.org/job/Atlas-master-IntegrationTests/ws/addons/hdfs-model/target/checkstyle-result.xml>
with 0 unique warnings and 0 duplicates.
[CHECKSTYLE] Successfully parsed file <https://builds.apache.org/job/Atlas-master-IntegrationTests/ws/addons/hive-bridge-shim/target/checkstyle-result.xml>
with 15 unique warnings and 0 duplicates.
[CHECKSTYLE] Successfully parsed file <https://builds.apache.org/job/Atlas-master-IntegrationTests/ws/authorization/target/checkstyle-result.xml>
with 482 unique warnings and 0 duplicates.
[CHECKSTYLE] Successfully parsed file <https://builds.apache.org/job/Atlas-master-IntegrationTests/ws/catalog/target/checkstyle-result.xml>
with 2619 unique warnings and 0 duplicates.
[CHECKSTYLE] Successfully parsed file <https://builds.apache.org/job/Atlas-master-IntegrationTests/ws/client/target/checkstyle-result.xml>
with 4256 unique warnings and 0 duplicates.
[CHECKSTYLE] Successfully parsed file <https://builds.apache.org/job/Atlas-master-IntegrationTests/ws/common/target/checkstyle-result.xml>
with 5468 unique warnings and 0 duplicates.
[CHECKSTYLE] Successfully parsed file <https://builds.apache.org/job/Atlas-master-IntegrationTests/ws/dashboardv2/target/checkstyle-result.xml>
with 5468 unique warnings and 0 duplicates.
[CHECKSTYLE] Successfully parsed file <https://builds.apache.org/job/Atlas-master-IntegrationTests/ws/docs/target/checkstyle-result.xml>
with 5468 unique warnings and 0 duplicates.
[CHECKSTYLE] Successfully parsed file <https://builds.apache.org/job/Atlas-master-IntegrationTests/ws/graphdb/api/target/checkstyle-result.xml>
with 5737 unique warnings and 0 duplicates.
[CHECKSTYLE] Successfully parsed file <https://builds.apache.org/job/Atlas-master-IntegrationTests/ws/graphdb/common/target/checkstyle-result.xml>
with 5924 unique warnings and 0 duplicates.
[CHECKSTYLE] Successfully parsed file <https://builds.apache.org/job/Atlas-master-IntegrationTests/ws/graphdb/graphdb-impls/target/checkstyle-result.xml>
with 5924 unique warnings and 0 duplicates.
[CHECKSTYLE] Successfully parsed file <https://builds.apache.org/job/Atlas-master-IntegrationTests/ws/graphdb/target/checkstyle-result.xml>
with 5924 unique warnings and 0 duplicates.
[CHECKSTYLE] Successfully parsed file <https://builds.apache.org/job/Atlas-master-IntegrationTests/ws/graphdb/titan0/target/checkstyle-result.xml>
with 8198 unique warnings and 0 duplicates.
[CHECKSTYLE] Successfully parsed file <https://builds.apache.org/job/Atlas-master-IntegrationTests/ws/graphdb/titan1/target/checkstyle-result.xml>
with 9146 unique warnings and 0 duplicates.
[CHECKSTYLE] Successfully parsed file <https://builds.apache.org/job/Atlas-master-IntegrationTests/ws/intg/target/checkstyle-result.xml>
with 16683 unique warnings and 0 duplicates.
[CHECKSTYLE] Successfully parsed file <https://builds.apache.org/job/Atlas-master-IntegrationTests/ws/notification/target/checkstyle-result.xml>
with 17893 unique warnings and 0 duplicates.
[CHECKSTYLE] Successfully parsed file <https://builds.apache.org/job/Atlas-master-IntegrationTests/ws/plugin-classloader/target/checkstyle-result.xml>
with 18001 unique warnings and 0 duplicates.
[CHECKSTYLE] Successfully parsed file <https://builds.apache.org/job/Atlas-master-IntegrationTests/ws/repository/target/checkstyle-result.xml>
with 37533 unique warnings and 0 duplicates.
[CHECKSTYLE] Successfully parsed file <https://builds.apache.org/job/Atlas-master-IntegrationTests/ws/server-api/target/checkstyle-result.xml>
with 37912 unique warnings and 0 duplicates.
[CHECKSTYLE] Successfully parsed file <https://builds.apache.org/job/Atlas-master-IntegrationTests/ws/shaded/hbase-client-shaded/target/checkstyle-result.xml>
with 37912 unique warnings and 0 duplicates.
[CHECKSTYLE] Successfully parsed file <https://builds.apache.org/job/Atlas-master-IntegrationTests/ws/shaded/hbase-server-shaded/target/checkstyle-result.xml>
with 37912 unique warnings and 0 duplicates.
[CHECKSTYLE] Successfully parsed file <https://builds.apache.org/job/Atlas-master-IntegrationTests/ws/target/checkstyle-result.xml>
with 37912 unique warnings and 0 duplicates.
[CHECKSTYLE] Successfully parsed file <https://builds.apache.org/job/Atlas-master-IntegrationTests/ws/typesystem/target/checkstyle-result.xml>
with 42130 unique warnings and 0 duplicates.
[CHECKSTYLE] Successfully parsed file <https://builds.apache.org/job/Atlas-master-IntegrationTests/ws/webapp/target/checkstyle-result.xml>
with 50218 unique warnings and 0 duplicates.
<Git Blamer> Using GitBlamer to create author and commit information for all warnings.
<Git Blamer> GIT_COMMIT=8686333985311f3ed907ffc71942eb7e92896808, workspace=<https://builds.apache.org/job/Atlas-master-IntegrationTests/ws/>
 > git rev-parse 8686333985311f3ed907ffc71942eb7e92896808^{commit} # timeout=10
[FINDBUGS] Collecting findbugs analysis files...
[FINDBUGS] Searching for all files in <https://builds.apache.org/job/Atlas-master-IntegrationTests/ws/>
that match the pattern **/target/findbugs.xml
[FINDBUGS] Parsing 15 files in <https://builds.apache.org/job/Atlas-master-IntegrationTests/ws/>
[FINDBUGS] Successfully parsed file <https://builds.apache.org/job/Atlas-master-IntegrationTests/ws/addons/hive-bridge-shim/target/findbugs.xml>
with 0 unique warnings and 0 duplicates.
[FINDBUGS] Successfully parsed file <https://builds.apache.org/job/Atlas-master-IntegrationTests/ws/authorization/target/findbugs.xml>
with 0 unique warnings and 0 duplicates.
[FINDBUGS] Successfully parsed file <https://builds.apache.org/job/Atlas-master-IntegrationTests/ws/catalog/target/findbugs.xml>
with 0 unique warnings and 0 duplicates.
[FINDBUGS] Successfully parsed file <https://builds.apache.org/job/Atlas-master-IntegrationTests/ws/client/target/findbugs.xml>
with 0 unique warnings and 0 duplicates.
[FINDBUGS] Successfully parsed file <https://builds.apache.org/job/Atlas-master-IntegrationTests/ws/common/target/findbugs.xml>
with 0 unique warnings and 0 duplicates.
[FINDBUGS] Successfully parsed file <https://builds.apache.org/job/Atlas-master-IntegrationTests/ws/graphdb/api/target/findbugs.xml>
with 0 unique warnings and 0 duplicates.
[FINDBUGS] Successfully parsed file <https://builds.apache.org/job/Atlas-master-IntegrationTests/ws/graphdb/common/target/findbugs.xml>
with 0 unique warnings and 0 duplicates.
[FINDBUGS] Successfully parsed file <https://builds.apache.org/job/Atlas-master-IntegrationTests/ws/graphdb/titan0/target/findbugs.xml>
with 0 unique warnings and 0 duplicates.
[FINDBUGS] Successfully parsed file <https://builds.apache.org/job/Atlas-master-IntegrationTests/ws/intg/target/findbugs.xml>
with 0 unique warnings and 0 duplicates.
[FINDBUGS] Successfully parsed file <https://builds.apache.org/job/Atlas-master-IntegrationTests/ws/notification/target/findbugs.xml>
with 0 unique warnings and 0 duplicates.
[FINDBUGS] Successfully parsed file <https://builds.apache.org/job/Atlas-master-IntegrationTests/ws/plugin-classloader/target/findbugs.xml>
with 0 unique warnings and 0 duplicates.
[FINDBUGS] Successfully parsed file <https://builds.apache.org/job/Atlas-master-IntegrationTests/ws/repository/target/findbugs.xml>
with 0 unique warnings and 0 duplicates.
[FINDBUGS] Successfully parsed file <https://builds.apache.org/job/Atlas-master-IntegrationTests/ws/server-api/target/findbugs.xml>
with 0 unique warnings and 0 duplicates.
[FINDBUGS] Successfully parsed file <https://builds.apache.org/job/Atlas-master-IntegrationTests/ws/typesystem/target/findbugs.xml>
with 0 unique warnings and 0 duplicates.
[FINDBUGS] Successfully parsed file <https://builds.apache.org/job/Atlas-master-IntegrationTests/ws/webapp/target/findbugs.xml>
with 0 unique warnings and 0 duplicates.
<Git Blamer> Using GitBlamer to create author and commit information for all warnings.
<Git Blamer> GIT_COMMIT=8686333985311f3ed907ffc71942eb7e92896808, workspace=<https://builds.apache.org/job/Atlas-master-IntegrationTests/ws/>
Archiving artifacts
[Fast Archiver] No prior successful build to compare, so performing full copy of artifacts
TestNG Reports Processing: START
Looking for TestNG results report in workspace using pattern: **/target/surefire-reports/testng-results.xml,**/target/failsafe-reports/testng-results.xml
Saving reports...
Processing '/x1/jenkins/jenkins-home/jobs/Atlas-master-IntegrationTests/builds/32/testng/testng-results-1.xml'
Processing '/x1/jenkins/jenkins-home/jobs/Atlas-master-IntegrationTests/builds/32/testng/testng-results.xml'
21.348314% of tests failed, which exceeded threshold of 0%. Marking build as UNSTABLE
TestNG Reports Processing: FINISH

Mime
View raw message