atlas-dev mailing list archives

Site index · List index
Message view « Date » · « Thread »
Top « Date » · « Thread »
From Apache Jenkins Server <jenk...@builds.apache.org>
Subject Build failed in Jenkins: Atlas-master-IntegrationTests #16
Date Thu, 17 Aug 2017 22:50:52 GMT
See <https://builds.apache.org/job/Atlas-master-IntegrationTests/16/display/redirect?page=changes>

Changes:

[ssubramanian] ATLAS-1988: added REST API to search for related entities

[ssubramanian] ATLAS-1988: Implement REST API to search for related entities - Add

[ssubramanian] ATLAS-1993: UI updates to show list of Tables in detail page hive_db

[ssubramanian] ATLAS-2050: Add helper method in relationship store to check if entity

------------------------------------------
[...truncated 645.12 KB...]
127.0.0.1 - - [17/Aug/2017:22:46:27 +0000] "POST /api/atlas/entities HTTP/1.1" 201 - "-" "Java/1.7.0_80"
127.0.0.1 - - [17/Aug/2017:22:46:27 +0000] "POST /api/atlas/entities HTTP/1.1" 201 - "-" "Java/1.7.0_80"
127.0.0.1 - - [17/Aug/2017:22:46:27 +0000] "POST /api/atlas/entities HTTP/1.1" 201 - "-" "Java/1.7.0_80"
127.0.0.1 - - [17/Aug/2017:22:46:27 +0000] "POST /api/atlas/entities HTTP/1.1" 400 - "-" "Java/1.7.0_80"
127.0.0.1 - - [17/Aug/2017:22:46:27 +0000] "POST /api/atlas/entities HTTP/1.1" 201 - "-" "Java/1.7.0_80"
127.0.0.1 - - [17/Aug/2017:22:46:27 +0000] "GET /api/atlas/v2/types/typedef/name/kAYQ74GAtD
HTTP/1.1" 404 - "-" "Java/1.7.0_80"
127.0.0.1 - - [17/Aug/2017:22:46:27 +0000] "POST /api/atlas/types HTTP/1.1" 201 - "-" "Java/1.7.0_80"
127.0.0.1 - - [17/Aug/2017:22:46:27 +0000] "POST /api/atlas/entities HTTP/1.1" 201 - "-" "Java/1.7.0_80"
127.0.0.1 - - [17/Aug/2017:22:46:27 +0000] "GET /api/atlas/entities/33977dad-9103-4773-8dac-9b9bfab39e76
HTTP/1.1" 200 - "-" "Java/1.7.0_80"
127.0.0.1 - - [17/Aug/2017:22:46:27 +0000] "GET /api/atlas/v2/entity/guid/fec634e6-540d-40f7-8081-35210f9fa81c
HTTP/1.1" 200 - "-" "Java/1.7.0_80"
127.0.0.1 - - [17/Aug/2017:22:46:27 +0000] "POST /api/atlas/v2/entity/ HTTP/1.1" 200 - "-"
"Java/1.7.0_80"
127.0.0.1 - - [17/Aug/2017:22:46:27 +0000] "POST /api/atlas/v2/entity/guid/random/classifications
HTTP/1.1" 404 - "-" "Java/1.7.0_80"
127.0.0.1 - - [17/Aug/2017:22:46:27 +0000] "POST /api/atlas/v2/entity/bulk/ HTTP/1.1" 200
- "-" "Java/1.7.0_80"
127.0.0.1 - - [17/Aug/2017:22:46:28 +0000] "POST /api/atlas/v2/entity/ HTTP/1.1" 200 - "-"
"Java/1.7.0_80"
127.0.0.1 - - [17/Aug/2017:22:46:28 +0000] "POST /api/atlas/v2/entity/ HTTP/1.1" 200 - "-"
"Java/1.7.0_80"
127.0.0.1 - - [17/Aug/2017:22:46:28 +0000] "DELETE /api/atlas/v2/entity/bulk/?guid=4d999f72-5cb3-4e78-a4d0-b53108f0e165&guid=dc5d6cec-76da-4f4c-a06b-d288a8e3a1c7
HTTP/1.1" 200 - "-" "Java/1.7.0_80"
127.0.0.1 - - [17/Aug/2017:22:46:28 +0000] "POST /api/atlas/v2/entity/ HTTP/1.1" 200 - "-"
"Java/1.7.0_80"
127.0.0.1 - - [17/Aug/2017:22:46:28 +0000] "DELETE /api/atlas/v2/entity/uniqueAttribute/type/hive_db_v2?attr:name=dbKvS4DIREPm%EE%80%B9%E1%85%83%E6%98%93%E3%97%AC%E9%97%87%E6%90%A7%E5%8E%A6%E0%A0%BC%E2%98%B6%EC%B1%93
HTTP/1.1" 200 - "-" "Java/1.7.0_80"
127.0.0.1 - - [17/Aug/2017:22:46:28 +0000] "DELETE /api/atlas/v2/entity/guid/random/classification/blah_trait
HTTP/1.1" 400 - "-" "Java/1.7.0_80"
127.0.0.1 - - [17/Aug/2017:22:46:28 +0000] "GET /api/atlas/discovery/search/dsl?query=hive_db_v2+where+name%3D'dbKvS4DIREPm'&limit=10&offset=0
HTTP/1.1" 200 - "-" "Java/1.7.0_80"
127.0.0.1 - - [17/Aug/2017:22:46:29 +0000] "GET /api/atlas/discovery/search/dsl?query=hive_db_v2+where+name%3D'dbKvS4DIREPm'&limit=10&offset=0
HTTP/1.1" 200 - "-" "Java/1.7.0_80"
127.0.0.1 - - [17/Aug/2017:22:46:29 +0000] "POST /api/atlas/v2/entity/ HTTP/1.1" 200 - "-"
"Java/1.7.0_80"
127.0.0.1 - - [17/Aug/2017:22:46:30 +0000] "GET /api/atlas/discovery/search/dsl?query=hive_db_v2+where+name%3D'dbKvS4DIREPm'&limit=10&offset=0
HTTP/1.1" 200 - "-" "Java/1.7.0_80"
127.0.0.1 - - [17/Aug/2017:22:46:30 +0000] "POST /api/atlas/v2/types/typedefs/ HTTP/1.1" 200
- "-" "Java/1.7.0_80"
127.0.0.1 - - [17/Aug/2017:22:46:30 +0000] "POST /api/atlas/v2/entity/ HTTP/1.1" 200 - "-"
"Java/1.7.0_80"
127.0.0.1 - - [17/Aug/2017:22:46:30 +0000] "PUT /api/atlas/v2/types/typedefs/ HTTP/1.1" 200
- "-" "Java/1.7.0_80"
127.0.0.1 - - [17/Aug/2017:22:46:31 +0000] "GET /api/atlas/v2/entity/guid/3e87f7e9-5e40-4ea2-9457-573a49a3052a
HTTP/1.1" 200 - "-" "Java/1.7.0_80"
127.0.0.1 - - [17/Aug/2017:22:46:31 +0000] "POST /api/atlas/v2/entity/ HTTP/1.1" 404 - "-"
"Java/1.7.0_80"
127.0.0.1 - - [17/Aug/2017:22:46:31 +0000] "POST /api/atlas/v2/entity/ HTTP/1.1" 200 - "-"
"Java/1.7.0_80"
127.0.0.1 - - [17/Aug/2017:22:46:31 +0000] "POST /api/atlas/v2/entity/ HTTP/1.1" 200 - "-"
"Java/1.7.0_80"
127.0.0.1 - - [17/Aug/2017:22:46:31 +0000] "GET /api/atlas/v2/entity/uniqueAttribute/type/hive_db_v2?attr:name=dbKvS4DIREPm
HTTP/1.1" 200 - "-" "Java/1.7.0_80"
127.0.0.1 - - [17/Aug/2017:22:46:31 +0000] "GET /api/atlas/v2/entity/guid/blah HTTP/1.1" 404
- "-" "Java/1.7.0_80"
127.0.0.1 - - [17/Aug/2017:22:46:31 +0000] "POST /api/atlas/v2/entity/ HTTP/1.1" 200 - "-"
"Java/1.7.0_80"
127.0.0.1 - - [17/Aug/2017:22:46:31 +0000] "GET /api/atlas/entities/b34ef7f1-35b8-4afc-b577-6b5baf40720f/audit?count=10
HTTP/1.1" 200 - "-" "Java/1.7.0_80"
127.0.0.1 - - [17/Aug/2017:22:46:31 +0000] "POST /api/atlas/v2/entity/ HTTP/1.1" 200 - "-"
"Java/1.7.0_80"
127.0.0.1 - - [17/Aug/2017:22:46:31 +0000] "POST /api/atlas/v2/entity/ HTTP/1.1" 200 - "-"
"Java/1.7.0_80"
127.0.0.1 - - [17/Aug/2017:22:46:31 +0000] "GET /api/atlas/v2/types/typedef/name/aEvZwpw6Cn
HTTP/1.1" 404 - "-" "Java/1.7.0_80"
127.0.0.1 - - [17/Aug/2017:22:46:31 +0000] "POST /api/atlas/v2/types/typedefs/ HTTP/1.1" 200
- "-" "Java/1.7.0_80"
127.0.0.1 - - [17/Aug/2017:22:46:31 +0000] "POST /api/atlas/v2/entity/ HTTP/1.1" 200 - "-"
"Java/1.7.0_80"
127.0.0.1 - - [17/Aug/2017:22:46:31 +0000] "GET /api/atlas/v2/entity/guid/e7ee0381-a461-4001-978a-711efa25148d
HTTP/1.1" 200 - "-" "Java/1.7.0_80"
127.0.0.1 - - [17/Aug/2017:22:46:31 +0000] "GET /api/atlas/discovery/search/dsl?query=from+hive_db_v1+name%3D%22dbRJJSmCiwEn%22
HTTP/1.1" 200 - "-" "Java/1.7.0_80"
127.0.0.1 - - [17/Aug/2017:22:46:32 +0000] "GET /api/atlas/discovery/search/dsl?query=from+blah
HTTP/1.1" 400 - "-" "Java/1.7.0_80"
127.0.0.1 - - [17/Aug/2017:22:46:32 +0000] "GET /api/atlas/discovery/search?query=* HTTP/1.1"
200 - "-" "Java/1.7.0_80"
127.0.0.1 - - [17/Aug/2017:22:46:32 +0000] "GET /api/atlas/discovery/search?query=from+hive_db_v1+name%3D%22dbRJJSmCiwEn%22
HTTP/1.1" 200 - "-" "Java/1.7.0_80"
127.0.0.1 - - [17/Aug/2017:22:46:33 +0000] "GET /api/atlas/discovery/search/gremlin?query=g.V.has('type',+'hive_table_v1').toList()
HTTP/1.1" 200 - "-" "Java/1.7.0_80"
127.0.0.1 - - [17/Aug/2017:22:46:34 +0000] "POST /api/atlas/v2/types/typedefs/ HTTP/1.1" 200
- "-" "Java/1.7.0_80"
127.0.0.1 - - [17/Aug/2017:22:46:34 +0000] "POST /api/atlas/v2/types/typedefs/ HTTP/1.1" 409
- "-" "Java/1.7.0_80"
127.0.0.1 - - [17/Aug/2017:22:46:34 +0000] "GET /api/atlas/v2/types/enumdef/name/blah HTTP/1.1"
404 - "-" "Java/1.7.0_80"
127.0.0.1 - - [17/Aug/2017:22:46:34 +0000] "GET /api/atlas/v2/types/enumdef/guid/blah HTTP/1.1"
404 - "-" "Java/1.7.0_80"
127.0.0.1 - - [17/Aug/2017:22:46:34 +0000] "GET /api/atlas/v2/types/structdef/name/blah HTTP/1.1"
404 - "-" "Java/1.7.0_80"
127.0.0.1 - - [17/Aug/2017:22:46:34 +0000] "GET /api/atlas/v2/types/structdef/guid/blah HTTP/1.1"
404 - "-" "Java/1.7.0_80"
127.0.0.1 - - [17/Aug/2017:22:46:34 +0000] "GET /api/atlas/v2/types/classificationdef/name/blah
HTTP/1.1" 404 - "-" "Java/1.7.0_80"
127.0.0.1 - - [17/Aug/2017:22:46:34 +0000] "GET /api/atlas/v2/types/classificationdef/guid/blah
HTTP/1.1" 404 - "-" "Java/1.7.0_80"
127.0.0.1 - - [17/Aug/2017:22:46:34 +0000] "GET /api/atlas/v2/types/entitydef/name/blah HTTP/1.1"
404 - "-" "Java/1.7.0_80"
127.0.0.1 - - [17/Aug/2017:22:46:34 +0000] "GET /api/atlas/v2/types/entitydef/guid/blah HTTP/1.1"
404 - "-" "Java/1.7.0_80"
127.0.0.1 - - [17/Aug/2017:22:46:34 +0000] "POST /api/atlas/v2/types/typedefs/ HTTP/1.1" 200
- "-" "Java/1.7.0_80"
127.0.0.1 - - [17/Aug/2017:22:46:34 +0000] "GET /api/atlas/v2/types/typedefs/?supertype=ABJdV6ay1wv&type=CLASS
HTTP/1.1" 200 - "-" "Java/1.7.0_80"
127.0.0.1 - - [17/Aug/2017:22:46:34 +0000] "GET /api/atlas/v2/types/typedefs/?notsupertype=Bq6mSIlbsea&supertype=ABJdV6ay1wv&type=CLASS
HTTP/1.1" 200 - "-" "Java/1.7.0_80"
127.0.0.1 - - [17/Aug/2017:22:46:34 +0000] "POST /api/atlas/v2/types/typedefs/ HTTP/1.1" 200
- "-" "Java/1.7.0_80"
127.0.0.1 - - [17/Aug/2017:22:46:34 +0000] "PUT /api/atlas/v2/types/typedefs/ HTTP/1.1" 200
- "-" "Java/1.7.0_80"
127.0.0.1 - - [17/Aug/2017:22:46:34 +0000] "GET /api/atlas/v2/types/typedefs/?type=ENTITY
HTTP/1.1" 200 - "-" "Java/1.7.0_80"
127.0.0.1 - - [17/Aug/2017:22:46:34 +0000] "POST /api/atlas/types HTTP/1.1" 201 - "-" "Java/1.7.0_80"
127.0.0.1 - - [17/Aug/2017:22:46:34 +0000] "POST /api/atlas/types HTTP/1.1" 409 - "-" "Java/1.7.0_80"
127.0.0.1 - - [17/Aug/2017:22:46:34 +0000] "GET /api/atlas/v2/types/typedef/name/Arw9K4ZxQas
HTTP/1.1" 404 - "-" "Java/1.7.0_80"
127.0.0.1 - - [17/Aug/2017:22:46:34 +0000] "POST /api/atlas/types HTTP/1.1" 201 - "-" "Java/1.7.0_80"
127.0.0.1 - - [17/Aug/2017:22:46:35 +0000] "GET /api/atlas/v2/types/typedef/name/A1WDJ5w2R9tX
HTTP/1.1" 404 - "-" "Java/1.7.0_80"
127.0.0.1 - - [17/Aug/2017:22:46:35 +0000] "POST /api/atlas/types HTTP/1.1" 201 - "-" "Java/1.7.0_80"
127.0.0.1 - - [17/Aug/2017:22:46:35 +0000] "GET /api/atlas/v2/types/typedef/name/BL8IxIh7wnu
HTTP/1.1" 404 - "-" "Java/1.7.0_80"
127.0.0.1 - - [17/Aug/2017:22:46:35 +0000] "POST /api/atlas/types HTTP/1.1" 201 - "-" "Java/1.7.0_80"
127.0.0.1 - - [17/Aug/2017:22:46:35 +0000] "GET /api/atlas/v2/types/typedef/name/CmDddsIf8Nf
HTTP/1.1" 404 - "-" "Java/1.7.0_80"
127.0.0.1 - - [17/Aug/2017:22:46:35 +0000] "POST /api/atlas/types HTTP/1.1" 201 - "-" "Java/1.7.0_80"
127.0.0.1 - - [17/Aug/2017:22:46:35 +0000] "GET /api/atlas/types?type=CLASS&supertype=Arw9K4ZxQas&notsupertype=BL8IxIh7wnu
HTTP/1.1" 200 - "-" "Java/1.7.0_80"
127.0.0.1 - - [17/Aug/2017:22:46:35 +0000] "GET /api/atlas/v2/types/typedef/name/class_trait
HTTP/1.1" 404 - "-" "Java/1.7.0_80"
127.0.0.1 - - [17/Aug/2017:22:46:35 +0000] "POST /api/atlas/types HTTP/1.1" 201 - "-" "Java/1.7.0_80"
127.0.0.1 - - [17/Aug/2017:22:46:35 +0000] "GET /api/atlas/v2/types/typedef/name/secure_trait
HTTP/1.1" 404 - "-" "Java/1.7.0_80"
127.0.0.1 - - [17/Aug/2017:22:46:35 +0000] "POST /api/atlas/types HTTP/1.1" 201 - "-" "Java/1.7.0_80"
127.0.0.1 - - [17/Aug/2017:22:46:35 +0000] "GET /api/atlas/v2/types/typedef/name/pii_trait
HTTP/1.1" 404 - "-" "Java/1.7.0_80"
127.0.0.1 - - [17/Aug/2017:22:46:35 +0000] "POST /api/atlas/types HTTP/1.1" 201 - "-" "Java/1.7.0_80"
127.0.0.1 - - [17/Aug/2017:22:46:35 +0000] "GET /api/atlas/v2/types/typedef/name/ssn_trait
HTTP/1.1" 404 - "-" "Java/1.7.0_80"
127.0.0.1 - - [17/Aug/2017:22:46:35 +0000] "POST /api/atlas/types HTTP/1.1" 201 - "-" "Java/1.7.0_80"
127.0.0.1 - - [17/Aug/2017:22:46:35 +0000] "GET /api/atlas/v2/types/typedef/name/salary_trait
HTTP/1.1" 404 - "-" "Java/1.7.0_80"
127.0.0.1 - - [17/Aug/2017:22:46:35 +0000] "POST /api/atlas/types HTTP/1.1" 201 - "-" "Java/1.7.0_80"
127.0.0.1 - - [17/Aug/2017:22:46:35 +0000] "GET /api/atlas/v2/types/typedef/name/sox_trait
HTTP/1.1" 404 - "-" "Java/1.7.0_80"
127.0.0.1 - - [17/Aug/2017:22:46:35 +0000] "POST /api/atlas/types HTTP/1.1" 201 - "-" "Java/1.7.0_80"
127.0.0.1 - - [17/Aug/2017:22:46:36 +0000] "GET /api/atlas/types?type=TRAIT HTTP/1.1" 200
- "-" "Java/1.7.0_80"
127.0.0.1 - - [17/Aug/2017:22:46:36 +0000] "POST /api/atlas/types HTTP/1.1" 201 - "-" "Java/1.7.0_80"
127.0.0.1 - - [17/Aug/2017:22:46:36 +0000] "PUT /api/atlas/types HTTP/1.1" 200 - "-" "Java/1.7.0_80"
127.0.0.1 - - [17/Aug/2017:22:46:36 +0000] "GET /api/atlas/types/Tv1LnjUwWG HTTP/1.1" 200
- "-" "Java/1.7.0_80"
127.0.0.1 - - [17/Aug/2017:22:46:36 +0000] "GET /api/atlas/types/blah HTTP/1.1" 404 - "-"
"Java/1.7.0_80"
Tests run: 133, Failures: 5, Errors: 0, Skipped: 5, Time elapsed: 232.76 sec <<<
FAILURE! - in TestSuite
runQuickStart(org.apache.atlas.examples.QuickStartV2IT)  Time elapsed: 0.552 sec  <<<
FAILURE!
org.apache.atlas.AtlasServiceException: Metadata service API org.apache.atlas.AtlasBaseClient$APIInfo@dc3f06d
failed with status 409 (Conflict) Response Body ({"errorCode":"ATLAS-409-00-001","errorMessage":"Given
type Dimension already exists"})
	at org.apache.atlas.examples.QuickStartV2IT.runQuickStart(QuickStartV2IT.java:49)

testDeleteByQualifiedName(org.apache.atlas.notification.NotificationHookConsumerIT)  Time
elapsed: 60.06 sec  <<< FAILURE!
java.lang.Exception: Waiting timed out after 60000 msec
	at org.apache.atlas.notification.NotificationHookConsumerIT.testDeleteByQualifiedName(NotificationHookConsumerIT.java:184)

testUpdateEntityPartial(org.apache.atlas.notification.NotificationHookConsumerIT)  Time elapsed:
60.063 sec  <<< FAILURE!
java.lang.Exception: Waiting timed out after 60000 msec
	at org.apache.atlas.notification.NotificationHookConsumerIT.testUpdateEntityPartial(NotificationHookConsumerIT.java:127)

testAddReferenceProperty(org.apache.atlas.web.integration.EntityJerseyResourceIT)  Time elapsed:
0.163 sec  <<< FAILURE!
java.lang.AssertionError: expected:<1> but was:<2>
	at org.apache.atlas.web.integration.EntityJerseyResourceIT.addProperty(EntityJerseyResourceIT.java:476)
	at org.apache.atlas.web.integration.EntityJerseyResourceIT.testAddReferenceProperty(EntityJerseyResourceIT.java:451)

testPartialUpdate(org.apache.atlas.web.integration.EntityJerseyResourceIT)  Time elapsed:
0.128 sec  <<< FAILURE!
java.lang.AssertionError: expected:<1> but was:<3>
	at org.apache.atlas.web.integration.EntityJerseyResourceIT.testPartialUpdate(EntityJerseyResourceIT.java:878)


Results :

Failed tests: 
  QuickStartV2IT.runQuickStart:49 » AtlasService Metadata service API org.apache...
  NotificationHookConsumerIT.testDeleteByQualifiedName:184->BaseResourceIT.waitFor:626
» 
  NotificationHookConsumerIT.testUpdateEntityPartial:127->BaseResourceIT.waitFor:626 »

  EntityJerseyResourceIT.testAddReferenceProperty:451->addProperty:476 expected:<1>
but was:<2>
  EntityJerseyResourceIT.testPartialUpdate:878 expected:<1> but was:<3>

Tests run: 133, Failures: 5, Errors: 0, Skipped: 5

[INFO] 
[INFO] --- jetty-maven-plugin:9.2.12.v20150709:stop (stop-jetty) @ atlas-webapp ---
[INFO] Waiting 10 seconds for jetty to stop
[INFO] Stopped ServerConnector@605a734e{HTTP/1.1}{0.0.0.0:31000}
[INFO] Closing Spring root WebApplicationContext
[INFO] Shutting down log4j
[INFO] Stopped o.e.j.m.p.JettyWebAppContext@1a357978{/,<https://builds.apache.org/job/Atlas-master-IntegrationTests/ws/webapp/target/atlas-webapp-0.9-SNAPSHOT/,UNAVAILABLE}{/home/jenkins/jenkins-slave/workspace/Atlas-master-IntegrationTests/webapp/target/atlas-webapp-0.9-SNAPSHOT.war}>
[INFO] Server reports itself as stopped
[INFO] 
[INFO] --- maven-source-plugin:2.4:jar-no-fork (attach-sources) @ atlas-webapp ---
[INFO] Building jar: <https://builds.apache.org/job/Atlas-master-IntegrationTests/ws/webapp/target/atlas-webapp-0.9-SNAPSHOT-sources.jar>
log4j:WARN No appenders could be found for logger (org.apache.zookeeper.ClientCnxn).
log4j:WARN Please initialize the log4j system properly.
log4j:WARN See http://logging.apache.org/log4j/1.2/faq.html#noconfig for more info.
[INFO] 
[INFO] --- maven-source-plugin:2.4:test-jar-no-fork (attach-sources) @ atlas-webapp ---
[INFO] Building jar: <https://builds.apache.org/job/Atlas-master-IntegrationTests/ws/webapp/target/atlas-webapp-0.9-SNAPSHOT-test-sources.jar>
[INFO] 
[INFO] --- maven-failsafe-plugin:2.19.1:verify (verify) @ atlas-webapp ---
[INFO] ------------------------------------------------------------------------
[INFO] Reactor Summary:
[INFO] 
[INFO] Apache Atlas Server Build Tools .................... SUCCESS [  0.853 s]
[INFO] apache-atlas ....................................... SUCCESS [  4.803 s]
[INFO] Apache Atlas Integration ........................... SUCCESS [ 28.448 s]
[INFO] Apache Atlas Common ................................ SUCCESS [ 14.332 s]
[INFO] Apache Atlas Typesystem ............................ SUCCESS [01:02 min]
[INFO] Apache Atlas Client ................................ SUCCESS [ 16.067 s]
[INFO] Apache Atlas Server API ............................ SUCCESS [  9.418 s]
[INFO] Apache Atlas Notification .......................... SUCCESS [ 15.560 s]
[INFO] Apache Atlas Graph Database Projects ............... SUCCESS [  0.629 s]
[INFO] Apache Atlas Graph Database API .................... SUCCESS [  7.491 s]
[INFO] Graph Database Common Code ......................... SUCCESS [  7.702 s]
[INFO] Apache Atlas Titan 1.0.0 GraphDB Impl .............. SUCCESS [ 34.015 s]
[INFO] Shaded version of Apache hbase client .............. SUCCESS [  8.741 s]
[INFO] Apache Atlas Titan 0.5.4 Graph DB Impl ............. SUCCESS [ 44.912 s]
[INFO] Apache Atlas Graph Database Implementation Dependencies SUCCESS [  0.895 s]
[INFO] Shaded version of Apache hbase server .............. SUCCESS [ 23.136 s]
[INFO] Apache Atlas Repository ............................ SUCCESS [01:46 min]
[INFO] Apache Atlas Authorization ......................... SUCCESS [ 11.198 s]
[INFO] Apache Atlas Business Catalog ...................... SUCCESS [ 15.670 s]
[INFO] Apache Atlas UI .................................... SUCCESS [01:05 min]
[INFO] Apache Atlas Web Application ....................... FAILURE [05:29 min]
[INFO] Apache Atlas Documentation ......................... SKIPPED
[INFO] Apache Atlas FileSystem Model ...................... SKIPPED
[INFO] Apache Atlas Plugin Classloader .................... SKIPPED
[INFO] Apache Atlas Hive Bridge Shim ...................... SKIPPED
[INFO] Apache Atlas Hive Bridge ........................... SKIPPED
[INFO] Apache Atlas Falcon Bridge Shim .................... SKIPPED
[INFO] Apache Atlas Falcon Bridge ......................... SKIPPED
[INFO] Apache Atlas Sqoop Bridge Shim ..................... SKIPPED
[INFO] Apache Atlas Sqoop Bridge .......................... SKIPPED
[INFO] Apache Atlas Storm Bridge Shim ..................... SKIPPED
[INFO] Apache Atlas Storm Bridge .......................... SKIPPED
[INFO] Apache Atlas Distribution .......................... SKIPPED
[INFO] ------------------------------------------------------------------------
[INFO] BUILD FAILURE
[INFO] ------------------------------------------------------------------------
[INFO] Total time: 13:30 min
[INFO] Finished at: 2017-08-17T22:46:46Z
[INFO] Final Memory: 369M/2285M
[INFO] ------------------------------------------------------------------------
[ERROR] Failed to execute goal org.apache.maven.plugins:maven-failsafe-plugin:2.19.1:verify
(verify) on project atlas-webapp: There are test failures.
[ERROR] 
[ERROR] Please refer to <https://builds.apache.org/job/Atlas-master-IntegrationTests/ws/webapp/target/failsafe-reports>
for the individual test results.
[ERROR] -> [Help 1]
[ERROR] 
[ERROR] To see the full stack trace of the errors, re-run Maven with the -e switch.
[ERROR] Re-run Maven using the -X switch to enable full debug logging.
[ERROR] 
[ERROR] For more information about the errors and possible solutions, please read the following
articles:
[ERROR] [Help 1] http://cwiki.apache.org/confluence/display/MAVEN/MojoFailureException
[ERROR] 
[ERROR] After correcting the problems, you can resume the build with the command
[ERROR]   mvn <goals> -rf :atlas-webapp
Build step 'Execute shell' marked build as failure
[CHECKSTYLE] Collecting checkstyle analysis files...
[CHECKSTYLE] Searching for all files in <https://builds.apache.org/job/Atlas-master-IntegrationTests/ws/>
that match the pattern **/target/checkstyle-result.xml
[CHECKSTYLE] Parsing 19 files in <https://builds.apache.org/job/Atlas-master-IntegrationTests/ws/>
[CHECKSTYLE] Successfully parsed file <https://builds.apache.org/job/Atlas-master-IntegrationTests/ws/authorization/target/checkstyle-result.xml>
with 467 unique warnings and 0 duplicates.
[CHECKSTYLE] Successfully parsed file <https://builds.apache.org/job/Atlas-master-IntegrationTests/ws/catalog/target/checkstyle-result.xml>
with 2612 unique warnings and 0 duplicates.
[CHECKSTYLE] Successfully parsed file <https://builds.apache.org/job/Atlas-master-IntegrationTests/ws/client/target/checkstyle-result.xml>
with 4249 unique warnings and 0 duplicates.
[CHECKSTYLE] Successfully parsed file <https://builds.apache.org/job/Atlas-master-IntegrationTests/ws/common/target/checkstyle-result.xml>
with 5461 unique warnings and 0 duplicates.
[CHECKSTYLE] Successfully parsed file <https://builds.apache.org/job/Atlas-master-IntegrationTests/ws/dashboardv2/target/checkstyle-result.xml>
with 5461 unique warnings and 0 duplicates.
[CHECKSTYLE] Successfully parsed file <https://builds.apache.org/job/Atlas-master-IntegrationTests/ws/graphdb/api/target/checkstyle-result.xml>
with 5730 unique warnings and 0 duplicates.
[CHECKSTYLE] Successfully parsed file <https://builds.apache.org/job/Atlas-master-IntegrationTests/ws/graphdb/common/target/checkstyle-result.xml>
with 5917 unique warnings and 0 duplicates.
[CHECKSTYLE] Successfully parsed file <https://builds.apache.org/job/Atlas-master-IntegrationTests/ws/graphdb/graphdb-impls/target/checkstyle-result.xml>
with 5917 unique warnings and 0 duplicates.
[CHECKSTYLE] Successfully parsed file <https://builds.apache.org/job/Atlas-master-IntegrationTests/ws/graphdb/target/checkstyle-result.xml>
with 5917 unique warnings and 0 duplicates.
[CHECKSTYLE] Successfully parsed file <https://builds.apache.org/job/Atlas-master-IntegrationTests/ws/graphdb/titan0/target/checkstyle-result.xml>
with 8191 unique warnings and 0 duplicates.
[CHECKSTYLE] Successfully parsed file <https://builds.apache.org/job/Atlas-master-IntegrationTests/ws/graphdb/titan1/target/checkstyle-result.xml>
with 9139 unique warnings and 0 duplicates.
[CHECKSTYLE] Successfully parsed file <https://builds.apache.org/job/Atlas-master-IntegrationTests/ws/intg/target/checkstyle-result.xml>
with 16649 unique warnings and 0 duplicates.
[CHECKSTYLE] Successfully parsed file <https://builds.apache.org/job/Atlas-master-IntegrationTests/ws/notification/target/checkstyle-result.xml>
with 17859 unique warnings and 0 duplicates.
[CHECKSTYLE] Successfully parsed file <https://builds.apache.org/job/Atlas-master-IntegrationTests/ws/repository/target/checkstyle-result.xml>
with 37362 unique warnings and 0 duplicates.
[CHECKSTYLE] Successfully parsed file <https://builds.apache.org/job/Atlas-master-IntegrationTests/ws/server-api/target/checkstyle-result.xml>
with 37741 unique warnings and 0 duplicates.
[CHECKSTYLE] Successfully parsed file <https://builds.apache.org/job/Atlas-master-IntegrationTests/ws/shaded/hbase-client-shaded/target/checkstyle-result.xml>
with 37741 unique warnings and 0 duplicates.
[CHECKSTYLE] Successfully parsed file <https://builds.apache.org/job/Atlas-master-IntegrationTests/ws/shaded/hbase-server-shaded/target/checkstyle-result.xml>
with 37741 unique warnings and 0 duplicates.
[CHECKSTYLE] Successfully parsed file <https://builds.apache.org/job/Atlas-master-IntegrationTests/ws/target/checkstyle-result.xml>
with 37741 unique warnings and 0 duplicates.
[CHECKSTYLE] Successfully parsed file <https://builds.apache.org/job/Atlas-master-IntegrationTests/ws/typesystem/target/checkstyle-result.xml>
with 41959 unique warnings and 0 duplicates.
<Git Blamer> Using GitBlamer to create author and commit information for all warnings.
<Git Blamer> GIT_COMMIT=a9514d4b1c22b653b8d3fa1d83204ab91dbefedd, workspace=<https://builds.apache.org/job/Atlas-master-IntegrationTests/ws/>
 > git rev-parse a9514d4b1c22b653b8d3fa1d83204ab91dbefedd^{commit} # timeout=10
[FINDBUGS] Collecting findbugs analysis files...
[FINDBUGS] Searching for all files in <https://builds.apache.org/job/Atlas-master-IntegrationTests/ws/>
that match the pattern **/target/findbugs.xml
[FINDBUGS] Parsing 12 files in <https://builds.apache.org/job/Atlas-master-IntegrationTests/ws/>
[FINDBUGS] Successfully parsed file <https://builds.apache.org/job/Atlas-master-IntegrationTests/ws/authorization/target/findbugs.xml>
with 0 unique warnings and 0 duplicates.
[FINDBUGS] Successfully parsed file <https://builds.apache.org/job/Atlas-master-IntegrationTests/ws/catalog/target/findbugs.xml>
with 0 unique warnings and 0 duplicates.
[FINDBUGS] Successfully parsed file <https://builds.apache.org/job/Atlas-master-IntegrationTests/ws/client/target/findbugs.xml>
with 0 unique warnings and 0 duplicates.
[FINDBUGS] Successfully parsed file <https://builds.apache.org/job/Atlas-master-IntegrationTests/ws/common/target/findbugs.xml>
with 0 unique warnings and 0 duplicates.
[FINDBUGS] Successfully parsed file <https://builds.apache.org/job/Atlas-master-IntegrationTests/ws/graphdb/api/target/findbugs.xml>
with 0 unique warnings and 0 duplicates.
[FINDBUGS] Successfully parsed file <https://builds.apache.org/job/Atlas-master-IntegrationTests/ws/graphdb/common/target/findbugs.xml>
with 0 unique warnings and 0 duplicates.
[FINDBUGS] Successfully parsed file <https://builds.apache.org/job/Atlas-master-IntegrationTests/ws/graphdb/titan0/target/findbugs.xml>
with 0 unique warnings and 0 duplicates.
[FINDBUGS] Successfully parsed file <https://builds.apache.org/job/Atlas-master-IntegrationTests/ws/intg/target/findbugs.xml>
with 0 unique warnings and 0 duplicates.
[FINDBUGS] Successfully parsed file <https://builds.apache.org/job/Atlas-master-IntegrationTests/ws/notification/target/findbugs.xml>
with 0 unique warnings and 0 duplicates.
[FINDBUGS] Successfully parsed file <https://builds.apache.org/job/Atlas-master-IntegrationTests/ws/repository/target/findbugs.xml>
with 0 unique warnings and 0 duplicates.
[FINDBUGS] Successfully parsed file <https://builds.apache.org/job/Atlas-master-IntegrationTests/ws/server-api/target/findbugs.xml>
with 0 unique warnings and 0 duplicates.
[FINDBUGS] Successfully parsed file <https://builds.apache.org/job/Atlas-master-IntegrationTests/ws/typesystem/target/findbugs.xml>
with 0 unique warnings and 0 duplicates.
<Git Blamer> Using GitBlamer to create author and commit information for all warnings.
<Git Blamer> GIT_COMMIT=a9514d4b1c22b653b8d3fa1d83204ab91dbefedd, workspace=<https://builds.apache.org/job/Atlas-master-IntegrationTests/ws/>
Archiving artifacts
[Fast Archiver] No prior successful build to compare, so performing full copy of artifacts
TestNG Reports Processing: START
Looking for TestNG results report in workspace using pattern: **/target/surefire-reports/testng-results.xml,**/target/failsafe-reports/testng-results.xml
Saving reports...
Processing '/x1/jenkins/jenkins-home/jobs/Atlas-master-IntegrationTests/builds/16/testng/testng-results.xml'
3.030303% of tests failed, which exceeded threshold of 0%. Marking build as UNSTABLE
TestNG Reports Processing: FINISH

Mime
View raw message