atlas-dev mailing list archives

Site index · List index
Message view « Date » · « Thread »
Top « Date » · « Thread »
From Apache Jenkins Server <jenk...@builds.apache.org>
Subject Build failed in Jenkins: Atlas-master-IntegrationTests #52
Date Wed, 30 Aug 2017 19:53:06 GMT
See <https://builds.apache.org/job/Atlas-master-IntegrationTests/52/display/redirect?page=changes>

Changes:

[ssubramanian] ATLAS-2054: Add flag to exclude attribute mapping in FullTextMapper

------------------------------------------
[...truncated 489.11 KB...]
127.0.0.1 - - [30/Aug/2017:19:47:55 +0000] "POST /api/atlas/v2/entity/ HTTP/1.1" 200 - "-"
"Java/1.7.0_80"
127.0.0.1 - - [30/Aug/2017:19:47:56 +0000] "DELETE /api/atlas/v2/entity/bulk/?guid=f9c72e6a-2ab6-4ea4-b01d-4aa5737f7eba&guid=ae2915f2-25ca-4f7f-9223-26084c59f92e
HTTP/1.1" 200 - "-" "Java/1.7.0_80"
127.0.0.1 - - [30/Aug/2017:19:47:56 +0000] "POST /api/atlas/v2/entity/ HTTP/1.1" 200 - "-"
"Java/1.7.0_80"
127.0.0.1 - - [30/Aug/2017:19:47:56 +0000] "DELETE /api/atlas/v2/entity/uniqueAttribute/type/hive_db_v2?attr:name=dbYDIYPAu8ME%DE%91%EB%B8%AB%EF%9C%99%EC%86%A9%E9%A8%B5%E0%A3%8F%E9%9A%93%E6%8A%A3%E7%B9%96%E2%B2%BE
HTTP/1.1" 200 - "-" "Java/1.7.0_80"
127.0.0.1 - - [30/Aug/2017:19:47:56 +0000] "DELETE /api/atlas/v2/entity/guid/random/classification/blah_trait
HTTP/1.1" 400 - "-" "Java/1.7.0_80"
127.0.0.1 - - [30/Aug/2017:19:47:56 +0000] "GET /api/atlas/discovery/search/dsl?query=hive_db_v2+where+name%3D'dbYDIYPAu8ME'&limit=10&offset=0
HTTP/1.1" 200 - "-" "Java/1.7.0_80"
127.0.0.1 - - [30/Aug/2017:19:47:57 +0000] "GET /api/atlas/discovery/search/dsl?query=hive_db_v2+where+name%3D'dbYDIYPAu8ME'&limit=10&offset=0
HTTP/1.1" 200 - "-" "Java/1.7.0_80"
127.0.0.1 - - [30/Aug/2017:19:47:58 +0000] "POST /api/atlas/v2/entity/ HTTP/1.1" 200 - "-"
"Java/1.7.0_80"
127.0.0.1 - - [30/Aug/2017:19:47:58 +0000] "GET /api/atlas/discovery/search/dsl?query=hive_db_v2+where+name%3D'dbYDIYPAu8ME'&limit=10&offset=0
HTTP/1.1" 200 - "-" "Java/1.7.0_80"
127.0.0.1 - - [30/Aug/2017:19:47:59 +0000] "POST /api/atlas/v2/types/typedefs/ HTTP/1.1" 200
- "-" "Java/1.7.0_80"
127.0.0.1 - - [30/Aug/2017:19:47:59 +0000] "POST /api/atlas/v2/entity/ HTTP/1.1" 200 - "-"
"Java/1.7.0_80"
127.0.0.1 - - [30/Aug/2017:19:48:00 +0000] "PUT /api/atlas/v2/types/typedefs/ HTTP/1.1" 200
- "-" "Java/1.7.0_80"
127.0.0.1 - - [30/Aug/2017:19:48:00 +0000] "GET /api/atlas/v2/entity/guid/6da7cb32-9934-45f7-872f-4293a686ad94
HTTP/1.1" 200 - "-" "Java/1.7.0_80"
127.0.0.1 - - [30/Aug/2017:19:48:00 +0000] "POST /api/atlas/v2/entity/ HTTP/1.1" 404 - "-"
"Java/1.7.0_80"
127.0.0.1 - - [30/Aug/2017:19:48:00 +0000] "POST /api/atlas/v2/entity/ HTTP/1.1" 200 - "-"
"Java/1.7.0_80"
127.0.0.1 - - [30/Aug/2017:19:48:00 +0000] "POST /api/atlas/v2/entity/ HTTP/1.1" 200 - "-"
"Java/1.7.0_80"
127.0.0.1 - - [30/Aug/2017:19:48:00 +0000] "GET /api/atlas/v2/entity/uniqueAttribute/type/hive_db_v2?attr:name=dbYDIYPAu8ME
HTTP/1.1" 200 - "-" "Java/1.7.0_80"
127.0.0.1 - - [30/Aug/2017:19:48:00 +0000] "GET /api/atlas/v2/entity/guid/blah HTTP/1.1" 404
- "-" "Java/1.7.0_80"
127.0.0.1 - - [30/Aug/2017:19:48:00 +0000] "POST /api/atlas/v2/entity/ HTTP/1.1" 200 - "-"
"Java/1.7.0_80"
127.0.0.1 - - [30/Aug/2017:19:48:00 +0000] "GET /api/atlas/entities/734d506e-d92c-44e4-bcb1-d0b6279226c4/audit?count=10
HTTP/1.1" 200 - "-" "Java/1.7.0_80"
127.0.0.1 - - [30/Aug/2017:19:48:00 +0000] "POST /api/atlas/v2/entity/ HTTP/1.1" 200 - "-"
"Java/1.7.0_80"
127.0.0.1 - - [30/Aug/2017:19:48:00 +0000] "POST /api/atlas/v2/entity/ HTTP/1.1" 200 - "-"
"Java/1.7.0_80"
127.0.0.1 - - [30/Aug/2017:19:48:01 +0000] "GET /api/atlas/v2/types/typedef/name/CyBg7U40wS
HTTP/1.1" 404 - "-" "Java/1.7.0_80"
127.0.0.1 - - [30/Aug/2017:19:48:01 +0000] "POST /api/atlas/v2/types/typedefs/ HTTP/1.1" 200
- "-" "Java/1.7.0_80"
127.0.0.1 - - [30/Aug/2017:19:48:01 +0000] "POST /api/atlas/v2/entity/ HTTP/1.1" 200 - "-"
"Java/1.7.0_80"
127.0.0.1 - - [30/Aug/2017:19:48:01 +0000] "GET /api/atlas/v2/entity/guid/d7e78acb-7d9c-4d21-87e0-5438cf0ca926
HTTP/1.1" 200 - "-" "Java/1.7.0_80"
127.0.0.1 - - [30/Aug/2017:19:48:01 +0000] "GET /api/atlas/discovery/search/dsl?query=from+hive_db_v1+name%3D%22dbn8YQBUxzvN%22
HTTP/1.1" 200 - "-" "Java/1.7.0_80"
127.0.0.1 - - [30/Aug/2017:19:48:02 +0000] "GET /api/atlas/discovery/search/dsl?query=from+blah
HTTP/1.1" 400 - "-" "Java/1.7.0_80"
127.0.0.1 - - [30/Aug/2017:19:48:02 +0000] "GET /api/atlas/discovery/search?query=* HTTP/1.1"
200 - "-" "Java/1.7.0_80"
127.0.0.1 - - [30/Aug/2017:19:48:02 +0000] "GET /api/atlas/discovery/search?query=from+hive_db_v1+name%3D%22dbn8YQBUxzvN%22
HTTP/1.1" 200 - "-" "Java/1.7.0_80"
127.0.0.1 - - [30/Aug/2017:19:48:03 +0000] "GET /api/atlas/discovery/search/gremlin?query=g.V.has('type',+'hive_table_v1').toList()
HTTP/1.1" 200 - "-" "Java/1.7.0_80"
127.0.0.1 - - [30/Aug/2017:19:48:04 +0000] "POST /api/atlas/v2/types/typedefs/ HTTP/1.1" 200
- "-" "Java/1.7.0_80"
127.0.0.1 - - [30/Aug/2017:19:48:05 +0000] "POST /api/atlas/v2/types/typedefs/ HTTP/1.1" 409
- "-" "Java/1.7.0_80"
127.0.0.1 - - [30/Aug/2017:19:48:05 +0000] "GET /api/atlas/v2/types/enumdef/name/blah HTTP/1.1"
404 - "-" "Java/1.7.0_80"
127.0.0.1 - - [30/Aug/2017:19:48:05 +0000] "GET /api/atlas/v2/types/enumdef/guid/blah HTTP/1.1"
404 - "-" "Java/1.7.0_80"
127.0.0.1 - - [30/Aug/2017:19:48:05 +0000] "GET /api/atlas/v2/types/structdef/name/blah HTTP/1.1"
404 - "-" "Java/1.7.0_80"
127.0.0.1 - - [30/Aug/2017:19:48:05 +0000] "GET /api/atlas/v2/types/structdef/guid/blah HTTP/1.1"
404 - "-" "Java/1.7.0_80"
127.0.0.1 - - [30/Aug/2017:19:48:05 +0000] "GET /api/atlas/v2/types/classificationdef/name/blah
HTTP/1.1" 404 - "-" "Java/1.7.0_80"
127.0.0.1 - - [30/Aug/2017:19:48:05 +0000] "GET /api/atlas/v2/types/classificationdef/guid/blah
HTTP/1.1" 404 - "-" "Java/1.7.0_80"
127.0.0.1 - - [30/Aug/2017:19:48:05 +0000] "GET /api/atlas/v2/types/entitydef/name/blah HTTP/1.1"
404 - "-" "Java/1.7.0_80"
127.0.0.1 - - [30/Aug/2017:19:48:05 +0000] "GET /api/atlas/v2/types/entitydef/guid/blah HTTP/1.1"
404 - "-" "Java/1.7.0_80"
127.0.0.1 - - [30/Aug/2017:19:48:05 +0000] "POST /api/atlas/v2/types/typedefs/ HTTP/1.1" 200
- "-" "Java/1.7.0_80"
127.0.0.1 - - [30/Aug/2017:19:48:05 +0000] "GET /api/atlas/v2/types/typedefs/?supertype=AHBnACUgRWy&type=CLASS
HTTP/1.1" 200 - "-" "Java/1.7.0_80"
127.0.0.1 - - [30/Aug/2017:19:48:05 +0000] "GET /api/atlas/v2/types/typedefs/?notsupertype=BvvIfKSkCDO&supertype=AHBnACUgRWy&type=CLASS
HTTP/1.1" 200 - "-" "Java/1.7.0_80"
127.0.0.1 - - [30/Aug/2017:19:48:05 +0000] "POST /api/atlas/v2/types/typedefs/ HTTP/1.1" 200
- "-" "Java/1.7.0_80"
127.0.0.1 - - [30/Aug/2017:19:48:06 +0000] "PUT /api/atlas/v2/types/typedefs/ HTTP/1.1" 200
- "-" "Java/1.7.0_80"
127.0.0.1 - - [30/Aug/2017:19:48:06 +0000] "GET /api/atlas/v2/types/typedefs/?type=ENTITY
HTTP/1.1" 200 - "-" "Java/1.7.0_80"
127.0.0.1 - - [30/Aug/2017:19:48:06 +0000] "POST /api/atlas/types HTTP/1.1" 201 - "-" "Java/1.7.0_80"
127.0.0.1 - - [30/Aug/2017:19:48:07 +0000] "POST /api/atlas/types HTTP/1.1" 409 - "-" "Java/1.7.0_80"
127.0.0.1 - - [30/Aug/2017:19:48:07 +0000] "GET /api/atlas/types/blah HTTP/1.1" 404 - "-"
"Java/1.7.0_80"
127.0.0.1 - - [30/Aug/2017:19:48:07 +0000] "GET /api/atlas/v2/types/typedef/name/class_trait
HTTP/1.1" 404 - "-" "Java/1.7.0_80"
127.0.0.1 - - [30/Aug/2017:19:48:07 +0000] "POST /api/atlas/types HTTP/1.1" 201 - "-" "Java/1.7.0_80"
127.0.0.1 - - [30/Aug/2017:19:48:07 +0000] "GET /api/atlas/v2/types/typedef/name/secure_trait
HTTP/1.1" 404 - "-" "Java/1.7.0_80"
127.0.0.1 - - [30/Aug/2017:19:48:07 +0000] "POST /api/atlas/types HTTP/1.1" 201 - "-" "Java/1.7.0_80"
127.0.0.1 - - [30/Aug/2017:19:48:07 +0000] "GET /api/atlas/v2/types/typedef/name/pii_trait
HTTP/1.1" 404 - "-" "Java/1.7.0_80"
127.0.0.1 - - [30/Aug/2017:19:48:07 +0000] "POST /api/atlas/types HTTP/1.1" 201 - "-" "Java/1.7.0_80"
127.0.0.1 - - [30/Aug/2017:19:48:07 +0000] "GET /api/atlas/v2/types/typedef/name/ssn_trait
HTTP/1.1" 404 - "-" "Java/1.7.0_80"
127.0.0.1 - - [30/Aug/2017:19:48:07 +0000] "POST /api/atlas/types HTTP/1.1" 201 - "-" "Java/1.7.0_80"
127.0.0.1 - - [30/Aug/2017:19:48:07 +0000] "GET /api/atlas/v2/types/typedef/name/salary_trait
HTTP/1.1" 404 - "-" "Java/1.7.0_80"
127.0.0.1 - - [30/Aug/2017:19:48:07 +0000] "POST /api/atlas/types HTTP/1.1" 201 - "-" "Java/1.7.0_80"
127.0.0.1 - - [30/Aug/2017:19:48:08 +0000] "GET /api/atlas/v2/types/typedef/name/sox_trait
HTTP/1.1" 404 - "-" "Java/1.7.0_80"
127.0.0.1 - - [30/Aug/2017:19:48:08 +0000] "POST /api/atlas/types HTTP/1.1" 201 - "-" "Java/1.7.0_80"
127.0.0.1 - - [30/Aug/2017:19:48:08 +0000] "GET /api/atlas/types?type=TRAIT HTTP/1.1" 200
- "-" "Java/1.7.0_80"
127.0.0.1 - - [30/Aug/2017:19:48:08 +0000] "GET /api/atlas/v2/types/typedef/name/AMfxIvNX3Kc
HTTP/1.1" 404 - "-" "Java/1.7.0_80"
127.0.0.1 - - [30/Aug/2017:19:48:08 +0000] "POST /api/atlas/types HTTP/1.1" 201 - "-" "Java/1.7.0_80"
127.0.0.1 - - [30/Aug/2017:19:48:08 +0000] "GET /api/atlas/v2/types/typedef/name/A1bs7Ye4K6gN
HTTP/1.1" 404 - "-" "Java/1.7.0_80"
127.0.0.1 - - [30/Aug/2017:19:48:08 +0000] "POST /api/atlas/types HTTP/1.1" 201 - "-" "Java/1.7.0_80"
127.0.0.1 - - [30/Aug/2017:19:48:08 +0000] "GET /api/atlas/v2/types/typedef/name/BXcpRJGBNfr
HTTP/1.1" 404 - "-" "Java/1.7.0_80"
127.0.0.1 - - [30/Aug/2017:19:48:08 +0000] "POST /api/atlas/types HTTP/1.1" 201 - "-" "Java/1.7.0_80"
127.0.0.1 - - [30/Aug/2017:19:48:09 +0000] "GET /api/atlas/v2/types/typedef/name/CvGsG0UmR8Z
HTTP/1.1" 404 - "-" "Java/1.7.0_80"
127.0.0.1 - - [30/Aug/2017:19:48:09 +0000] "POST /api/atlas/types HTTP/1.1" 201 - "-" "Java/1.7.0_80"
127.0.0.1 - - [30/Aug/2017:19:48:09 +0000] "GET /api/atlas/types?type=CLASS&supertype=AMfxIvNX3Kc&notsupertype=BXcpRJGBNfr
HTTP/1.1" 200 - "-" "Java/1.7.0_80"
127.0.0.1 - - [30/Aug/2017:19:48:09 +0000] "POST /api/atlas/types HTTP/1.1" 201 - "-" "Java/1.7.0_80"
127.0.0.1 - - [30/Aug/2017:19:48:09 +0000] "PUT /api/atlas/types HTTP/1.1" 200 - "-" "Java/1.7.0_80"
127.0.0.1 - - [30/Aug/2017:19:48:10 +0000] "GET /api/atlas/types/Q8irUfMkY2 HTTP/1.1" 200
- "-" "Java/1.7.0_80"
127.0.0.1 - - [30/Aug/2017:19:48:11 +0000] "GET /api/atlas/v2/types/typedef/name/tableType
HTTP/1.1" 200 - "-" "Java/1.7.0_80"
127.0.0.1 - - [30/Aug/2017:19:48:11 +0000] "GET /api/atlas/v2/types/typedef/name/serdeType
HTTP/1.1" 200 - "-" "Java/1.7.0_80"
127.0.0.1 - - [30/Aug/2017:19:48:11 +0000] "GET /api/atlas/v2/types/typedef/name/classification
HTTP/1.1" 200 - "-" "Java/1.7.0_80"
127.0.0.1 - - [30/Aug/2017:19:48:11 +0000] "GET /api/atlas/v2/types/typedef/name/pii HTTP/1.1"
200 - "-" "Java/1.7.0_80"
127.0.0.1 - - [30/Aug/2017:19:48:11 +0000] "GET /api/atlas/v2/types/typedef/name/phi HTTP/1.1"
200 - "-" "Java/1.7.0_80"
127.0.0.1 - - [30/Aug/2017:19:48:11 +0000] "GET /api/atlas/v2/types/typedef/name/pci HTTP/1.1"
200 - "-" "Java/1.7.0_80"
127.0.0.1 - - [30/Aug/2017:19:48:11 +0000] "GET /api/atlas/v2/types/typedef/name/sox HTTP/1.1"
200 - "-" "Java/1.7.0_80"
127.0.0.1 - - [30/Aug/2017:19:48:11 +0000] "GET /api/atlas/v2/types/typedef/name/sec HTTP/1.1"
200 - "-" "Java/1.7.0_80"
127.0.0.1 - - [30/Aug/2017:19:48:11 +0000] "GET /api/atlas/v2/types/typedef/name/finance HTTP/1.1"
200 - "-" "Java/1.7.0_80"
127.0.0.1 - - [30/Aug/2017:19:48:11 +0000] "GET /api/atlas/v2/types/typedef/name/FacteSggY4Gboj
HTTP/1.1" 404 - "-" "Java/1.7.0_80"
127.0.0.1 - - [30/Aug/2017:19:48:11 +0000] "GET /api/atlas/v2/types/typedef/name/ETLDqh1WvWnHf
HTTP/1.1" 404 - "-" "Java/1.7.0_80"
127.0.0.1 - - [30/Aug/2017:19:48:11 +0000] "GET /api/atlas/v2/types/typedef/name/Dimensionzwt6JcaEli
HTTP/1.1" 404 - "-" "Java/1.7.0_80"
127.0.0.1 - - [30/Aug/2017:19:48:11 +0000] "GET /api/atlas/v2/types/typedef/name/MetricaS5fwDFQMa
HTTP/1.1" 404 - "-" "Java/1.7.0_80"
127.0.0.1 - - [30/Aug/2017:19:48:11 +0000] "GET /api/atlas/v2/types/typedef/name/hive_db_v1
HTTP/1.1" 200 - "-" "Java/1.7.0_80"
127.0.0.1 - - [30/Aug/2017:19:48:11 +0000] "GET /api/atlas/v2/types/typedef/name/hive_column_v1
HTTP/1.1" 200 - "-" "Java/1.7.0_80"
127.0.0.1 - - [30/Aug/2017:19:48:11 +0000] "GET /api/atlas/v2/types/typedef/name/hive_table_v1
HTTP/1.1" 200 - "-" "Java/1.7.0_80"
127.0.0.1 - - [30/Aug/2017:19:48:11 +0000] "GET /api/atlas/v2/types/typedef/name/hive_process_v1
HTTP/1.1" 200 - "-" "Java/1.7.0_80"
127.0.0.1 - - [30/Aug/2017:19:48:11 +0000] "POST /api/atlas/types HTTP/1.1" 201 - "-" "Java/1.7.0_80"
127.0.0.1 - - [30/Aug/2017:19:48:11 +0000] "POST /api/atlas/entities HTTP/1.1" 201 - "-" "Java/1.7.0_80"
127.0.0.1 - - [30/Aug/2017:19:48:13 +0000] "GET /api/atlas/discovery/search/dsl?query=hive_db+where+qualifiedName%3D'dbSM6SsOQW3T'&limit=10&offset=0
HTTP/1.1" 200 - "-" "Java/1.7.0_80"
127.0.0.1 - - [30/Aug/2017:19:48:14 +0000] "GET /api/atlas/entities?type=hive_db&property=qualifiedName&value=dbSM6SsOQW3T
HTTP/1.1" 200 - "-" "Java/1.7.0_80"
127.0.0.1 - - [30/Aug/2017:19:48:14 +0000] "POST /api/atlas/entities HTTP/1.1" 201 - "-" "Java/1.7.0_80"
127.0.0.1 - - [30/Aug/2017:19:48:15 +0000] "GET /api/atlas/discovery/search/dsl?query=hive_db+where+qualifiedName%3D'dbFhjjGLamgB'&limit=10&offset=0
HTTP/1.1" 200 - "-" "Java/1.7.0_80"
127.0.0.1 - - [30/Aug/2017:19:48:16 +0000] "GET /api/atlas/discovery/search/dsl?query=hive_db+where+qualifiedName%3D'dbz45h7bCBwx'&limit=10&offset=0
HTTP/1.1" 200 - "-" "Java/1.7.0_80"
127.0.0.1 - - [30/Aug/2017:19:48:18 +0000] "GET /api/atlas/discovery/search/dsl?query=hive_db+where+qualifiedName%3D'dbbtC9MzSgTT'&limit=10&offset=0
HTTP/1.1" 200 - "-" "Java/1.7.0_80"
127.0.0.1 - - [30/Aug/2017:19:48:19 +0000] "GET /api/atlas/entities?type=hive_db&property=qualifiedName&value=dbbtC9MzSgTT
HTTP/1.1" 200 - "-" "Java/1.7.0_80"
127.0.0.1 - - [30/Aug/2017:19:48:19 +0000] "GET /api/atlas/entities/b976e416-6374-44a4-ab36-3dd74214d38b/audit?count=1
HTTP/1.1" 200 - "-" "Java/1.7.0_80"
127.0.0.1 - - [30/Aug/2017:19:48:21 +0000] "GET /api/atlas/discovery/search/dsl?query=hive_db+where+name%3D'dbWuLRuFNpSd'&limit=10&offset=0
HTTP/1.1" 200 - "-" "Java/1.7.0_80"
127.0.0.1 - - [30/Aug/2017:19:48:22 +0000] "POST /api/atlas/entities HTTP/1.1" 201 - "-" "Java/1.7.0_80"
127.0.0.1 - - [30/Aug/2017:19:48:23 +0000] "GET /api/atlas/entities?type=hive_db&property=qualifiedName&value=dbO3JQeevpHb
HTTP/1.1" 200 - "-" "Java/1.7.0_80"
127.0.0.1 - - [30/Aug/2017:19:48:23 +0000] "GET /api/atlas/entities?type=hive_db&property=qualifiedName&value=dbO3JQeevpHb
HTTP/1.1" 200 - "-" "Java/1.7.0_80"
127.0.0.1 - - [30/Aug/2017:19:48:23 +0000] "POST /api/atlas/entities HTTP/1.1" 201 - "-" "Java/1.7.0_80"
127.0.0.1 - - [30/Aug/2017:19:48:24 +0000] "GET /api/atlas/entities/b5a30db7-1cb3-4369-89be-fedf19a8530a
HTTP/1.1" 200 - "-" "Java/1.7.0_80"
127.0.0.1 - - [30/Aug/2017:19:48:24 +0000] "GET /api/atlas/admin/version HTTP/1.1" 200 - "-"
"Java/1.7.0_80"
127.0.0.1 - - [30/Aug/2017:19:48:44 +0000] "POST /api/atlas/v2/types/typedefs/ HTTP/1.1" 409
- "-" "Java/1.7.0_80"
Tests run: 134, Failures: 1, Errors: 0, Skipped: 5, Time elapsed: 180.061 sec <<<
FAILURE! - in TestSuite
runQuickStart(org.apache.atlas.examples.QuickStartV2IT)  Time elapsed: 0.664 sec  <<<
FAILURE!
org.apache.atlas.AtlasServiceException: Metadata service API org.apache.atlas.AtlasBaseClient$APIInfo@74e4ab7d
failed with status 409 (Conflict) Response Body ({"errorCode":"ATLAS-409-00-001","errorMessage":"Given
type Dimension already exists"})
	at org.apache.atlas.examples.QuickStartV2IT.runQuickStart(QuickStartV2IT.java:49)


Results :

Failed tests: 
  QuickStartV2IT.runQuickStart:49 » AtlasService Metadata service API org.apache...

Tests run: 134, Failures: 1, Errors: 0, Skipped: 5

[INFO] 
[INFO] --- jetty-maven-plugin:9.2.12.v20150709:stop (stop-jetty) @ atlas-webapp ---
[INFO] Waiting 10 seconds for jetty to stop
[INFO] Stopped ServerConnector@2d6fca83{HTTP/1.1}{0.0.0.0:31000}
[INFO] Closing Spring root WebApplicationContext
[INFO] Shutting down log4j
[INFO] Stopped o.e.j.m.p.JettyWebAppContext@4d95adb1{/,<https://builds.apache.org/job/Atlas-master-IntegrationTests/ws/webapp/target/atlas-webapp-0.9-SNAPSHOT/,UNAVAILABLE}{/home/jenkins/jenkins-slave/workspace/Atlas-master-IntegrationTests/webapp/target/atlas-webapp-0.9-SNAPSHOT.war}>
[INFO] Server reports itself as stopped
[INFO] 
[INFO] --- maven-source-plugin:2.4:jar-no-fork (attach-sources) @ atlas-webapp ---
[INFO] Building jar: <https://builds.apache.org/job/Atlas-master-IntegrationTests/ws/webapp/target/atlas-webapp-0.9-SNAPSHOT-sources.jar>
[INFO] 
[INFO] --- maven-source-plugin:2.4:test-jar-no-fork (attach-sources) @ atlas-webapp ---
[INFO] Building jar: <https://builds.apache.org/job/Atlas-master-IntegrationTests/ws/webapp/target/atlas-webapp-0.9-SNAPSHOT-test-sources.jar>
[INFO] 
[INFO] --- maven-failsafe-plugin:2.19.1:verify (verify) @ atlas-webapp ---
[INFO] ------------------------------------------------------------------------
[INFO] Reactor Summary:
[INFO] 
[INFO] Apache Atlas Server Build Tools .................... SUCCESS [  1.123 s]
[INFO] apache-atlas ....................................... SUCCESS [  6.033 s]
[INFO] Apache Atlas Integration ........................... SUCCESS [ 37.912 s]
[INFO] Apache Atlas Common ................................ SUCCESS [ 18.552 s]
[INFO] Apache Atlas Typesystem ............................ SUCCESS [01:18 min]
[INFO] Apache Atlas Client ................................ SUCCESS [ 20.608 s]
[INFO] Apache Atlas Server API ............................ SUCCESS [ 12.012 s]
[INFO] Apache Atlas Notification .......................... SUCCESS [ 19.760 s]
[INFO] Apache Atlas Graph Database Projects ............... SUCCESS [  0.907 s]
[INFO] Apache Atlas Graph Database API .................... SUCCESS [  9.736 s]
[INFO] Graph Database Common Code ......................... SUCCESS [  9.925 s]
[INFO] Apache Atlas Titan 1.0.0 GraphDB Impl .............. SUCCESS [ 36.982 s]
[INFO] Shaded version of Apache hbase client .............. SUCCESS [  9.992 s]
[INFO] Apache Atlas Titan 0.5.4 Graph DB Impl ............. SUCCESS [ 52.450 s]
[INFO] Apache Atlas Graph Database Implementation Dependencies SUCCESS [  0.911 s]
[INFO] Shaded version of Apache hbase server .............. SUCCESS [ 27.165 s]
[INFO] Apache Atlas Repository ............................ SUCCESS [02:20 min]
[INFO] Apache Atlas Authorization ......................... SUCCESS [ 14.588 s]
[INFO] Apache Atlas Business Catalog ...................... SUCCESS [ 19.665 s]
[INFO] Apache Atlas UI .................................... SUCCESS [01:50 min]
[INFO] Apache Atlas Web Application ....................... FAILURE [05:00 min]
[INFO] Apache Atlas Documentation ......................... SKIPPED
[INFO] Apache Atlas FileSystem Model ...................... SKIPPED
[INFO] Apache Atlas Plugin Classloader .................... SKIPPED
[INFO] Apache Atlas Hive Bridge Shim ...................... SKIPPED
[INFO] Apache Atlas Hive Bridge ........................... SKIPPED
[INFO] Apache Atlas Falcon Bridge Shim .................... SKIPPED
[INFO] Apache Atlas Falcon Bridge ......................... SKIPPED
[INFO] Apache Atlas Sqoop Bridge Shim ..................... SKIPPED
[INFO] Apache Atlas Sqoop Bridge .......................... SKIPPED
[INFO] Apache Atlas Storm Bridge Shim ..................... SKIPPED
[INFO] Apache Atlas Storm Bridge .......................... SKIPPED
[INFO] Apache Atlas Distribution .......................... SKIPPED
[INFO] ------------------------------------------------------------------------
[INFO] BUILD FAILURE
[INFO] ------------------------------------------------------------------------
[INFO] Total time: 15:30 min
[INFO] Finished at: 2017-08-30T19:48:48Z
[INFO] Final Memory: 366M/2118M
[INFO] ------------------------------------------------------------------------
log4j:WARN No appenders could be found for logger (org.apache.zookeeper.ClientCnxn).
log4j:WARN Please initialize the log4j system properly.
log4j:WARN See http://logging.apache.org/log4j/1.2/faq.html#noconfig for more info.
[ERROR] Failed to execute goal org.apache.maven.plugins:maven-failsafe-plugin:2.19.1:verify
(verify) on project atlas-webapp: There are test failures.
[ERROR] 
[ERROR] Please refer to <https://builds.apache.org/job/Atlas-master-IntegrationTests/ws/webapp/target/failsafe-reports>
for the individual test results.
[ERROR] -> [Help 1]
[ERROR] 
[ERROR] To see the full stack trace of the errors, re-run Maven with the -e switch.
[ERROR] Re-run Maven using the -X switch to enable full debug logging.
[ERROR] 
[ERROR] For more information about the errors and possible solutions, please read the following
articles:
[ERROR] [Help 1] http://cwiki.apache.org/confluence/display/MAVEN/MojoFailureException
[ERROR] 
[ERROR] After correcting the problems, you can resume the build with the command
[ERROR]   mvn <goals> -rf :atlas-webapp
Build step 'Execute shell' marked build as failure
[CHECKSTYLE] Collecting checkstyle analysis files...
[CHECKSTYLE] Searching for all files in <https://builds.apache.org/job/Atlas-master-IntegrationTests/ws/>
that match the pattern **/target/checkstyle-result.xml
[CHECKSTYLE] Parsing 19 files in <https://builds.apache.org/job/Atlas-master-IntegrationTests/ws/>
[CHECKSTYLE] Successfully parsed file <https://builds.apache.org/job/Atlas-master-IntegrationTests/ws/authorization/target/checkstyle-result.xml>
with 467 unique warnings and 0 duplicates.
[CHECKSTYLE] Successfully parsed file <https://builds.apache.org/job/Atlas-master-IntegrationTests/ws/catalog/target/checkstyle-result.xml>
with 2604 unique warnings and 0 duplicates.
[CHECKSTYLE] Successfully parsed file <https://builds.apache.org/job/Atlas-master-IntegrationTests/ws/client/target/checkstyle-result.xml>
with 4241 unique warnings and 0 duplicates.
[CHECKSTYLE] Successfully parsed file <https://builds.apache.org/job/Atlas-master-IntegrationTests/ws/common/target/checkstyle-result.xml>
with 5453 unique warnings and 0 duplicates.
[CHECKSTYLE] Successfully parsed file <https://builds.apache.org/job/Atlas-master-IntegrationTests/ws/dashboardv2/target/checkstyle-result.xml>
with 5453 unique warnings and 0 duplicates.
[CHECKSTYLE] Successfully parsed file <https://builds.apache.org/job/Atlas-master-IntegrationTests/ws/graphdb/api/target/checkstyle-result.xml>
with 5722 unique warnings and 0 duplicates.
[CHECKSTYLE] Successfully parsed file <https://builds.apache.org/job/Atlas-master-IntegrationTests/ws/graphdb/common/target/checkstyle-result.xml>
with 5909 unique warnings and 0 duplicates.
[CHECKSTYLE] Successfully parsed file <https://builds.apache.org/job/Atlas-master-IntegrationTests/ws/graphdb/graphdb-impls/target/checkstyle-result.xml>
with 5909 unique warnings and 0 duplicates.
[CHECKSTYLE] Successfully parsed file <https://builds.apache.org/job/Atlas-master-IntegrationTests/ws/graphdb/target/checkstyle-result.xml>
with 5909 unique warnings and 0 duplicates.
[CHECKSTYLE] Successfully parsed file <https://builds.apache.org/job/Atlas-master-IntegrationTests/ws/graphdb/titan0/target/checkstyle-result.xml>
with 8183 unique warnings and 0 duplicates.
[CHECKSTYLE] Successfully parsed file <https://builds.apache.org/job/Atlas-master-IntegrationTests/ws/graphdb/titan1/target/checkstyle-result.xml>
with 9131 unique warnings and 0 duplicates.
[CHECKSTYLE] Successfully parsed file <https://builds.apache.org/job/Atlas-master-IntegrationTests/ws/intg/target/checkstyle-result.xml>
with 16696 unique warnings and 0 duplicates.
[CHECKSTYLE] Successfully parsed file <https://builds.apache.org/job/Atlas-master-IntegrationTests/ws/notification/target/checkstyle-result.xml>
with 17906 unique warnings and 0 duplicates.
[CHECKSTYLE] Successfully parsed file <https://builds.apache.org/job/Atlas-master-IntegrationTests/ws/repository/target/checkstyle-result.xml>
with 37446 unique warnings and 0 duplicates.
[CHECKSTYLE] Successfully parsed file <https://builds.apache.org/job/Atlas-master-IntegrationTests/ws/server-api/target/checkstyle-result.xml>
with 37825 unique warnings and 0 duplicates.
[CHECKSTYLE] Successfully parsed file <https://builds.apache.org/job/Atlas-master-IntegrationTests/ws/shaded/hbase-client-shaded/target/checkstyle-result.xml>
with 37825 unique warnings and 0 duplicates.
[CHECKSTYLE] Successfully parsed file <https://builds.apache.org/job/Atlas-master-IntegrationTests/ws/shaded/hbase-server-shaded/target/checkstyle-result.xml>
with 37825 unique warnings and 0 duplicates.
[CHECKSTYLE] Successfully parsed file <https://builds.apache.org/job/Atlas-master-IntegrationTests/ws/target/checkstyle-result.xml>
with 37825 unique warnings and 0 duplicates.
[CHECKSTYLE] Successfully parsed file <https://builds.apache.org/job/Atlas-master-IntegrationTests/ws/typesystem/target/checkstyle-result.xml>
with 42043 unique warnings and 0 duplicates.
<Git Blamer> Using GitBlamer to create author and commit information for all warnings.
<Git Blamer> GIT_COMMIT=68f66e92acfed5d8fdd5652245bd989aa6bbfb94, workspace=<https://builds.apache.org/job/Atlas-master-IntegrationTests/ws/>
 > git rev-parse 68f66e92acfed5d8fdd5652245bd989aa6bbfb94^{commit} # timeout=10
<Git Blamer> Skipping file <https://builds.apache.org/job/Atlas-master-IntegrationTests/ws/graphdb/titan1/src/main/java/org/apache/atlas/repository/graphdb/titan1/graphson/AtlasGraphSONMode.java,>
no result found.
[FINDBUGS] Collecting findbugs analysis files...
[FINDBUGS] Searching for all files in <https://builds.apache.org/job/Atlas-master-IntegrationTests/ws/>
that match the pattern **/target/findbugs.xml
[FINDBUGS] Parsing 12 files in <https://builds.apache.org/job/Atlas-master-IntegrationTests/ws/>
[FINDBUGS] Successfully parsed file <https://builds.apache.org/job/Atlas-master-IntegrationTests/ws/authorization/target/findbugs.xml>
with 0 unique warnings and 0 duplicates.
[FINDBUGS] Successfully parsed file <https://builds.apache.org/job/Atlas-master-IntegrationTests/ws/catalog/target/findbugs.xml>
with 0 unique warnings and 0 duplicates.
[FINDBUGS] Successfully parsed file <https://builds.apache.org/job/Atlas-master-IntegrationTests/ws/client/target/findbugs.xml>
with 0 unique warnings and 0 duplicates.
[FINDBUGS] Successfully parsed file <https://builds.apache.org/job/Atlas-master-IntegrationTests/ws/common/target/findbugs.xml>
with 0 unique warnings and 0 duplicates.
[FINDBUGS] Successfully parsed file <https://builds.apache.org/job/Atlas-master-IntegrationTests/ws/graphdb/api/target/findbugs.xml>
with 0 unique warnings and 0 duplicates.
[FINDBUGS] Successfully parsed file <https://builds.apache.org/job/Atlas-master-IntegrationTests/ws/graphdb/common/target/findbugs.xml>
with 0 unique warnings and 0 duplicates.
[FINDBUGS] Successfully parsed file <https://builds.apache.org/job/Atlas-master-IntegrationTests/ws/graphdb/titan0/target/findbugs.xml>
with 0 unique warnings and 0 duplicates.
[FINDBUGS] Successfully parsed file <https://builds.apache.org/job/Atlas-master-IntegrationTests/ws/intg/target/findbugs.xml>
with 0 unique warnings and 0 duplicates.
[FINDBUGS] Successfully parsed file <https://builds.apache.org/job/Atlas-master-IntegrationTests/ws/notification/target/findbugs.xml>
with 0 unique warnings and 0 duplicates.
[FINDBUGS] Successfully parsed file <https://builds.apache.org/job/Atlas-master-IntegrationTests/ws/repository/target/findbugs.xml>
with 0 unique warnings and 0 duplicates.
[FINDBUGS] Successfully parsed file <https://builds.apache.org/job/Atlas-master-IntegrationTests/ws/server-api/target/findbugs.xml>
with 0 unique warnings and 0 duplicates.
[FINDBUGS] Successfully parsed file <https://builds.apache.org/job/Atlas-master-IntegrationTests/ws/typesystem/target/findbugs.xml>
with 0 unique warnings and 0 duplicates.
<Git Blamer> Using GitBlamer to create author and commit information for all warnings.
<Git Blamer> GIT_COMMIT=68f66e92acfed5d8fdd5652245bd989aa6bbfb94, workspace=<https://builds.apache.org/job/Atlas-master-IntegrationTests/ws/>
Archiving artifacts
[Fast Archiver] No prior successful build to compare, so performing full copy of artifacts
TestNG Reports Processing: START
Looking for TestNG results report in workspace using pattern: **/target/surefire-reports/testng-results.xml,**/target/failsafe-reports/testng-results.xml
Saving reports...
Processing '/x1/jenkins/jenkins-home/jobs/Atlas-master-IntegrationTests/builds/52/testng/testng-results.xml'
TestNG Reports Processing: FINISH

Mime
View raw message