atlas-dev mailing list archives

Site index · List index
Message view « Date » · « Thread »
Top « Date » · « Thread »
From Apache Jenkins Server <jenk...@builds.apache.org>
Subject Build failed in Jenkins: Atlas-master-IntegrationTests #23
Date Mon, 21 Aug 2017 19:13:13 GMT
See <https://builds.apache.org/job/Atlas-master-IntegrationTests/23/display/redirect?page=changes>

Changes:

[amestry] ATLAS-2038: Minor refactoring to use

------------------------------------------
[...truncated 660.41 KB...]
127.0.0.1 - - [21/Aug/2017:19:06:51 +0000] "POST /api/atlas/entities HTTP/1.1" 201 - "-" "Java/1.7.0_80"
127.0.0.1 - - [21/Aug/2017:19:06:51 +0000] "POST /api/atlas/entities HTTP/1.1" 201 - "-" "Java/1.7.0_80"
127.0.0.1 - - [21/Aug/2017:19:06:52 +0000] "POST /api/atlas/entities HTTP/1.1" 201 - "-" "Java/1.7.0_80"
127.0.0.1 - - [21/Aug/2017:19:06:52 +0000] "POST /api/atlas/entities HTTP/1.1" 400 - "-" "Java/1.7.0_80"
127.0.0.1 - - [21/Aug/2017:19:06:52 +0000] "POST /api/atlas/entities HTTP/1.1" 201 - "-" "Java/1.7.0_80"
127.0.0.1 - - [21/Aug/2017:19:06:52 +0000] "GET /api/atlas/v2/types/typedef/name/ZpIQfxU2Dc
HTTP/1.1" 404 - "-" "Java/1.7.0_80"
127.0.0.1 - - [21/Aug/2017:19:06:52 +0000] "POST /api/atlas/types HTTP/1.1" 201 - "-" "Java/1.7.0_80"
127.0.0.1 - - [21/Aug/2017:19:06:53 +0000] "POST /api/atlas/entities HTTP/1.1" 201 - "-" "Java/1.7.0_80"
127.0.0.1 - - [21/Aug/2017:19:06:53 +0000] "GET /api/atlas/entities/e3ad0015-6de4-4a46-b073-9be7a7c0004e
HTTP/1.1" 200 - "-" "Java/1.7.0_80"
127.0.0.1 - - [21/Aug/2017:19:06:53 +0000] "GET /api/atlas/v2/entity/guid/ca78435b-bcdc-4b47-8c87-b2a5210b57f2
HTTP/1.1" 200 - "-" "Java/1.7.0_80"
127.0.0.1 - - [21/Aug/2017:19:06:53 +0000] "POST /api/atlas/v2/entity/ HTTP/1.1" 200 - "-"
"Java/1.7.0_80"
127.0.0.1 - - [21/Aug/2017:19:06:53 +0000] "POST /api/atlas/v2/entity/guid/random/classifications
HTTP/1.1" 404 - "-" "Java/1.7.0_80"
127.0.0.1 - - [21/Aug/2017:19:06:53 +0000] "POST /api/atlas/v2/entity/bulk/ HTTP/1.1" 200
- "-" "Java/1.7.0_80"
127.0.0.1 - - [21/Aug/2017:19:06:53 +0000] "POST /api/atlas/v2/entity/ HTTP/1.1" 200 - "-"
"Java/1.7.0_80"
127.0.0.1 - - [21/Aug/2017:19:06:54 +0000] "POST /api/atlas/v2/entity/ HTTP/1.1" 200 - "-"
"Java/1.7.0_80"
127.0.0.1 - - [21/Aug/2017:19:06:54 +0000] "DELETE /api/atlas/v2/entity/bulk/?guid=2f2b230c-ca79-405f-b634-15e70516b79b&guid=8de2bc59-4a10-46d4-85ae-654c9b340e38
HTTP/1.1" 200 - "-" "Java/1.7.0_80"
127.0.0.1 - - [21/Aug/2017:19:06:54 +0000] "POST /api/atlas/v2/entity/ HTTP/1.1" 200 - "-"
"Java/1.7.0_80"
127.0.0.1 - - [21/Aug/2017:19:06:54 +0000] "DELETE /api/atlas/v2/entity/uniqueAttribute/type/hive_db_v2?attr:name=dbKJqDXRgj7n%E7%B8%B0%EF%8F%8C%E8%94%91%F0%99%A8%97%E1%A7%80%E6%97%90%EA%A4%BF%EC%AF%B3%E9%9B%85
HTTP/1.1" 200 - "-" "Java/1.7.0_80"
127.0.0.1 - - [21/Aug/2017:19:06:54 +0000] "DELETE /api/atlas/v2/entity/guid/random/classification/blah_trait
HTTP/1.1" 400 - "-" "Java/1.7.0_80"
127.0.0.1 - - [21/Aug/2017:19:06:54 +0000] "GET /api/atlas/discovery/search/dsl?query=hive_db_v2+where+name%3D'dbKJqDXRgj7n'&limit=10&offset=0
HTTP/1.1" 200 - "-" "Java/1.7.0_80"
127.0.0.1 - - [21/Aug/2017:19:06:55 +0000] "GET /api/atlas/discovery/search/dsl?query=hive_db_v2+where+name%3D'dbKJqDXRgj7n'&limit=10&offset=0
HTTP/1.1" 200 - "-" "Java/1.7.0_80"
127.0.0.1 - - [21/Aug/2017:19:06:56 +0000] "POST /api/atlas/v2/entity/ HTTP/1.1" 200 - "-"
"Java/1.7.0_80"
127.0.0.1 - - [21/Aug/2017:19:06:56 +0000] "GET /api/atlas/discovery/search/dsl?query=hive_db_v2+where+name%3D'dbKJqDXRgj7n'&limit=10&offset=0
HTTP/1.1" 200 - "-" "Java/1.7.0_80"
127.0.0.1 - - [21/Aug/2017:19:06:57 +0000] "POST /api/atlas/v2/types/typedefs/ HTTP/1.1" 200
- "-" "Java/1.7.0_80"
127.0.0.1 - - [21/Aug/2017:19:06:57 +0000] "POST /api/atlas/v2/entity/ HTTP/1.1" 200 - "-"
"Java/1.7.0_80"
127.0.0.1 - - [21/Aug/2017:19:06:57 +0000] "PUT /api/atlas/v2/types/typedefs/ HTTP/1.1" 200
- "-" "Java/1.7.0_80"
127.0.0.1 - - [21/Aug/2017:19:06:58 +0000] "GET /api/atlas/v2/entity/guid/197cf799-dc9a-49ae-8ebd-d35c3ae367e7
HTTP/1.1" 200 - "-" "Java/1.7.0_80"
127.0.0.1 - - [21/Aug/2017:19:06:58 +0000] "POST /api/atlas/v2/entity/ HTTP/1.1" 404 - "-"
"Java/1.7.0_80"
127.0.0.1 - - [21/Aug/2017:19:06:58 +0000] "POST /api/atlas/v2/entity/ HTTP/1.1" 200 - "-"
"Java/1.7.0_80"
127.0.0.1 - - [21/Aug/2017:19:06:58 +0000] "POST /api/atlas/v2/entity/ HTTP/1.1" 200 - "-"
"Java/1.7.0_80"
127.0.0.1 - - [21/Aug/2017:19:06:58 +0000] "GET /api/atlas/v2/entity/uniqueAttribute/type/hive_db_v2?attr:name=dbKJqDXRgj7n
HTTP/1.1" 200 - "-" "Java/1.7.0_80"
127.0.0.1 - - [21/Aug/2017:19:06:58 +0000] "GET /api/atlas/v2/entity/guid/blah HTTP/1.1" 404
- "-" "Java/1.7.0_80"
127.0.0.1 - - [21/Aug/2017:19:06:58 +0000] "POST /api/atlas/v2/entity/ HTTP/1.1" 200 - "-"
"Java/1.7.0_80"
127.0.0.1 - - [21/Aug/2017:19:06:58 +0000] "GET /api/atlas/entities/e4338309-f059-4e38-8d3e-cf2ed0bbfe10/audit?count=10
HTTP/1.1" 200 - "-" "Java/1.7.0_80"
127.0.0.1 - - [21/Aug/2017:19:06:58 +0000] "POST /api/atlas/v2/entity/ HTTP/1.1" 200 - "-"
"Java/1.7.0_80"
127.0.0.1 - - [21/Aug/2017:19:06:58 +0000] "POST /api/atlas/v2/entity/ HTTP/1.1" 200 - "-"
"Java/1.7.0_80"
127.0.0.1 - - [21/Aug/2017:19:06:59 +0000] "GET /api/atlas/v2/types/typedef/name/kkfrLKI7cz
HTTP/1.1" 404 - "-" "Java/1.7.0_80"
127.0.0.1 - - [21/Aug/2017:19:06:59 +0000] "POST /api/atlas/v2/types/typedefs/ HTTP/1.1" 200
- "-" "Java/1.7.0_80"
127.0.0.1 - - [21/Aug/2017:19:06:59 +0000] "POST /api/atlas/v2/entity/ HTTP/1.1" 200 - "-"
"Java/1.7.0_80"
127.0.0.1 - - [21/Aug/2017:19:06:59 +0000] "GET /api/atlas/v2/entity/guid/0e28ddca-2211-4f03-92f7-f33ff9ffddf4
HTTP/1.1" 200 - "-" "Java/1.7.0_80"
127.0.0.1 - - [21/Aug/2017:19:06:59 +0000] "GET /api/atlas/discovery/search/dsl?query=from+hive_db_v1+name%3D%22dbN4XBX0nzLS%22
HTTP/1.1" 200 - "-" "Java/1.7.0_80"
127.0.0.1 - - [21/Aug/2017:19:07:00 +0000] "GET /api/atlas/discovery/search/dsl?query=from+blah
HTTP/1.1" 400 - "-" "Java/1.7.0_80"
127.0.0.1 - - [21/Aug/2017:19:07:00 +0000] "GET /api/atlas/discovery/search?query=* HTTP/1.1"
200 - "-" "Java/1.7.0_80"
127.0.0.1 - - [21/Aug/2017:19:07:00 +0000] "GET /api/atlas/discovery/search?query=from+hive_db_v1+name%3D%22dbN4XBX0nzLS%22
HTTP/1.1" 200 - "-" "Java/1.7.0_80"
127.0.0.1 - - [21/Aug/2017:19:07:01 +0000] "GET /api/atlas/discovery/search/gremlin?query=g.V.has('type',+'hive_table_v1').toList()
HTTP/1.1" 400 - "-" "Java/1.7.0_80"
127.0.0.1 - - [21/Aug/2017:19:07:01 +0000] "POST /api/atlas/types HTTP/1.1" 201 - "-" "Java/1.7.0_80"
127.0.0.1 - - [21/Aug/2017:19:07:01 +0000] "POST /api/atlas/types HTTP/1.1" 409 - "-" "Java/1.7.0_80"
127.0.0.1 - - [21/Aug/2017:19:07:01 +0000] "GET /api/atlas/types/blah HTTP/1.1" 404 - "-"
"Java/1.7.0_80"
127.0.0.1 - - [21/Aug/2017:19:07:01 +0000] "GET /api/atlas/v2/types/typedef/name/class_trait
HTTP/1.1" 404 - "-" "Java/1.7.0_80"
127.0.0.1 - - [21/Aug/2017:19:07:01 +0000] "POST /api/atlas/types HTTP/1.1" 201 - "-" "Java/1.7.0_80"
127.0.0.1 - - [21/Aug/2017:19:07:01 +0000] "GET /api/atlas/v2/types/typedef/name/secure_trait
HTTP/1.1" 404 - "-" "Java/1.7.0_80"
127.0.0.1 - - [21/Aug/2017:19:07:01 +0000] "POST /api/atlas/types HTTP/1.1" 201 - "-" "Java/1.7.0_80"
127.0.0.1 - - [21/Aug/2017:19:07:02 +0000] "GET /api/atlas/v2/types/typedef/name/pii_trait
HTTP/1.1" 404 - "-" "Java/1.7.0_80"
127.0.0.1 - - [21/Aug/2017:19:07:02 +0000] "POST /api/atlas/types HTTP/1.1" 201 - "-" "Java/1.7.0_80"
127.0.0.1 - - [21/Aug/2017:19:07:02 +0000] "GET /api/atlas/v2/types/typedef/name/ssn_trait
HTTP/1.1" 404 - "-" "Java/1.7.0_80"
127.0.0.1 - - [21/Aug/2017:19:07:02 +0000] "POST /api/atlas/types HTTP/1.1" 201 - "-" "Java/1.7.0_80"
127.0.0.1 - - [21/Aug/2017:19:07:02 +0000] "GET /api/atlas/v2/types/typedef/name/salary_trait
HTTP/1.1" 404 - "-" "Java/1.7.0_80"
127.0.0.1 - - [21/Aug/2017:19:07:02 +0000] "POST /api/atlas/types HTTP/1.1" 201 - "-" "Java/1.7.0_80"
127.0.0.1 - - [21/Aug/2017:19:07:02 +0000] "GET /api/atlas/v2/types/typedef/name/sox_trait
HTTP/1.1" 404 - "-" "Java/1.7.0_80"
127.0.0.1 - - [21/Aug/2017:19:07:02 +0000] "POST /api/atlas/types HTTP/1.1" 201 - "-" "Java/1.7.0_80"
127.0.0.1 - - [21/Aug/2017:19:07:02 +0000] "GET /api/atlas/types?type=TRAIT HTTP/1.1" 200
- "-" "Java/1.7.0_80"
127.0.0.1 - - [21/Aug/2017:19:07:02 +0000] "GET /api/atlas/v2/types/typedef/name/AxmDyXmMKtD
HTTP/1.1" 404 - "-" "Java/1.7.0_80"
127.0.0.1 - - [21/Aug/2017:19:07:02 +0000] "POST /api/atlas/types HTTP/1.1" 201 - "-" "Java/1.7.0_80"
127.0.0.1 - - [21/Aug/2017:19:07:03 +0000] "GET /api/atlas/v2/types/typedef/name/A1QiNz2UHzSm
HTTP/1.1" 404 - "-" "Java/1.7.0_80"
127.0.0.1 - - [21/Aug/2017:19:07:03 +0000] "POST /api/atlas/types HTTP/1.1" 201 - "-" "Java/1.7.0_80"
127.0.0.1 - - [21/Aug/2017:19:07:03 +0000] "GET /api/atlas/v2/types/typedef/name/BsqFRzq7aZk
HTTP/1.1" 404 - "-" "Java/1.7.0_80"
127.0.0.1 - - [21/Aug/2017:19:07:03 +0000] "POST /api/atlas/types HTTP/1.1" 201 - "-" "Java/1.7.0_80"
127.0.0.1 - - [21/Aug/2017:19:07:04 +0000] "GET /api/atlas/v2/types/typedef/name/CuAF9tjzJ2P
HTTP/1.1" 404 - "-" "Java/1.7.0_80"
127.0.0.1 - - [21/Aug/2017:19:07:04 +0000] "POST /api/atlas/types HTTP/1.1" 201 - "-" "Java/1.7.0_80"
127.0.0.1 - - [21/Aug/2017:19:07:04 +0000] "GET /api/atlas/types?type=CLASS&supertype=AxmDyXmMKtD&notsupertype=BsqFRzq7aZk
HTTP/1.1" 200 - "-" "Java/1.7.0_80"
127.0.0.1 - - [21/Aug/2017:19:07:04 +0000] "POST /api/atlas/types HTTP/1.1" 201 - "-" "Java/1.7.0_80"
127.0.0.1 - - [21/Aug/2017:19:07:04 +0000] "PUT /api/atlas/types HTTP/1.1" 200 - "-" "Java/1.7.0_80"
127.0.0.1 - - [21/Aug/2017:19:07:05 +0000] "GET /api/atlas/types/XZevkh2D17 HTTP/1.1" 200
- "-" "Java/1.7.0_80"
127.0.0.1 - - [21/Aug/2017:19:07:28 +0000] "GET /api/atlas/admin/session HTTP/1.1" 200 - "-"
"Java/1.7.0_80"
127.0.0.1 - - [21/Aug/2017:19:07:28 +0000] "GET /api/atlas/v1/taxonomies HTTP/1.1" 403 493
"-" "Java/1.7.0_80"
127.0.0.1 - - [21/Aug/2017:19:07:28 +0000] "GET /api/atlas/admin/status HTTP/1.1" 200 - "-"
"Java/1.7.0_80"
127.0.0.1 - - [21/Aug/2017:19:07:28 +0000] "GET /api/atlas/admin/session HTTP/1.1" 401 317
"-" "Java/1.7.0_80"
127.0.0.1 - - [21/Aug/2017:19:07:28 +0000] "POST /api/atlas/v2/types/typedefs/ HTTP/1.1" 200
- "-" "Java/1.7.0_80"
127.0.0.1 - - [21/Aug/2017:19:07:28 +0000] "PUT /api/atlas/v2/types/typedefs/ HTTP/1.1" 200
- "-" "Java/1.7.0_80"
127.0.0.1 - - [21/Aug/2017:19:07:29 +0000] "GET /api/atlas/v2/types/typedefs/?type=ENTITY
HTTP/1.1" 200 - "-" "Java/1.7.0_80"
127.0.0.1 - - [21/Aug/2017:19:07:29 +0000] "GET /api/atlas/v2/types/enumdef/name/blah HTTP/1.1"
404 - "-" "Java/1.7.0_80"
127.0.0.1 - - [21/Aug/2017:19:07:29 +0000] "GET /api/atlas/v2/types/enumdef/guid/blah HTTP/1.1"
404 - "-" "Java/1.7.0_80"
127.0.0.1 - - [21/Aug/2017:19:07:29 +0000] "GET /api/atlas/v2/types/structdef/name/blah HTTP/1.1"
404 - "-" "Java/1.7.0_80"
127.0.0.1 - - [21/Aug/2017:19:07:29 +0000] "GET /api/atlas/v2/types/structdef/guid/blah HTTP/1.1"
404 - "-" "Java/1.7.0_80"
127.0.0.1 - - [21/Aug/2017:19:07:29 +0000] "GET /api/atlas/v2/types/classificationdef/name/blah
HTTP/1.1" 404 - "-" "Java/1.7.0_80"
127.0.0.1 - - [21/Aug/2017:19:07:29 +0000] "GET /api/atlas/v2/types/classificationdef/guid/blah
HTTP/1.1" 404 - "-" "Java/1.7.0_80"
127.0.0.1 - - [21/Aug/2017:19:07:29 +0000] "GET /api/atlas/v2/types/entitydef/name/blah HTTP/1.1"
404 - "-" "Java/1.7.0_80"
127.0.0.1 - - [21/Aug/2017:19:07:29 +0000] "GET /api/atlas/v2/types/entitydef/guid/blah HTTP/1.1"
404 - "-" "Java/1.7.0_80"
127.0.0.1 - - [21/Aug/2017:19:07:29 +0000] "POST /api/atlas/v2/types/typedefs/ HTTP/1.1" 200
- "-" "Java/1.7.0_80"
127.0.0.1 - - [21/Aug/2017:19:07:29 +0000] "GET /api/atlas/v2/types/typedefs/?supertype=AVkFLxR4tQU&type=CLASS
HTTP/1.1" 200 - "-" "Java/1.7.0_80"
127.0.0.1 - - [21/Aug/2017:19:07:29 +0000] "GET /api/atlas/v2/types/typedefs/?notsupertype=BfmheNxylB3&supertype=AVkFLxR4tQU&type=CLASS
HTTP/1.1" 200 - "-" "Java/1.7.0_80"
127.0.0.1 - - [21/Aug/2017:19:07:29 +0000] "POST /api/atlas/v2/types/typedefs/ HTTP/1.1" 200
- "-" "Java/1.7.0_80"
127.0.0.1 - - [21/Aug/2017:19:07:30 +0000] "POST /api/atlas/v2/types/typedefs/ HTTP/1.1" 409
- "-" "Java/1.7.0_80"
Tests run: 132, Failures: 4, Errors: 0, Skipped: 0, Time elapsed: 330.309 sec <<<
FAILURE! - in TestSuite
testDeleteByQualifiedName(org.apache.atlas.notification.NotificationHookConsumerIT)  Time
elapsed: 60.248 sec  <<< FAILURE!
java.lang.Exception: Waiting timed out after 60000 msec
	at org.apache.atlas.notification.NotificationHookConsumerIT.testDeleteByQualifiedName(NotificationHookConsumerIT.java:184)

testUpdateEntityPartial(org.apache.atlas.notification.NotificationHookConsumerIT)  Time elapsed:
60.215 sec  <<< FAILURE!
java.lang.Exception: Waiting timed out after 60000 msec
	at org.apache.atlas.notification.NotificationHookConsumerIT.testUpdateEntityPartial(NotificationHookConsumerIT.java:127)

testPartialUpdate(org.apache.atlas.web.integration.EntityJerseyResourceIT)  Time elapsed:
0.478 sec  <<< FAILURE!
java.lang.AssertionError: expected:<1> but was:<3>
	at org.apache.atlas.web.integration.EntityJerseyResourceIT.testPartialUpdate(EntityJerseyResourceIT.java:881)

testSearchUsingGremlin(org.apache.atlas.web.integration.MetadataDiscoveryJerseyResourceIT)
 Time elapsed: 0.005 sec  <<< FAILURE!
org.apache.atlas.AtlasServiceException: Metadata service API org.apache.atlas.AtlasBaseClient$APIInfo@767219ea
failed with status 400 (Bad Request) Response Body ({"error":"Gremlin search is not enabled."})
	at org.apache.atlas.web.integration.MetadataDiscoveryJerseyResourceIT.testSearchUsingGremlin(MetadataDiscoveryJerseyResourceIT.java:153)


Results :

Failed tests: 
  NotificationHookConsumerIT.testDeleteByQualifiedName:184->BaseResourceIT.waitFor:626
» 
  NotificationHookConsumerIT.testUpdateEntityPartial:127->BaseResourceIT.waitFor:626 »

  EntityJerseyResourceIT.testPartialUpdate:881 expected:<1> but was:<3>
  MetadataDiscoveryJerseyResourceIT.testSearchUsingGremlin:153 » AtlasService Me...

Tests run: 132, Failures: 4, Errors: 0, Skipped: 0

[INFO] 
[INFO] --- jetty-maven-plugin:9.2.12.v20150709:stop (stop-jetty) @ atlas-webapp ---
[INFO] Waiting 10 seconds for jetty to stop
[INFO] Stopped ServerConnector@264ba19e{HTTP/1.1}{0.0.0.0:31000}
[INFO] Closing Spring root WebApplicationContext
[INFO] Shutting down log4j
[INFO] Stopped o.e.j.m.p.JettyWebAppContext@9834fb7{/,<https://builds.apache.org/job/Atlas-master-IntegrationTests/ws/webapp/target/atlas-webapp-0.9-SNAPSHOT/,UNAVAILABLE}{/home/jenkins/jenkins-slave/workspace/Atlas-master-IntegrationTests/webapp/target/atlas-webapp-0.9-SNAPSHOT.war}>
[INFO] Server reports itself as stopped
[INFO] 
[INFO] --- maven-source-plugin:2.4:jar-no-fork (attach-sources) @ atlas-webapp ---
[INFO] Building jar: <https://builds.apache.org/job/Atlas-master-IntegrationTests/ws/webapp/target/atlas-webapp-0.9-SNAPSHOT-sources.jar>
[INFO] 
[INFO] --- maven-source-plugin:2.4:test-jar-no-fork (attach-sources) @ atlas-webapp ---
[INFO] Building jar: <https://builds.apache.org/job/Atlas-master-IntegrationTests/ws/webapp/target/atlas-webapp-0.9-SNAPSHOT-test-sources.jar>
[INFO] 
[INFO] --- maven-failsafe-plugin:2.19.1:verify (verify) @ atlas-webapp ---
[INFO] ------------------------------------------------------------------------
[INFO] Reactor Summary:
[INFO] 
[INFO] Apache Atlas Server Build Tools .................... SUCCESS [  0.870 s]
[INFO] apache-atlas ....................................... SUCCESS [  7.107 s]
[INFO] Apache Atlas Integration ........................... SUCCESS [ 30.118 s]
[INFO] Apache Atlas Common ................................ SUCCESS [ 14.868 s]
[INFO] Apache Atlas Typesystem ............................ SUCCESS [01:06 min]
[INFO] Apache Atlas Client ................................ SUCCESS [ 16.558 s]
[INFO] Apache Atlas Server API ............................ SUCCESS [  9.639 s]
[INFO] Apache Atlas Notification .......................... SUCCESS [ 15.594 s]
[INFO] Apache Atlas Graph Database Projects ............... SUCCESS [  0.602 s]
[INFO] Apache Atlas Graph Database API .................... SUCCESS [  7.756 s]
[INFO] Graph Database Common Code ......................... SUCCESS [  7.735 s]
[INFO] Apache Atlas Titan 1.0.0 GraphDB Impl .............. SUCCESS [ 35.080 s]
[INFO] Shaded version of Apache hbase client .............. SUCCESS [  8.677 s]
[INFO] Apache Atlas Titan 0.5.4 Graph DB Impl ............. SUCCESS [ 43.804 s]
[INFO] Apache Atlas Graph Database Implementation Dependencies SUCCESS [  0.776 s]
[INFO] Shaded version of Apache hbase server .............. SUCCESS [ 24.262 s]
[INFO] Apache Atlas Repository ............................ SUCCESS [01:46 min]
[INFO] Apache Atlas Authorization ......................... SUCCESS [ 10.510 s]
[INFO] Apache Atlas Business Catalog ...................... SUCCESS [ 15.706 s]
[INFO] Apache Atlas UI .................................... SUCCESS [01:10 min]
[INFO] Apache Atlas Web Application ....................... FAILURE [07:19 min]
[INFO] Apache Atlas Documentation ......................... SKIPPED
[INFO] Apache Atlas FileSystem Model ...................... SKIPPED
[INFO] Apache Atlas Plugin Classloader .................... SKIPPED
[INFO] Apache Atlas Hive Bridge Shim ...................... SKIPPED
[INFO] Apache Atlas Hive Bridge ........................... SKIPPED
[INFO] Apache Atlas Falcon Bridge Shim .................... SKIPPED
[INFO] Apache Atlas Falcon Bridge ......................... SKIPPED
[INFO] Apache Atlas Sqoop Bridge Shim ..................... SKIPPED
[INFO] Apache Atlas Sqoop Bridge .......................... SKIPPED
[INFO] Apache Atlas Storm Bridge Shim ..................... SKIPPED
[INFO] Apache Atlas Storm Bridge .......................... SKIPPED
[INFO] Apache Atlas Distribution .......................... SKIPPED
[INFO] ------------------------------------------------------------------------
[INFO] BUILD FAILURE
[INFO] ------------------------------------------------------------------------
[INFO] Total time: 15:35 min
[INFO] Finished at: 2017-08-21T19:07:37Z
[INFO] Final Memory: 369M/2006M
[INFO] ------------------------------------------------------------------------
log4j:WARN No appenders could be found for logger (org.apache.zookeeper.ClientCnxn).
log4j:WARN Please initialize the log4j system properly.
log4j:WARN See http://logging.apache.org/log4j/1.2/faq.html#noconfig for more info.
[ERROR] Failed to execute goal org.apache.maven.plugins:maven-failsafe-plugin:2.19.1:verify
(verify) on project atlas-webapp: There are test failures.
[ERROR] 
[ERROR] Please refer to <https://builds.apache.org/job/Atlas-master-IntegrationTests/ws/webapp/target/failsafe-reports>
for the individual test results.
[ERROR] -> [Help 1]
[ERROR] 
[ERROR] To see the full stack trace of the errors, re-run Maven with the -e switch.
[ERROR] Re-run Maven using the -X switch to enable full debug logging.
[ERROR] 
[ERROR] For more information about the errors and possible solutions, please read the following
articles:
[ERROR] [Help 1] http://cwiki.apache.org/confluence/display/MAVEN/MojoFailureException
[ERROR] 
[ERROR] After correcting the problems, you can resume the build with the command
[ERROR]   mvn <goals> -rf :atlas-webapp
Build step 'Execute shell' marked build as failure
[CHECKSTYLE] Collecting checkstyle analysis files...
[CHECKSTYLE] Searching for all files in <https://builds.apache.org/job/Atlas-master-IntegrationTests/ws/>
that match the pattern **/target/checkstyle-result.xml
[CHECKSTYLE] Parsing 19 files in <https://builds.apache.org/job/Atlas-master-IntegrationTests/ws/>
[CHECKSTYLE] Successfully parsed file <https://builds.apache.org/job/Atlas-master-IntegrationTests/ws/authorization/target/checkstyle-result.xml>
with 467 unique warnings and 0 duplicates.
[CHECKSTYLE] Successfully parsed file <https://builds.apache.org/job/Atlas-master-IntegrationTests/ws/catalog/target/checkstyle-result.xml>
with 2612 unique warnings and 0 duplicates.
[CHECKSTYLE] Successfully parsed file <https://builds.apache.org/job/Atlas-master-IntegrationTests/ws/client/target/checkstyle-result.xml>
with 4249 unique warnings and 0 duplicates.
[CHECKSTYLE] Successfully parsed file <https://builds.apache.org/job/Atlas-master-IntegrationTests/ws/common/target/checkstyle-result.xml>
with 5461 unique warnings and 0 duplicates.
[CHECKSTYLE] Successfully parsed file <https://builds.apache.org/job/Atlas-master-IntegrationTests/ws/dashboardv2/target/checkstyle-result.xml>
with 5461 unique warnings and 0 duplicates.
[CHECKSTYLE] Successfully parsed file <https://builds.apache.org/job/Atlas-master-IntegrationTests/ws/graphdb/api/target/checkstyle-result.xml>
with 5730 unique warnings and 0 duplicates.
[CHECKSTYLE] Successfully parsed file <https://builds.apache.org/job/Atlas-master-IntegrationTests/ws/graphdb/common/target/checkstyle-result.xml>
with 5917 unique warnings and 0 duplicates.
[CHECKSTYLE] Successfully parsed file <https://builds.apache.org/job/Atlas-master-IntegrationTests/ws/graphdb/graphdb-impls/target/checkstyle-result.xml>
with 5917 unique warnings and 0 duplicates.
[CHECKSTYLE] Successfully parsed file <https://builds.apache.org/job/Atlas-master-IntegrationTests/ws/graphdb/target/checkstyle-result.xml>
with 5917 unique warnings and 0 duplicates.
[CHECKSTYLE] Successfully parsed file <https://builds.apache.org/job/Atlas-master-IntegrationTests/ws/graphdb/titan0/target/checkstyle-result.xml>
with 8191 unique warnings and 0 duplicates.
[CHECKSTYLE] Successfully parsed file <https://builds.apache.org/job/Atlas-master-IntegrationTests/ws/graphdb/titan1/target/checkstyle-result.xml>
with 9139 unique warnings and 0 duplicates.
[CHECKSTYLE] Successfully parsed file <https://builds.apache.org/job/Atlas-master-IntegrationTests/ws/intg/target/checkstyle-result.xml>
with 16649 unique warnings and 0 duplicates.
[CHECKSTYLE] Successfully parsed file <https://builds.apache.org/job/Atlas-master-IntegrationTests/ws/notification/target/checkstyle-result.xml>
with 17859 unique warnings and 0 duplicates.
[CHECKSTYLE] Successfully parsed file <https://builds.apache.org/job/Atlas-master-IntegrationTests/ws/repository/target/checkstyle-result.xml>
with 37362 unique warnings and 0 duplicates.
[CHECKSTYLE] Successfully parsed file <https://builds.apache.org/job/Atlas-master-IntegrationTests/ws/server-api/target/checkstyle-result.xml>
with 37741 unique warnings and 0 duplicates.
[CHECKSTYLE] Successfully parsed file <https://builds.apache.org/job/Atlas-master-IntegrationTests/ws/shaded/hbase-client-shaded/target/checkstyle-result.xml>
with 37741 unique warnings and 0 duplicates.
[CHECKSTYLE] Successfully parsed file <https://builds.apache.org/job/Atlas-master-IntegrationTests/ws/shaded/hbase-server-shaded/target/checkstyle-result.xml>
with 37741 unique warnings and 0 duplicates.
[CHECKSTYLE] Successfully parsed file <https://builds.apache.org/job/Atlas-master-IntegrationTests/ws/target/checkstyle-result.xml>
with 37741 unique warnings and 0 duplicates.
[CHECKSTYLE] Successfully parsed file <https://builds.apache.org/job/Atlas-master-IntegrationTests/ws/typesystem/target/checkstyle-result.xml>
with 41959 unique warnings and 0 duplicates.
<Git Blamer> Using GitBlamer to create author and commit information for all warnings.
<Git Blamer> GIT_COMMIT=1496257312abf06a471efc54c844634d7200b9dd, workspace=<https://builds.apache.org/job/Atlas-master-IntegrationTests/ws/>
 > git rev-parse 1496257312abf06a471efc54c844634d7200b9dd^{commit} # timeout=10
<Git Blamer> Skipping file <https://builds.apache.org/job/Atlas-master-IntegrationTests/ws/graphdb/titan1/src/main/java/org/apache/atlas/repository/graphdb/titan1/graphson/AtlasGraphSONMode.java,>
no result found.
<Git Blamer> Skipping file <https://builds.apache.org/job/Atlas-master-IntegrationTests/ws/typesystem/src/main/java/org/apache/atlas/typesystem/IStruct.java,>
no result found.
[FINDBUGS] Collecting findbugs analysis files...
[FINDBUGS] Searching for all files in <https://builds.apache.org/job/Atlas-master-IntegrationTests/ws/>
that match the pattern **/target/findbugs.xml
[FINDBUGS] Parsing 12 files in <https://builds.apache.org/job/Atlas-master-IntegrationTests/ws/>
[FINDBUGS] Successfully parsed file <https://builds.apache.org/job/Atlas-master-IntegrationTests/ws/authorization/target/findbugs.xml>
with 0 unique warnings and 0 duplicates.
[FINDBUGS] Successfully parsed file <https://builds.apache.org/job/Atlas-master-IntegrationTests/ws/catalog/target/findbugs.xml>
with 0 unique warnings and 0 duplicates.
[FINDBUGS] Successfully parsed file <https://builds.apache.org/job/Atlas-master-IntegrationTests/ws/client/target/findbugs.xml>
with 0 unique warnings and 0 duplicates.
[FINDBUGS] Successfully parsed file <https://builds.apache.org/job/Atlas-master-IntegrationTests/ws/common/target/findbugs.xml>
with 0 unique warnings and 0 duplicates.
[FINDBUGS] Successfully parsed file <https://builds.apache.org/job/Atlas-master-IntegrationTests/ws/graphdb/api/target/findbugs.xml>
with 0 unique warnings and 0 duplicates.
[FINDBUGS] Successfully parsed file <https://builds.apache.org/job/Atlas-master-IntegrationTests/ws/graphdb/common/target/findbugs.xml>
with 0 unique warnings and 0 duplicates.
[FINDBUGS] Successfully parsed file <https://builds.apache.org/job/Atlas-master-IntegrationTests/ws/graphdb/titan0/target/findbugs.xml>
with 0 unique warnings and 0 duplicates.
[FINDBUGS] Successfully parsed file <https://builds.apache.org/job/Atlas-master-IntegrationTests/ws/intg/target/findbugs.xml>
with 0 unique warnings and 0 duplicates.
[FINDBUGS] Successfully parsed file <https://builds.apache.org/job/Atlas-master-IntegrationTests/ws/notification/target/findbugs.xml>
with 0 unique warnings and 0 duplicates.
[FINDBUGS] Successfully parsed file <https://builds.apache.org/job/Atlas-master-IntegrationTests/ws/repository/target/findbugs.xml>
with 0 unique warnings and 0 duplicates.
[FINDBUGS] Successfully parsed file <https://builds.apache.org/job/Atlas-master-IntegrationTests/ws/server-api/target/findbugs.xml>
with 0 unique warnings and 0 duplicates.
[FINDBUGS] Successfully parsed file <https://builds.apache.org/job/Atlas-master-IntegrationTests/ws/typesystem/target/findbugs.xml>
with 0 unique warnings and 0 duplicates.
<Git Blamer> Using GitBlamer to create author and commit information for all warnings.
<Git Blamer> GIT_COMMIT=1496257312abf06a471efc54c844634d7200b9dd, workspace=<https://builds.apache.org/job/Atlas-master-IntegrationTests/ws/>
Archiving artifacts
[Fast Archiver] No prior successful build to compare, so performing full copy of artifacts
TestNG Reports Processing: START
Looking for TestNG results report in workspace using pattern: **/target/surefire-reports/testng-results.xml,**/target/failsafe-reports/testng-results.xml
Saving reports...
Processing '/x1/jenkins/jenkins-home/jobs/Atlas-master-IntegrationTests/builds/23/testng/testng-results.xml'
3.030303% of tests failed, which exceeded threshold of 0%. Marking build as UNSTABLE
TestNG Reports Processing: FINISH

Mime
View raw message