atlas-dev mailing list archives

Site index · List index
Message view « Date » · « Thread »
Top « Date » · « Thread »
From Apache Jenkins Server <jenk...@builds.apache.org>
Subject Build failed in Jenkins: Atlas-master-IntegrationTests #19
Date Fri, 18 Aug 2017 19:45:23 GMT
See <https://builds.apache.org/job/Atlas-master-IntegrationTests/19/display/redirect?page=changes>

Changes:

[ssubramanian] ATLAS-2059: Update test-patch.sh script for PreCommit-ATLAS-Build

------------------------------------------
[...truncated 664.58 KB...]
127.0.0.1 - - [18/Aug/2017:19:39:40 +0000] "PUT /api/atlas/v2/types/typedefs/ HTTP/1.1" 200
- "-" "Java/1.7.0_80"
127.0.0.1 - - [18/Aug/2017:19:39:40 +0000] "GET /api/atlas/v2/types/typedefs/?type=ENTITY
HTTP/1.1" 200 - "-" "Java/1.7.0_80"
127.0.0.1 - - [18/Aug/2017:19:39:40 +0000] "POST /api/atlas/types HTTP/1.1" 201 - "-" "Java/1.7.0_80"
127.0.0.1 - - [18/Aug/2017:19:39:40 +0000] "POST /api/atlas/types HTTP/1.1" 409 - "-" "Java/1.7.0_80"
127.0.0.1 - - [18/Aug/2017:19:39:40 +0000] "GET /api/atlas/types/blah HTTP/1.1" 404 - "-"
"Java/1.7.0_80"
127.0.0.1 - - [18/Aug/2017:19:39:40 +0000] "GET /api/atlas/v2/types/typedef/name/class_trait
HTTP/1.1" 404 - "-" "Java/1.7.0_80"
127.0.0.1 - - [18/Aug/2017:19:39:40 +0000] "POST /api/atlas/types HTTP/1.1" 201 - "-" "Java/1.7.0_80"
127.0.0.1 - - [18/Aug/2017:19:39:40 +0000] "GET /api/atlas/v2/types/typedef/name/secure_trait
HTTP/1.1" 404 - "-" "Java/1.7.0_80"
127.0.0.1 - - [18/Aug/2017:19:39:40 +0000] "POST /api/atlas/types HTTP/1.1" 201 - "-" "Java/1.7.0_80"
127.0.0.1 - - [18/Aug/2017:19:39:40 +0000] "GET /api/atlas/v2/types/typedef/name/pii_trait
HTTP/1.1" 404 - "-" "Java/1.7.0_80"
127.0.0.1 - - [18/Aug/2017:19:39:40 +0000] "POST /api/atlas/types HTTP/1.1" 201 - "-" "Java/1.7.0_80"
127.0.0.1 - - [18/Aug/2017:19:39:40 +0000] "GET /api/atlas/v2/types/typedef/name/ssn_trait
HTTP/1.1" 404 - "-" "Java/1.7.0_80"
127.0.0.1 - - [18/Aug/2017:19:39:40 +0000] "POST /api/atlas/types HTTP/1.1" 201 - "-" "Java/1.7.0_80"
127.0.0.1 - - [18/Aug/2017:19:39:41 +0000] "GET /api/atlas/v2/types/typedef/name/salary_trait
HTTP/1.1" 404 - "-" "Java/1.7.0_80"
127.0.0.1 - - [18/Aug/2017:19:39:41 +0000] "POST /api/atlas/types HTTP/1.1" 201 - "-" "Java/1.7.0_80"
127.0.0.1 - - [18/Aug/2017:19:39:41 +0000] "GET /api/atlas/v2/types/typedef/name/sox_trait
HTTP/1.1" 404 - "-" "Java/1.7.0_80"
127.0.0.1 - - [18/Aug/2017:19:39:41 +0000] "POST /api/atlas/types HTTP/1.1" 201 - "-" "Java/1.7.0_80"
127.0.0.1 - - [18/Aug/2017:19:39:41 +0000] "GET /api/atlas/types?type=TRAIT HTTP/1.1" 200
- "-" "Java/1.7.0_80"
127.0.0.1 - - [18/Aug/2017:19:39:41 +0000] "GET /api/atlas/v2/types/typedef/name/ASfeWwTgDtE
HTTP/1.1" 404 - "-" "Java/1.7.0_80"
127.0.0.1 - - [18/Aug/2017:19:39:41 +0000] "POST /api/atlas/types HTTP/1.1" 201 - "-" "Java/1.7.0_80"
127.0.0.1 - - [18/Aug/2017:19:39:41 +0000] "GET /api/atlas/v2/types/typedef/name/A1T0xqlmdpg8
HTTP/1.1" 404 - "-" "Java/1.7.0_80"
127.0.0.1 - - [18/Aug/2017:19:39:41 +0000] "POST /api/atlas/types HTTP/1.1" 201 - "-" "Java/1.7.0_80"
127.0.0.1 - - [18/Aug/2017:19:39:41 +0000] "GET /api/atlas/v2/types/typedef/name/Bd6wzsnDCKG
HTTP/1.1" 404 - "-" "Java/1.7.0_80"
127.0.0.1 - - [18/Aug/2017:19:39:41 +0000] "POST /api/atlas/types HTTP/1.1" 201 - "-" "Java/1.7.0_80"
127.0.0.1 - - [18/Aug/2017:19:39:41 +0000] "GET /api/atlas/v2/types/typedef/name/CT6CkH4Kut9
HTTP/1.1" 404 - "-" "Java/1.7.0_80"
127.0.0.1 - - [18/Aug/2017:19:39:41 +0000] "POST /api/atlas/types HTTP/1.1" 201 - "-" "Java/1.7.0_80"
127.0.0.1 - - [18/Aug/2017:19:39:41 +0000] "GET /api/atlas/types?type=CLASS&supertype=ASfeWwTgDtE&notsupertype=Bd6wzsnDCKG
HTTP/1.1" 200 - "-" "Java/1.7.0_80"
127.0.0.1 - - [18/Aug/2017:19:39:41 +0000] "POST /api/atlas/types HTTP/1.1" 201 - "-" "Java/1.7.0_80"
127.0.0.1 - - [18/Aug/2017:19:39:41 +0000] "PUT /api/atlas/types HTTP/1.1" 200 - "-" "Java/1.7.0_80"
127.0.0.1 - - [18/Aug/2017:19:39:42 +0000] "GET /api/atlas/types/FWxqhZwC4F HTTP/1.1" 200
- "-" "Java/1.7.0_80"
127.0.0.1 - - [18/Aug/2017:19:39:54 +0000] "POST /api/atlas/types HTTP/1.1" 201 - "-" "Java/1.7.0_80"
127.0.0.1 - - [18/Aug/2017:19:39:55 +0000] "GET /api/atlas/types HTTP/1.1" 200 - "-" "Java/1.7.0_80"
127.0.0.1 - - [18/Aug/2017:19:39:55 +0000] "POST /api/atlas/entities HTTP/1.1" 201 - "-" "Java/1.7.0_80"
127.0.0.1 - - [18/Aug/2017:19:39:55 +0000] "POST /api/atlas/entities HTTP/1.1" 201 - "-" "Java/1.7.0_80"
127.0.0.1 - - [18/Aug/2017:19:39:55 +0000] "POST /api/atlas/entities HTTP/1.1" 201 - "-" "Java/1.7.0_80"
127.0.0.1 - - [18/Aug/2017:19:39:55 +0000] "POST /api/atlas/entities HTTP/1.1" 201 - "-" "Java/1.7.0_80"
127.0.0.1 - - [18/Aug/2017:19:39:55 +0000] "POST /api/atlas/entities HTTP/1.1" 201 - "-" "Java/1.7.0_80"
127.0.0.1 - - [18/Aug/2017:19:39:55 +0000] "POST /api/atlas/entities HTTP/1.1" 201 - "-" "Java/1.7.0_80"
127.0.0.1 - - [18/Aug/2017:19:39:55 +0000] "POST /api/atlas/entities HTTP/1.1" 201 - "-" "Java/1.7.0_80"
127.0.0.1 - - [18/Aug/2017:19:39:55 +0000] "POST /api/atlas/entities HTTP/1.1" 201 - "-" "Java/1.7.0_80"
127.0.0.1 - - [18/Aug/2017:19:39:55 +0000] "POST /api/atlas/entities HTTP/1.1" 201 - "-" "Java/1.7.0_80"
127.0.0.1 - - [18/Aug/2017:19:39:55 +0000] "POST /api/atlas/entities HTTP/1.1" 201 - "-" "Java/1.7.0_80"
127.0.0.1 - - [18/Aug/2017:19:39:55 +0000] "POST /api/atlas/entities HTTP/1.1" 201 - "-" "Java/1.7.0_80"
127.0.0.1 - - [18/Aug/2017:19:39:55 +0000] "POST /api/atlas/entities HTTP/1.1" 201 - "-" "Java/1.7.0_80"
127.0.0.1 - - [18/Aug/2017:19:39:56 +0000] "POST /api/atlas/entities HTTP/1.1" 201 - "-" "Java/1.7.0_80"
127.0.0.1 - - [18/Aug/2017:19:39:56 +0000] "POST /api/atlas/entities HTTP/1.1" 201 - "-" "Java/1.7.0_80"
127.0.0.1 - - [18/Aug/2017:19:39:56 +0000] "POST /api/atlas/entities HTTP/1.1" 201 - "-" "Java/1.7.0_80"
127.0.0.1 - - [18/Aug/2017:19:39:56 +0000] "POST /api/atlas/entities HTTP/1.1" 201 - "-" "Java/1.7.0_80"
127.0.0.1 - - [18/Aug/2017:19:39:56 +0000] "GET /api/atlas/discovery/search?query=from+DB_v1&limit=10&offset=0
HTTP/1.1" 200 - "-" "Java/1.7.0_80"
127.0.0.1 - - [18/Aug/2017:19:39:57 +0000] "GET /api/atlas/discovery/search?query=DB_v1&limit=10&offset=0
HTTP/1.1" 200 - "-" "Java/1.7.0_80"
127.0.0.1 - - [18/Aug/2017:19:39:58 +0000] "GET /api/atlas/discovery/search?query=DB_v1+where+name%3D%22Reporting%22&limit=10&offset=0
HTTP/1.1" 200 - "-" "Java/1.7.0_80"
127.0.0.1 - - [18/Aug/2017:19:39:59 +0000] "GET /api/atlas/discovery/search?query=DB_v1+where+DB_v1.name%3D%22Reporting%22&limit=10&offset=0
HTTP/1.1" 200 - "-" "Java/1.7.0_80"
127.0.0.1 - - [18/Aug/2017:19:40:00 +0000] "GET /api/atlas/discovery/search?query=DB_v1+name+%3D+%22Reporting%22&limit=10&offset=0
HTTP/1.1" 200 - "-" "Java/1.7.0_80"
127.0.0.1 - - [18/Aug/2017:19:40:01 +0000] "GET /api/atlas/discovery/search?query=DB_v1+DB_v1.name+%3D+%22Reporting%22&limit=10&offset=0
HTTP/1.1" 200 - "-" "Java/1.7.0_80"
127.0.0.1 - - [18/Aug/2017:19:40:02 +0000] "GET /api/atlas/discovery/search?query=DB_v1+where+name%3D%22Reporting%22+select+name,+owner&limit=10&offset=0
HTTP/1.1" 200 - "-" "Java/1.7.0_80"
127.0.0.1 - - [18/Aug/2017:19:40:04 +0000] "GET /api/atlas/discovery/search?query=DB_v1+where+DB_v1.name%3D%22Reporting%22+select+name,+owner&limit=10&offset=0
HTTP/1.1" 200 - "-" "Java/1.7.0_80"
127.0.0.1 - - [18/Aug/2017:19:40:06 +0000] "GET /api/atlas/discovery/search?query=DB_v1+has+name&limit=10&offset=0
HTTP/1.1" 200 - "-" "Java/1.7.0_80"
127.0.0.1 - - [18/Aug/2017:19:40:07 +0000] "GET /api/atlas/discovery/search?query=DB_v1+where+DB_v1+has+name&limit=10&offset=0
HTTP/1.1" 200 - "-" "Java/1.7.0_80"
127.0.0.1 - - [18/Aug/2017:19:40:08 +0000] "GET /api/atlas/discovery/search?query=DB_v1,+Table_v1&limit=10&offset=0
HTTP/1.1" 200 - "-" "Java/1.7.0_80"
127.0.0.1 - - [18/Aug/2017:19:40:09 +0000] "GET /api/atlas/discovery/search?query=DB_v1+is+JdbcAccess&limit=10&offset=0
HTTP/1.1" 200 - "-" "Java/1.7.0_80"
127.0.0.1 - - [18/Aug/2017:19:40:10 +0000] "GET /api/atlas/discovery/search?query=from+Table_v1&limit=10&offset=0
HTTP/1.1" 200 - "-" "Java/1.7.0_80"
127.0.0.1 - - [18/Aug/2017:19:40:11 +0000] "GET /api/atlas/discovery/search?query=Table_v1&limit=10&offset=0
HTTP/1.1" 200 - "-" "Java/1.7.0_80"
127.0.0.1 - - [18/Aug/2017:19:40:12 +0000] "GET /api/atlas/discovery/search?query=Table_v1+is+Dimension_v1&limit=10&offset=0
HTTP/1.1" 200 - "-" "Java/1.7.0_80"
127.0.0.1 - - [18/Aug/2017:19:40:13 +0000] "GET /api/atlas/discovery/search?query=Column_v1+where+Column_v1+isa+PII_v1&limit=10&offset=0
HTTP/1.1" 200 - "-" "Java/1.7.0_80"
127.0.0.1 - - [18/Aug/2017:19:40:14 +0000] "GET /api/atlas/discovery/search?query=View_v1+is+Dimension_v1&limit=10&offset=0
HTTP/1.1" 200 - "-" "Java/1.7.0_80"
127.0.0.1 - - [18/Aug/2017:19:40:15 +0000] "GET /api/atlas/discovery/search?query=Column_v1+select+Column_v1.name&limit=10&offset=0
HTTP/1.1" 200 - "-" "Java/1.7.0_80"
127.0.0.1 - - [18/Aug/2017:19:40:17 +0000] "GET /api/atlas/discovery/search?query=Column_v1+select+name&limit=10&offset=0
HTTP/1.1" 200 - "-" "Java/1.7.0_80"
127.0.0.1 - - [18/Aug/2017:19:40:18 +0000] "GET /api/atlas/discovery/search?query=Column_v1+where+Column_v1.name%3D%22customer_id%22&limit=10&offset=0
HTTP/1.1" 200 - "-" "Java/1.7.0_80"
127.0.0.1 - - [18/Aug/2017:19:40:19 +0000] "GET /api/atlas/discovery/search?query=from+Table_v1+select+Table_v1.name&limit=10&offset=0
HTTP/1.1" 200 - "-" "Java/1.7.0_80"
127.0.0.1 - - [18/Aug/2017:19:40:20 +0000] "GET /api/atlas/discovery/search?query=DB_v1+where+(name+%3D+%22Reporting%22)&limit=10&offset=0
HTTP/1.1" 200 - "-" "Java/1.7.0_80"
127.0.0.1 - - [18/Aug/2017:19:40:21 +0000] "GET /api/atlas/discovery/search?query=DB_v1+where+(name+%3D+%22Reporting%22)+select+name+as+_col_0,+owner+as+_col_1&limit=10&offset=0
HTTP/1.1" 200 - "-" "Java/1.7.0_80"
127.0.0.1 - - [18/Aug/2017:19:40:23 +0000] "GET /api/atlas/discovery/search?query=DB_v1+where+DB_v1+is+JdbcAccess_v1&limit=10&offset=0
HTTP/1.1" 200 - "-" "Java/1.7.0_80"
127.0.0.1 - - [18/Aug/2017:19:40:24 +0000] "GET /api/atlas/discovery/search?query=DB_v1+where+DB_v1+has+name&limit=10&offset=0
HTTP/1.1" 200 - "-" "Java/1.7.0_80"
127.0.0.1 - - [18/Aug/2017:19:40:25 +0000] "GET /api/atlas/discovery/search?query=DB_v1+Table_v1&limit=10&offset=0
HTTP/1.1" 200 - "-" "Java/1.7.0_80"
127.0.0.1 - - [18/Aug/2017:19:40:27 +0000] "GET /api/atlas/discovery/search?query=DB_v1+where+DB_v1+has+name&limit=10&offset=0
HTTP/1.1" 200 - "-" "Java/1.7.0_80"
127.0.0.1 - - [18/Aug/2017:19:40:28 +0000] "GET /api/atlas/discovery/search?query=DB_v1+as+db1+Table+where+(db1.name+%3D+%22Reporting%22)&limit=10&offset=0
HTTP/1.1" 200 - "-" "Java/1.7.0_80"
127.0.0.1 - - [18/Aug/2017:19:40:28 +0000] "GET /api/atlas/discovery/search?query=DB_v1+where+(name+%3D+%22Reporting%22)+select+name+as+_col_0,+(createTime+%2B+1)+as+_col_1+&limit=10&offset=0
HTTP/1.1" 200 - "-" "Java/1.7.0_80"
127.0.0.1 - - [18/Aug/2017:19:40:30 +0000] "GET /api/atlas/discovery/search?query=Dimension_v1&limit=10&offset=0
HTTP/1.1" 200 - "-" "Java/1.7.0_80"
127.0.0.1 - - [18/Aug/2017:19:40:31 +0000] "GET /api/atlas/discovery/search?query=JdbcAccess_v1&limit=10&offset=0
HTTP/1.1" 200 - "-" "Java/1.7.0_80"
127.0.0.1 - - [18/Aug/2017:19:40:32 +0000] "GET /api/atlas/discovery/search?query=ETL_v1&limit=10&offset=0
HTTP/1.1" 200 - "-" "Java/1.7.0_80"
127.0.0.1 - - [18/Aug/2017:19:40:33 +0000] "GET /api/atlas/discovery/search?query=Metric_v1&limit=10&offset=0
HTTP/1.1" 200 - "-" "Java/1.7.0_80"
127.0.0.1 - - [18/Aug/2017:19:40:34 +0000] "GET /api/atlas/discovery/search?query=PII_v1&limit=10&offset=0
HTTP/1.1" 200 - "-" "Java/1.7.0_80"
127.0.0.1 - - [18/Aug/2017:19:40:35 +0000] "GET /api/atlas/discovery/search?query=%60Log+Data_v1%60&limit=10&offset=0
HTTP/1.1" 200 - "-" "Java/1.7.0_80"
127.0.0.1 - - [18/Aug/2017:19:40:36 +0000] "GET /api/atlas/discovery/search?query=Table_v1+where+name%3D%22sales_fact%22,+columns&limit=10&offset=0
HTTP/1.1" 200 - "-" "Java/1.7.0_80"
127.0.0.1 - - [18/Aug/2017:19:40:37 +0000] "GET /api/atlas/discovery/search?query=Table_v1+where+name%3D%22sales_fact%22,+columns+as+column+select+column.name,+column.dataType,+column.comment&limit=10&offset=0
HTTP/1.1" 200 - "-" "Java/1.7.0_80"
127.0.0.1 - - [18/Aug/2017:19:40:39 +0000] "GET /api/atlas/discovery/search?query=from+DataSet&limit=10&offset=0
HTTP/1.1" 200 - "-" "Java/1.7.0_80"
127.0.0.1 - - [18/Aug/2017:19:40:40 +0000] "GET /api/atlas/discovery/search?query=from+Process&limit=10&offset=0
HTTP/1.1" 200 - "-" "Java/1.7.0_80"
127.0.0.1 - - [18/Aug/2017:19:40:41 +0000] "GET /api/atlas/entities?type=View_v1&property=qualifiedName&value=product_dim_view
HTTP/1.1" 200 - "-" "Java/1.7.0_80"
127.0.0.1 - - [18/Aug/2017:19:40:41 +0000] "GET /api/atlas/entities?type=Table_v1&property=qualifiedName&value=product_dim
HTTP/1.1" 200 - "-" "Java/1.7.0_80"
127.0.0.1 - - [18/Aug/2017:19:40:41 +0000] "GET /api/atlas/entities?type=LoadProcess_v1&property=qualifiedName&value=loadSalesDaily
HTTP/1.1" 200 - "-" "Java/1.7.0_80"
127.0.0.1 - - [18/Aug/2017:19:40:41 +0000] "GET /api/atlas/entities?type=Table_v1&property=qualifiedName&value=sales_fact
HTTP/1.1" 200 - "-" "Java/1.7.0_80"
127.0.0.1 - - [18/Aug/2017:19:40:41 +0000] "GET /api/atlas/entities?type=Table_v1&property=qualifiedName&value=time_dim
HTTP/1.1" 200 - "-" "Java/1.7.0_80"
127.0.0.1 - - [18/Aug/2017:19:40:41 +0000] "GET /api/atlas/entities?type=Table_v1&property=qualifiedName&value=sales_fact_daily_mv
HTTP/1.1" 200 - "-" "Java/1.7.0_80"
127.0.0.1 - - [18/Aug/2017:19:40:41 +0000] "GET /api/atlas/entities?type=DB_v1&property=name&value=Sales
HTTP/1.1" 200 - "-" "Java/1.7.0_80"
127.0.0.1 - - [18/Aug/2017:19:40:41 +0000] "GET /api/atlas/entities?type=Table_v1&property=qualifiedName&value=sales_fact
HTTP/1.1" 200 - "-" "Java/1.7.0_80"
127.0.0.1 - - [18/Aug/2017:19:40:41 +0000] "GET /api/atlas/entities?type=Table_v1&property=qualifiedName&value=time_dim
HTTP/1.1" 200 - "-" "Java/1.7.0_80"
127.0.0.1 - - [18/Aug/2017:19:40:41 +0000] "GET /api/atlas/entities?type=Table_v1&property=qualifiedName&value=sales_fact_daily_mv
HTTP/1.1" 200 - "-" "Java/1.7.0_80"
127.0.0.1 - - [18/Aug/2017:19:40:41 +0000] "GET /api/atlas/lineage/hive/table/sales_fact_daily_mv/inputs/graph
HTTP/1.1" 200 - "-" "Java/1.7.0_80"
127.0.0.1 - - [18/Aug/2017:19:40:44 +0000] "GET /api/atlas/entities?type=Table_v1&property=qualifiedName&value=sales_fact
HTTP/1.1" 200 - "-" "Java/1.7.0_80"
127.0.0.1 - - [18/Aug/2017:19:40:44 +0000] "GET /api/atlas/entities?type=DB_v1&property=name&value=Sales
HTTP/1.1" 200 - "-" "Java/1.7.0_80"
Tests run: 132, Failures: 3, Errors: 0, Skipped: 0, Time elapsed: 294.167 sec <<<
FAILURE! - in TestSuite
testDeleteByQualifiedName(org.apache.atlas.notification.NotificationHookConsumerIT)  Time
elapsed: 60.065 sec  <<< FAILURE!
java.lang.Exception: Waiting timed out after 60000 msec
	at org.apache.atlas.notification.NotificationHookConsumerIT.testDeleteByQualifiedName(NotificationHookConsumerIT.java:184)

testUpdateEntityPartial(org.apache.atlas.notification.NotificationHookConsumerIT)  Time elapsed:
60.112 sec  <<< FAILURE!
java.lang.Exception: Waiting timed out after 60000 msec
	at org.apache.atlas.notification.NotificationHookConsumerIT.testUpdateEntityPartial(NotificationHookConsumerIT.java:127)

testPartialUpdate(org.apache.atlas.web.integration.EntityJerseyResourceIT)  Time elapsed:
0.144 sec  <<< FAILURE!
java.lang.AssertionError: expected:<1> but was:<3>
	at org.apache.atlas.web.integration.EntityJerseyResourceIT.testPartialUpdate(EntityJerseyResourceIT.java:881)


Results :

Failed tests: 
  NotificationHookConsumerIT.testDeleteByQualifiedName:184->BaseResourceIT.waitFor:626
» 
  NotificationHookConsumerIT.testUpdateEntityPartial:127->BaseResourceIT.waitFor:626 »

  EntityJerseyResourceIT.testPartialUpdate:881 expected:<1> but was:<3>

Tests run: 132, Failures: 3, Errors: 0, Skipped: 0

[INFO] 
[INFO] --- jetty-maven-plugin:9.2.12.v20150709:stop (stop-jetty) @ atlas-webapp ---
[INFO] Waiting 10 seconds for jetty to stop
[INFO] Stopped ServerConnector@71b1e7da{HTTP/1.1}{0.0.0.0:31000}
[INFO] Closing Spring root WebApplicationContext
[INFO] Shutting down log4j
[INFO] Stopped o.e.j.m.p.JettyWebAppContext@4c463e01{/,<https://builds.apache.org/job/Atlas-master-IntegrationTests/ws/webapp/target/atlas-webapp-0.9-SNAPSHOT/,UNAVAILABLE}{/home/jenkins/jenkins-slave/workspace/Atlas-master-IntegrationTests/webapp/target/atlas-webapp-0.9-SNAPSHOT.war}>
[INFO] Server reports itself as stopped
[INFO] 
[INFO] --- maven-source-plugin:2.4:jar-no-fork (attach-sources) @ atlas-webapp ---
[INFO] Building jar: <https://builds.apache.org/job/Atlas-master-IntegrationTests/ws/webapp/target/atlas-webapp-0.9-SNAPSHOT-sources.jar>
log4j:WARN No appenders could be found for logger (org.apache.zookeeper.ClientCnxn).
log4j:WARN Please initialize the log4j system properly.
log4j:WARN See http://logging.apache.org/log4j/1.2/faq.html#noconfig for more info.
[INFO] 
[INFO] --- maven-source-plugin:2.4:test-jar-no-fork (attach-sources) @ atlas-webapp ---
[INFO] Building jar: <https://builds.apache.org/job/Atlas-master-IntegrationTests/ws/webapp/target/atlas-webapp-0.9-SNAPSHOT-test-sources.jar>
[INFO] 
[INFO] --- maven-failsafe-plugin:2.19.1:verify (verify) @ atlas-webapp ---
[INFO] ------------------------------------------------------------------------
[INFO] Reactor Summary:
[INFO] 
[INFO] Apache Atlas Server Build Tools .................... SUCCESS [  1.486 s]
[INFO] apache-atlas ....................................... SUCCESS [ 18.416 s]
[INFO] Apache Atlas Integration ........................... SUCCESS [ 31.720 s]
[INFO] Apache Atlas Common ................................ SUCCESS [ 15.205 s]
[INFO] Apache Atlas Typesystem ............................ SUCCESS [01:09 min]
[INFO] Apache Atlas Client ................................ SUCCESS [ 17.562 s]
[INFO] Apache Atlas Server API ............................ SUCCESS [ 10.489 s]
[INFO] Apache Atlas Notification .......................... SUCCESS [ 15.339 s]
[INFO] Apache Atlas Graph Database Projects ............... SUCCESS [  0.671 s]
[INFO] Apache Atlas Graph Database API .................... SUCCESS [  7.347 s]
[INFO] Graph Database Common Code ......................... SUCCESS [  7.848 s]
[INFO] Apache Atlas Titan 1.0.0 GraphDB Impl .............. SUCCESS [ 37.403 s]
[INFO] Shaded version of Apache hbase client .............. SUCCESS [  8.483 s]
[INFO] Apache Atlas Titan 0.5.4 Graph DB Impl ............. SUCCESS [ 45.110 s]
[INFO] Apache Atlas Graph Database Implementation Dependencies SUCCESS [  0.896 s]
[INFO] Shaded version of Apache hbase server .............. SUCCESS [ 27.486 s]
[INFO] Apache Atlas Repository ............................ SUCCESS [01:52 min]
[INFO] Apache Atlas Authorization ......................... SUCCESS [ 11.757 s]
[INFO] Apache Atlas Business Catalog ...................... SUCCESS [ 17.427 s]
[INFO] Apache Atlas UI .................................... SUCCESS [01:04 min]
[INFO] Apache Atlas Web Application ....................... FAILURE [06:35 min]
[INFO] Apache Atlas Documentation ......................... SKIPPED
[INFO] Apache Atlas FileSystem Model ...................... SKIPPED
[INFO] Apache Atlas Plugin Classloader .................... SKIPPED
[INFO] Apache Atlas Hive Bridge Shim ...................... SKIPPED
[INFO] Apache Atlas Hive Bridge ........................... SKIPPED
[INFO] Apache Atlas Falcon Bridge Shim .................... SKIPPED
[INFO] Apache Atlas Falcon Bridge ......................... SKIPPED
[INFO] Apache Atlas Sqoop Bridge Shim ..................... SKIPPED
[INFO] Apache Atlas Sqoop Bridge .......................... SKIPPED
[INFO] Apache Atlas Storm Bridge Shim ..................... SKIPPED
[INFO] Apache Atlas Storm Bridge .......................... SKIPPED
[INFO] Apache Atlas Distribution .......................... SKIPPED
[INFO] ------------------------------------------------------------------------
[INFO] BUILD FAILURE
[INFO] ------------------------------------------------------------------------
[INFO] Total time: 15:18 min
[INFO] Finished at: 2017-08-18T19:40:51Z
[INFO] Final Memory: 359M/2032M
[INFO] ------------------------------------------------------------------------
[ERROR] Failed to execute goal org.apache.maven.plugins:maven-failsafe-plugin:2.19.1:verify
(verify) on project atlas-webapp: There are test failures.
[ERROR] 
[ERROR] Please refer to <https://builds.apache.org/job/Atlas-master-IntegrationTests/ws/webapp/target/failsafe-reports>
for the individual test results.
[ERROR] -> [Help 1]
[ERROR] 
[ERROR] To see the full stack trace of the errors, re-run Maven with the -e switch.
[ERROR] Re-run Maven using the -X switch to enable full debug logging.
[ERROR] 
[ERROR] For more information about the errors and possible solutions, please read the following
articles:
[ERROR] [Help 1] http://cwiki.apache.org/confluence/display/MAVEN/MojoFailureException
[ERROR] 
[ERROR] After correcting the problems, you can resume the build with the command
[ERROR]   mvn <goals> -rf :atlas-webapp
Build step 'Execute shell' marked build as failure
[CHECKSTYLE] Collecting checkstyle analysis files...
[CHECKSTYLE] Searching for all files in <https://builds.apache.org/job/Atlas-master-IntegrationTests/ws/>
that match the pattern **/target/checkstyle-result.xml
[CHECKSTYLE] Parsing 19 files in <https://builds.apache.org/job/Atlas-master-IntegrationTests/ws/>
[CHECKSTYLE] Successfully parsed file <https://builds.apache.org/job/Atlas-master-IntegrationTests/ws/authorization/target/checkstyle-result.xml>
with 467 unique warnings and 0 duplicates.
[CHECKSTYLE] Successfully parsed file <https://builds.apache.org/job/Atlas-master-IntegrationTests/ws/catalog/target/checkstyle-result.xml>
with 2612 unique warnings and 0 duplicates.
[CHECKSTYLE] Successfully parsed file <https://builds.apache.org/job/Atlas-master-IntegrationTests/ws/client/target/checkstyle-result.xml>
with 4249 unique warnings and 0 duplicates.
[CHECKSTYLE] Successfully parsed file <https://builds.apache.org/job/Atlas-master-IntegrationTests/ws/common/target/checkstyle-result.xml>
with 5461 unique warnings and 0 duplicates.
[CHECKSTYLE] Successfully parsed file <https://builds.apache.org/job/Atlas-master-IntegrationTests/ws/dashboardv2/target/checkstyle-result.xml>
with 5461 unique warnings and 0 duplicates.
[CHECKSTYLE] Successfully parsed file <https://builds.apache.org/job/Atlas-master-IntegrationTests/ws/graphdb/api/target/checkstyle-result.xml>
with 5730 unique warnings and 0 duplicates.
[CHECKSTYLE] Successfully parsed file <https://builds.apache.org/job/Atlas-master-IntegrationTests/ws/graphdb/common/target/checkstyle-result.xml>
with 5917 unique warnings and 0 duplicates.
[CHECKSTYLE] Successfully parsed file <https://builds.apache.org/job/Atlas-master-IntegrationTests/ws/graphdb/graphdb-impls/target/checkstyle-result.xml>
with 5917 unique warnings and 0 duplicates.
[CHECKSTYLE] Successfully parsed file <https://builds.apache.org/job/Atlas-master-IntegrationTests/ws/graphdb/target/checkstyle-result.xml>
with 5917 unique warnings and 0 duplicates.
[CHECKSTYLE] Successfully parsed file <https://builds.apache.org/job/Atlas-master-IntegrationTests/ws/graphdb/titan0/target/checkstyle-result.xml>
with 8191 unique warnings and 0 duplicates.
[CHECKSTYLE] Successfully parsed file <https://builds.apache.org/job/Atlas-master-IntegrationTests/ws/graphdb/titan1/target/checkstyle-result.xml>
with 9139 unique warnings and 0 duplicates.
[CHECKSTYLE] Successfully parsed file <https://builds.apache.org/job/Atlas-master-IntegrationTests/ws/intg/target/checkstyle-result.xml>
with 16649 unique warnings and 0 duplicates.
[CHECKSTYLE] Successfully parsed file <https://builds.apache.org/job/Atlas-master-IntegrationTests/ws/notification/target/checkstyle-result.xml>
with 17859 unique warnings and 0 duplicates.
[CHECKSTYLE] Successfully parsed file <https://builds.apache.org/job/Atlas-master-IntegrationTests/ws/repository/target/checkstyle-result.xml>
with 37362 unique warnings and 0 duplicates.
[CHECKSTYLE] Successfully parsed file <https://builds.apache.org/job/Atlas-master-IntegrationTests/ws/server-api/target/checkstyle-result.xml>
with 37741 unique warnings and 0 duplicates.
[CHECKSTYLE] Successfully parsed file <https://builds.apache.org/job/Atlas-master-IntegrationTests/ws/shaded/hbase-client-shaded/target/checkstyle-result.xml>
with 37741 unique warnings and 0 duplicates.
[CHECKSTYLE] Successfully parsed file <https://builds.apache.org/job/Atlas-master-IntegrationTests/ws/shaded/hbase-server-shaded/target/checkstyle-result.xml>
with 37741 unique warnings and 0 duplicates.
[CHECKSTYLE] Successfully parsed file <https://builds.apache.org/job/Atlas-master-IntegrationTests/ws/target/checkstyle-result.xml>
with 37741 unique warnings and 0 duplicates.
[CHECKSTYLE] Successfully parsed file <https://builds.apache.org/job/Atlas-master-IntegrationTests/ws/typesystem/target/checkstyle-result.xml>
with 41959 unique warnings and 0 duplicates.
<Git Blamer> Using GitBlamer to create author and commit information for all warnings.
<Git Blamer> GIT_COMMIT=86fb9da494f23ed7689e67b131e736344afa1811, workspace=<https://builds.apache.org/job/Atlas-master-IntegrationTests/ws/>
 > git rev-parse 86fb9da494f23ed7689e67b131e736344afa1811^{commit} # timeout=10
[FINDBUGS] Collecting findbugs analysis files...
[FINDBUGS] Searching for all files in <https://builds.apache.org/job/Atlas-master-IntegrationTests/ws/>
that match the pattern **/target/findbugs.xml
[FINDBUGS] Parsing 12 files in <https://builds.apache.org/job/Atlas-master-IntegrationTests/ws/>
[FINDBUGS] Successfully parsed file <https://builds.apache.org/job/Atlas-master-IntegrationTests/ws/authorization/target/findbugs.xml>
with 0 unique warnings and 0 duplicates.
[FINDBUGS] Successfully parsed file <https://builds.apache.org/job/Atlas-master-IntegrationTests/ws/catalog/target/findbugs.xml>
with 0 unique warnings and 0 duplicates.
[FINDBUGS] Successfully parsed file <https://builds.apache.org/job/Atlas-master-IntegrationTests/ws/client/target/findbugs.xml>
with 0 unique warnings and 0 duplicates.
[FINDBUGS] Successfully parsed file <https://builds.apache.org/job/Atlas-master-IntegrationTests/ws/common/target/findbugs.xml>
with 0 unique warnings and 0 duplicates.
[FINDBUGS] Successfully parsed file <https://builds.apache.org/job/Atlas-master-IntegrationTests/ws/graphdb/api/target/findbugs.xml>
with 0 unique warnings and 0 duplicates.
[FINDBUGS] Successfully parsed file <https://builds.apache.org/job/Atlas-master-IntegrationTests/ws/graphdb/common/target/findbugs.xml>
with 0 unique warnings and 0 duplicates.
[FINDBUGS] Successfully parsed file <https://builds.apache.org/job/Atlas-master-IntegrationTests/ws/graphdb/titan0/target/findbugs.xml>
with 0 unique warnings and 0 duplicates.
[FINDBUGS] Successfully parsed file <https://builds.apache.org/job/Atlas-master-IntegrationTests/ws/intg/target/findbugs.xml>
with 0 unique warnings and 0 duplicates.
[FINDBUGS] Successfully parsed file <https://builds.apache.org/job/Atlas-master-IntegrationTests/ws/notification/target/findbugs.xml>
with 0 unique warnings and 0 duplicates.
[FINDBUGS] Successfully parsed file <https://builds.apache.org/job/Atlas-master-IntegrationTests/ws/repository/target/findbugs.xml>
with 0 unique warnings and 0 duplicates.
[FINDBUGS] Successfully parsed file <https://builds.apache.org/job/Atlas-master-IntegrationTests/ws/server-api/target/findbugs.xml>
with 0 unique warnings and 0 duplicates.
[FINDBUGS] Successfully parsed file <https://builds.apache.org/job/Atlas-master-IntegrationTests/ws/typesystem/target/findbugs.xml>
with 0 unique warnings and 0 duplicates.
<Git Blamer> Using GitBlamer to create author and commit information for all warnings.
<Git Blamer> GIT_COMMIT=86fb9da494f23ed7689e67b131e736344afa1811, workspace=<https://builds.apache.org/job/Atlas-master-IntegrationTests/ws/>
Archiving artifacts
[Fast Archiver] No prior successful build to compare, so performing full copy of artifacts
TestNG Reports Processing: START
Looking for TestNG results report in workspace using pattern: **/target/surefire-reports/testng-results.xml,**/target/failsafe-reports/testng-results.xml
Saving reports...
Processing '/x1/jenkins/jenkins-home/jobs/Atlas-master-IntegrationTests/builds/19/testng/testng-results.xml'
2.272727% of tests failed, which exceeded threshold of 0%. Marking build as UNSTABLE
TestNG Reports Processing: FINISH

Mime
View raw message