atlas-dev mailing list archives

Site index · List index
Message view « Date » · « Thread »
Top « Date » · « Thread »
From Apache Jenkins Server <jenk...@builds.apache.org>
Subject Build failed in Jenkins: Atlas-master-IntegrationTests #51
Date Wed, 30 Aug 2017 19:02:01 GMT
See <https://builds.apache.org/job/Atlas-master-IntegrationTests/51/display/redirect?page=changes>

Changes:

[ssubramanian] ATLAS-2059: Update test-patch.sh script to remove ulimit value

------------------------------------------
[...truncated 36.93 MB...]
2017-08-30 18:57:00,603 DEBUG - [NotificationHookConsumer thread-0:] ~ Finding edges for vertex[id=2626816
type=hdfs_path guid=421164ba-22d1-4d98-a181-ac7935760a2d] with label __fs_path.posixPermissions
(GraphHelper:316)
2017-08-30 18:57:00,604 DEBUG - [NotificationHookConsumer thread-0:] ~ Found null (GraphHelper:438)
2017-08-30 18:57:00,604 DEBUG - [NotificationHookConsumer thread-0:] ~ Mapping attributeInfo
qualifiedName (GraphToTypedInstanceMapper:144)
2017-08-30 18:57:00,604 DEBUG - [NotificationHookConsumer thread-0:] ~ Adding primitive {name=qualifiedName,
dataType={name=string, description=null}, multiplicity={lower=1, upper=1, isUnique=false},
isComposite=false, isUnique=true, isIndexable=true, reverseAttributeName=null} from vertex
Titan0Vertex [id=2626816] (GraphToTypedInstanceMapper:387)
2017-08-30 18:57:00,605 DEBUG - [NotificationHookConsumer thread-0:] ~ Reading property Referenceable.qualifiedName
from vertex[id=2626816 type=hdfs_path guid=421164ba-22d1-4d98-a181-ac7935760a2d] (GraphHelper:505)
2017-08-30 18:57:00,607 DEBUG - [NotificationHookConsumer thread-0:] ~ Reading property Referenceable.qualifiedName
from vertex[id=2626816 type=hdfs_path guid=421164ba-22d1-4d98-a181-ac7935760a2d] (GraphHelper:505)
2017-08-30 18:57:00,607 DEBUG - [NotificationHookConsumer thread-0:] ~ Mapping attributeInfo
name (GraphToTypedInstanceMapper:144)
2017-08-30 18:57:00,608 DEBUG - [NotificationHookConsumer thread-0:] ~ Adding primitive {name=name,
dataType={name=string, description=null}, multiplicity={lower=1, upper=1, isUnique=false},
isComposite=false, isUnique=false, isIndexable=true, reverseAttributeName=null} from vertex
Titan0Vertex [id=2626816] (GraphToTypedInstanceMapper:387)
2017-08-30 18:57:00,609 DEBUG - [NotificationHookConsumer thread-0:] ~ Reading property Asset.name
from vertex[id=2626816 type=hdfs_path guid=421164ba-22d1-4d98-a181-ac7935760a2d] (GraphHelper:505)
2017-08-30 18:57:00,611 DEBUG - [NotificationHookConsumer thread-0:] ~ Reading property Asset.name
from vertex[id=2626816 type=hdfs_path guid=421164ba-22d1-4d98-a181-ac7935760a2d] (GraphHelper:505)
2017-08-30 18:57:00,611 DEBUG - [NotificationHookConsumer thread-0:] ~ Mapping attributeInfo
description (GraphToTypedInstanceMapper:144)
2017-08-30 18:57:00,612 DEBUG - [NotificationHookConsumer thread-0:] ~ Adding primitive {name=description,
dataType={name=string, description=null}, multiplicity={lower=0, upper=1, isUnique=false},
isComposite=false, isUnique=false, isIndexable=false, reverseAttributeName=null} from vertex
Titan0Vertex [id=2626816] (GraphToTypedInstanceMapper:387)
2017-08-30 18:57:00,613 DEBUG - [NotificationHookConsumer thread-0:] ~ Reading property Asset.description
from vertex[id=2626816 type=hdfs_path guid=421164ba-22d1-4d98-a181-ac7935760a2d] (GraphHelper:505)
2017-08-30 18:57:00,613 DEBUG - [NotificationHookConsumer thread-0:] ~ Mapping attributeInfo
owner (GraphToTypedInstanceMapper:144)
2017-08-30 18:57:00,614 DEBUG - [NotificationHookConsumer thread-0:] ~ Adding primitive {name=owner,
dataType={name=string, description=null}, multiplicity={lower=0, upper=1, isUnique=false},
isComposite=false, isUnique=false, isIndexable=true, reverseAttributeName=null} from vertex
Titan0Vertex [id=2626816] (GraphToTypedInstanceMapper:387)
2017-08-30 18:57:00,615 DEBUG - [NotificationHookConsumer thread-0:] ~ Reading property Asset.owner
from vertex[id=2626816 type=hdfs_path guid=421164ba-22d1-4d98-a181-ac7935760a2d] (GraphHelper:505)
2017-08-30 18:57:00,635 DEBUG - [NotificationHookConsumer thread-0:] ~ Sending message for
topic ATLAS_ENTITIES: {"version":{"version":"1.0.0"},"message":{"entity":{"jsonClass":"org.apache.atlas.typesystem.json.InstanceSerialization$_Reference","id":{"jsonClass":"org.apache.atlas.typesystem.json.InstanceSerialization$_Id","id":"2e80fddf-e235-4e77-b2e9-6323f3284b21","version":0,"typeName":"hive_process","state":"ACTIVE"},"typeName":"hive_process","values":{"queryId":"jenkins_20170830185503_64bb39c3-4cba-41c7-8f44-b5c9fb9218d0","name":"create
 external table tablecxcoozkz92(id int, name string) comment \u0027table comment\u0027  partitioned
by(dt string) location \u0027pfile:///home/jenkins/jenkins-slave/workspace/atlas-master-integrationtests/addons/hive-bridge/./target/sometestpath-data-jw8wmeh2uy\u0027","startTime":"2017-08-30T18:55:03.590Z","queryPlan":"Not
Supported","operationType":"CREATETABLE","outputs":[{"jsonClass":"org.apache.atlas.typesystem.json.InstanceSerialization$_Id","id":"6130cffc-9327-48d9-ac94-bc28d1c7c987","version":0,"typeName":"DataSet","state":"ACTIVE"}],"endTime":"2017-08-30T18:55:03.776Z","recentQueries":["create
 external table tablecxcoozkz92(id int, name string) comment \u0027table comment\u0027  partitioned
by(dt string) location \u0027pfile:///home/jenkins/jenkins-slave/workspace/atlas-master-integrationtests/addons/hive-bridge/./target/sometestpath-data-jw8wmeh2uy\u0027"],"inputs":[{"jsonClass":"org.apache.atlas.typesystem.json.InstanceSerialization$_Id","id":"421164ba-22d1-4d98-a181-ac7935760a2d","version":0,"typeName":"DataSet","state":"ACTIVE"}],"qualifiedName":"default.tablecxcoozkz92@primary:1504119303000","queryText":"create
 external table tablecxcoozkz92(id int, name string) comment \u0027table comment\u0027  partitioned
by(dt string) location \u0027pfile:///home/jenkins/jenkins-slave/workspace/atlas-master-integrationtests/addons/hive-bridge/./target/sometestpath-data-jw8wmeh2uy\u0027","clusterName":"primary","userName":"jenkins"},"traitNames":[],"traits":{},"systemAttributes":{}},"operationType":"ENTITY_CREATE","traits":[]}}
(KafkaNotification:218)
2017-08-30 18:57:00,636 DEBUG - [NotificationHookConsumer thread-0:] ~ Sending message for
topic ATLAS_ENTITIES: {"version":{"version":"1.0.0"},"message":{"entity":{"jsonClass":"org.apache.atlas.typesystem.json.InstanceSerialization$_Reference","id":{"jsonClass":"org.apache.atlas.typesystem.json.InstanceSerialization$_Id","id":"421164ba-22d1-4d98-a181-ac7935760a2d","version":0,"typeName":"hdfs_path","state":"ACTIVE"},"typeName":"hdfs_path","values":{"name":"/home/jenkins/jenkins-slave/workspace/atlas-master-integrationtests/addons/hive-bridge/target/sometestpath-data-jw8wmeh2uy","path":"pfile:/home/jenkins/jenkins-slave/workspace/atlas-master-integrationtests/addons/hive-bridge/target/sometestpath-data-jw8wmeh2uy","createTime":"1970-01-01T00:00:00.000Z","isSymlink":false,"numberOfReplicas":0,"qualifiedName":"pfile:/home/jenkins/jenkins-slave/workspace/atlas-master-integrationtests/addons/hive-bridge/target/sometestpath-data-jw8wmeh2uy","isFile":false,"fileSize":0,"modifiedTime":"1970-01-01T00:00:00.000Z","clusterName":"primary"},"traitNames":[],"traits":{},"systemAttributes":{}},"operationType":"ENTITY_CREATE","traits":[]}}
(KafkaNotification:218)
2017-08-30 18:57:02,210 INFO  - [ShutdownMonitor:] ~ Stopping service org.apache.atlas.notification.NotificationHookConsumer
(Services:65)
2017-08-30 18:57:02,210 INFO  - [ShutdownMonitor:] ~ ==> stopConsumerThreads() (NotificationHookConsumer:175)
2017-08-30 18:57:02,210 INFO  - [ShutdownMonitor:] ~ ==> HookConsumer shutdown() (NotificationHookConsumer$HookConsumer:423)
2017-08-30 18:57:02,211 INFO  - [ShutdownMonitor:] ~ [atlas-hook-consumer-thread], Shutting
down (Logging$class:68)
2017-08-30 18:57:02,389 DEBUG - [main-SendThread(localhost:19026):] ~ ==> InMemoryJAASConfiguration.getAppConfigurationEntry(Client)
(InMemoryJAASConfiguration:208)
2017-08-30 18:57:02,390 DEBUG - [main-SendThread(localhost:19026):] ~ <== InMemoryJAASConfiguration.getAppConfigurationEntry(Client):
{} (InMemoryJAASConfiguration:238)
2017-08-30 18:57:02,390 WARN  - [main-SendThread(localhost:19026):] ~ Session 0x15e347bc41b0000
for server null, unexpected error, closing socket connection and attempting reconnect (ClientCnxn$SendThread:1102)
java.net.ConnectException: Connection refused
	at sun.nio.ch.SocketChannelImpl.checkConnect(Native Method)
	at sun.nio.ch.SocketChannelImpl.finishConnect(SocketChannelImpl.java:744)
	at org.apache.zookeeper.ClientCnxnSocketNIO.doTransport(ClientCnxnSocketNIO.java:361)
	at org.apache.zookeeper.ClientCnxn$SendThread.run(ClientCnxn.java:1081)
2017-08-30 18:57:03,132 DEBUG - [Curator-Framework-0-SendThread(localhost:19026):] ~ ==>
InMemoryJAASConfiguration.getAppConfigurationEntry(Client) (InMemoryJAASConfiguration:208)
2017-08-30 18:57:03,133 DEBUG - [Curator-Framework-0-SendThread(localhost:19026):] ~ <==
InMemoryJAASConfiguration.getAppConfigurationEntry(Client): {} (InMemoryJAASConfiguration:238)
2017-08-30 18:57:03,496 DEBUG - [main-SendThread(localhost:19026):] ~ ==> InMemoryJAASConfiguration.getAppConfigurationEntry(Client)
(InMemoryJAASConfiguration:208)
2017-08-30 18:57:03,497 DEBUG - [main-SendThread(localhost:19026):] ~ <== InMemoryJAASConfiguration.getAppConfigurationEntry(Client):
{} (InMemoryJAASConfiguration:238)
2017-08-30 18:57:03,497 WARN  - [main-SendThread(localhost:19026):] ~ Session 0x15e347bc41b0000
for server null, unexpected error, closing socket connection and attempting reconnect (ClientCnxn$SendThread:1102)
java.net.ConnectException: Connection refused
	at sun.nio.ch.SocketChannelImpl.checkConnect(Native Method)
	at sun.nio.ch.SocketChannelImpl.finishConnect(SocketChannelImpl.java:744)
	at org.apache.zookeeper.ClientCnxnSocketNIO.doTransport(ClientCnxnSocketNIO.java:361)
	at org.apache.zookeeper.ClientCnxn$SendThread.run(ClientCnxn.java:1081)
2017-08-30 18:57:04,412 DEBUG - [main-SendThread(localhost:19026):] ~ ==> InMemoryJAASConfiguration.getAppConfigurationEntry(Client)
(InMemoryJAASConfiguration:208)
2017-08-30 18:57:04,413 DEBUG - [main-SendThread(localhost:19026):] ~ <== InMemoryJAASConfiguration.getAppConfigurationEntry(Client):
{} (InMemoryJAASConfiguration:238)
2017-08-30 18:57:04,413 WARN  - [main-SendThread(localhost:19026):] ~ Session 0x15e347bc41b0000
for server null, unexpected error, closing socket connection and attempting reconnect (ClientCnxn$SendThread:1102)
java.net.ConnectException: Connection refused
	at sun.nio.ch.SocketChannelImpl.checkConnect(Native Method)
	at sun.nio.ch.SocketChannelImpl.finishConnect(SocketChannelImpl.java:744)
	at org.apache.zookeeper.ClientCnxnSocketNIO.doTransport(ClientCnxnSocketNIO.java:361)
	at org.apache.zookeeper.ClientCnxn$SendThread.run(ClientCnxn.java:1081)
2017-08-30 18:57:05,072 DEBUG - [Curator-Framework-0-SendThread(localhost:19026):] ~ ==>
InMemoryJAASConfiguration.getAppConfigurationEntry(Client) (InMemoryJAASConfiguration:208)
2017-08-30 18:57:05,073 DEBUG - [Curator-Framework-0-SendThread(localhost:19026):] ~ <==
InMemoryJAASConfiguration.getAppConfigurationEntry(Client): {} (InMemoryJAASConfiguration:238)
2017-08-30 18:57:06,016 DEBUG - [Curator-Framework-0-SendThread(localhost:19026):] ~ ==>
InMemoryJAASConfiguration.getAppConfigurationEntry(Client) (InMemoryJAASConfiguration:208)
2017-08-30 18:57:06,016 DEBUG - [Curator-Framework-0-SendThread(localhost:19026):] ~ <==
InMemoryJAASConfiguration.getAppConfigurationEntry(Client): {} (InMemoryJAASConfiguration:238)
2017-08-30 18:57:06,422 DEBUG - [main-SendThread(localhost:19026):] ~ ==> InMemoryJAASConfiguration.getAppConfigurationEntry(Client)
(InMemoryJAASConfiguration:208)
2017-08-30 18:57:06,423 DEBUG - [main-SendThread(localhost:19026):] ~ <== InMemoryJAASConfiguration.getAppConfigurationEntry(Client):
{} (InMemoryJAASConfiguration:238)
2017-08-30 18:57:06,423 WARN  - [main-SendThread(localhost:19026):] ~ Session 0x15e347bc41b0000
for server null, unexpected error, closing socket connection and attempting reconnect (ClientCnxn$SendThread:1102)
java.net.ConnectException: Connection refused
	at sun.nio.ch.SocketChannelImpl.checkConnect(Native Method)
	at sun.nio.ch.SocketChannelImpl.finishConnect(SocketChannelImpl.java:744)
	at org.apache.zookeeper.ClientCnxnSocketNIO.doTransport(ClientCnxnSocketNIO.java:361)
	at org.apache.zookeeper.ClientCnxn$SendThread.run(ClientCnxn.java:1081)
2017-08-30 18:57:06,808 DEBUG - [main-SendThread(localhost:19026):] ~ ==> InMemoryJAASConfiguration.getAppConfigurationEntry(Client)
(InMemoryJAASConfiguration:208)
2017-08-30 18:57:06,809 DEBUG - [main-SendThread(localhost:19026):] ~ <== InMemoryJAASConfiguration.getAppConfigurationEntry(Client):
{} (InMemoryJAASConfiguration:238)
2017-08-30 18:57:06,809 WARN  - [main-SendThread(localhost:19026):] ~ Session 0x15e347bc41b0000
for server null, unexpected error, closing socket connection and attempting reconnect (ClientCnxn$SendThread:1102)
java.net.ConnectException: Connection refused
	at sun.nio.ch.SocketChannelImpl.checkConnect(Native Method)
	at sun.nio.ch.SocketChannelImpl.finishConnect(SocketChannelImpl.java:744)
	at org.apache.zookeeper.ClientCnxnSocketNIO.doTransport(ClientCnxnSocketNIO.java:361)
	at org.apache.zookeeper.ClientCnxn$SendThread.run(ClientCnxn.java:1081)
2017-08-30 18:57:07,322 DEBUG - [Curator-Framework-0-SendThread(localhost:19026):] ~ ==>
InMemoryJAASConfiguration.getAppConfigurationEntry(Client) (InMemoryJAASConfiguration:208)
2017-08-30 18:57:07,323 DEBUG - [Curator-Framework-0-SendThread(localhost:19026):] ~ <==
InMemoryJAASConfiguration.getAppConfigurationEntry(Client): {} (InMemoryJAASConfiguration:238)
2017-08-30 18:57:08,360 DEBUG - [Curator-Framework-0-SendThread(localhost:19026):] ~ ==>
InMemoryJAASConfiguration.getAppConfigurationEntry(Client) (InMemoryJAASConfiguration:208)
2017-08-30 18:57:08,361 DEBUG - [Curator-Framework-0-SendThread(localhost:19026):] ~ <==
InMemoryJAASConfiguration.getAppConfigurationEntry(Client): {} (InMemoryJAASConfiguration:238)
2017-08-30 18:57:08,371 DEBUG - [main-SendThread(localhost:19026):] ~ ==> InMemoryJAASConfiguration.getAppConfigurationEntry(Client)
(InMemoryJAASConfiguration:208)
2017-08-30 18:57:08,372 DEBUG - [main-SendThread(localhost:19026):] ~ <== InMemoryJAASConfiguration.getAppConfigurationEntry(Client):
{} (InMemoryJAASConfiguration:238)
2017-08-30 18:57:08,372 WARN  - [main-SendThread(localhost:19026):] ~ Session 0x15e347bc41b0000
for server null, unexpected error, closing socket connection and attempting reconnect (ClientCnxn$SendThread:1102)
java.net.ConnectException: Connection refused
	at sun.nio.ch.SocketChannelImpl.checkConnect(Native Method)
	at sun.nio.ch.SocketChannelImpl.finishConnect(SocketChannelImpl.java:744)
	at org.apache.zookeeper.ClientCnxnSocketNIO.doTransport(ClientCnxnSocketNIO.java:361)
	at org.apache.zookeeper.ClientCnxn$SendThread.run(ClientCnxn.java:1081)
2017-08-30 18:57:09,140 DEBUG - [main-SendThread(localhost:19026):] ~ ==> InMemoryJAASConfiguration.getAppConfigurationEntry(Client)
(InMemoryJAASConfiguration:208)
2017-08-30 18:57:09,141 DEBUG - [main-SendThread(localhost:19026):] ~ <== InMemoryJAASConfiguration.getAppConfigurationEntry(Client):
{} (InMemoryJAASConfiguration:238)
2017-08-30 18:57:09,141 WARN  - [main-SendThread(localhost:19026):] ~ Session 0x15e347bc41b0000
for server null, unexpected error, closing socket connection and attempting reconnect (ClientCnxn$SendThread:1102)
java.net.ConnectException: Connection refused
	at sun.nio.ch.SocketChannelImpl.checkConnect(Native Method)
	at sun.nio.ch.SocketChannelImpl.finishConnect(SocketChannelImpl.java:744)
	at org.apache.zookeeper.ClientCnxnSocketNIO.doTransport(ClientCnxnSocketNIO.java:361)
	at org.apache.zookeeper.ClientCnxn$SendThread.run(ClientCnxn.java:1081)
[ERROR] 
java.net.SocketTimeoutException: Read timed out
	at java.net.SocketInputStream.socketRead0(Native Method)
	at java.net.SocketInputStream.read(SocketInputStream.java:152)
	at java.net.SocketInputStream.read(SocketInputStream.java:122)
	at sun.nio.cs.StreamDecoder.readBytes(StreamDecoder.java:283)
	at sun.nio.cs.StreamDecoder.implRead(StreamDecoder.java:325)
	at sun.nio.cs.StreamDecoder.read(StreamDecoder.java:177)
	at java.io.InputStreamReader.read(InputStreamReader.java:184)
	at java.io.BufferedReader.fill(BufferedReader.java:154)
	at java.io.BufferedReader.readLine(BufferedReader.java:317)
	at java.io.LineNumberReader.readLine(LineNumberReader.java:199)
	at org.eclipse.jetty.maven.plugin.JettyStopMojo.execute(JettyStopMojo.java:100)
	at org.apache.maven.plugin.DefaultBuildPluginManager.executeMojo(DefaultBuildPluginManager.java:134)
	at org.apache.maven.lifecycle.internal.MojoExecutor.execute(MojoExecutor.java:208)
	at org.apache.maven.lifecycle.internal.MojoExecutor.execute(MojoExecutor.java:154)
	at org.apache.maven.lifecycle.internal.MojoExecutor.execute(MojoExecutor.java:146)
	at org.apache.maven.lifecycle.internal.LifecycleModuleBuilder.buildProject(LifecycleModuleBuilder.java:117)
	at org.apache.maven.lifecycle.internal.LifecycleModuleBuilder.buildProject(LifecycleModuleBuilder.java:81)
	at org.apache.maven.lifecycle.internal.builder.singlethreaded.SingleThreadedBuilder.build(SingleThreadedBuilder.java:51)
	at org.apache.maven.lifecycle.internal.LifecycleStarter.execute(LifecycleStarter.java:128)
	at org.apache.maven.DefaultMaven.doExecute(DefaultMaven.java:309)
	at org.apache.maven.DefaultMaven.doExecute(DefaultMaven.java:194)
	at org.apache.maven.DefaultMaven.execute(DefaultMaven.java:107)
	at org.apache.maven.cli.MavenCli.execute(MavenCli.java:993)
	at org.apache.maven.cli.MavenCli.doMain(MavenCli.java:345)
	at org.apache.maven.cli.MavenCli.main(MavenCli.java:191)
	at sun.reflect.NativeMethodAccessorImpl.invoke0(Native Method)
	at sun.reflect.NativeMethodAccessorImpl.invoke(NativeMethodAccessorImpl.java:57)
	at sun.reflect.DelegatingMethodAccessorImpl.invoke(DelegatingMethodAccessorImpl.java:43)
	at java.lang.reflect.Method.invoke(Method.java:606)
	at org.codehaus.plexus.classworlds.launcher.Launcher.launchEnhanced(Launcher.java:289)
	at org.codehaus.plexus.classworlds.launcher.Launcher.launch(Launcher.java:229)
	at org.codehaus.plexus.classworlds.launcher.Launcher.mainWithExitCode(Launcher.java:415)
	at org.codehaus.plexus.classworlds.launcher.Launcher.main(Launcher.java:356)
[INFO] 
[INFO] --- maven-source-plugin:2.4:jar-no-fork (attach-sources) @ hive-bridge ---
[INFO] Building jar: <https://builds.apache.org/job/Atlas-master-IntegrationTests/ws/addons/hive-bridge/target/hive-bridge-0.9-SNAPSHOT-sources.jar>
[INFO] 
[INFO] --- maven-source-plugin:2.4:test-jar-no-fork (attach-sources) @ hive-bridge ---
[INFO] Building jar: <https://builds.apache.org/job/Atlas-master-IntegrationTests/ws/addons/hive-bridge/target/hive-bridge-0.9-SNAPSHOT-test-sources.jar>
[INFO] 
[INFO] --- maven-failsafe-plugin:2.19.1:verify (verify) @ hive-bridge ---
[INFO] ------------------------------------------------------------------------
[INFO] Reactor Summary:
[INFO] 
[INFO] Apache Atlas Server Build Tools .................... SUCCESS [  0.867 s]
[INFO] apache-atlas ....................................... SUCCESS [  4.420 s]
[INFO] Apache Atlas Integration ........................... SUCCESS [ 29.098 s]
[INFO] Apache Atlas Common ................................ SUCCESS [ 14.537 s]
[INFO] Apache Atlas Typesystem ............................ SUCCESS [01:05 min]
[INFO] Apache Atlas Client ................................ SUCCESS [ 16.711 s]
[INFO] Apache Atlas Server API ............................ SUCCESS [  9.770 s]
[INFO] Apache Atlas Notification .......................... SUCCESS [ 15.956 s]
[INFO] Apache Atlas Graph Database Projects ............... SUCCESS [  0.579 s]
[INFO] Apache Atlas Graph Database API .................... SUCCESS [  7.484 s]
[INFO] Graph Database Common Code ......................... SUCCESS [  7.748 s]
[INFO] Apache Atlas Titan 1.0.0 GraphDB Impl .............. SUCCESS [ 38.052 s]
[INFO] Shaded version of Apache hbase client .............. SUCCESS [  9.012 s]
[INFO] Apache Atlas Titan 0.5.4 Graph DB Impl ............. SUCCESS [ 48.290 s]
[INFO] Apache Atlas Graph Database Implementation Dependencies SUCCESS [  0.706 s]
[INFO] Shaded version of Apache hbase server .............. SUCCESS [ 30.643 s]
[INFO] Apache Atlas Repository ............................ SUCCESS [01:48 min]
[INFO] Apache Atlas Authorization ......................... SUCCESS [ 12.753 s]
[INFO] Apache Atlas Business Catalog ...................... SUCCESS [ 16.855 s]
[INFO] Apache Atlas UI .................................... SUCCESS [01:40 min]
[INFO] Apache Atlas Web Application ....................... SUCCESS [05:36 min]
[INFO] Apache Atlas Documentation ......................... SUCCESS [  8.954 s]
[INFO] Apache Atlas FileSystem Model ...................... SUCCESS [  2.539 s]
[INFO] Apache Atlas Plugin Classloader .................... SUCCESS [ 10.841 s]
[INFO] Apache Atlas Hive Bridge Shim ...................... SUCCESS [  8.144 s]
[INFO] Apache Atlas Hive Bridge ........................... FAILURE [08:44 min]
[INFO] Apache Atlas Falcon Bridge Shim .................... SKIPPED
[INFO] Apache Atlas Falcon Bridge ......................... SKIPPED
[INFO] Apache Atlas Sqoop Bridge Shim ..................... SKIPPED
[INFO] Apache Atlas Sqoop Bridge .......................... SKIPPED
[INFO] Apache Atlas Storm Bridge Shim ..................... SKIPPED
[INFO] Apache Atlas Storm Bridge .......................... SKIPPED
[INFO] Apache Atlas Distribution .......................... SKIPPED
[INFO] ------------------------------------------------------------------------
[INFO] BUILD FAILURE
[INFO] ------------------------------------------------------------------------
[INFO] Total time: 23:50 min
[INFO] Finished at: 2017-08-30T18:57:09Z
[INFO] Final Memory: 579M/2166M
[INFO] ------------------------------------------------------------------------
2017-08-30 18:57:10,885 DEBUG - [Curator-Framework-0-SendThread(localhost:19026):] ~ ==>
InMemoryJAASConfiguration.getAppConfigurationEntry(Client) (InMemoryJAASConfiguration:208)
2017-08-30 18:57:10,886 DEBUG - [Curator-Framework-0-SendThread(localhost:19026):] ~ <==
InMemoryJAASConfiguration.getAppConfigurationEntry(Client): {} (InMemoryJAASConfiguration:238)
[ERROR] Failed to execute goal org.apache.maven.plugins:maven-failsafe-plugin:2.19.1:verify
(verify) on project hive-bridge: There are test failures.
[ERROR] 
[ERROR] Please refer to <https://builds.apache.org/job/Atlas-master-IntegrationTests/ws/addons/hive-bridge/target/failsafe-reports>
for the individual test results.
[ERROR] -> [Help 1]
[ERROR] 
[ERROR] To see the full stack trace of the errors, re-run Maven with the -e switch.
[ERROR] Re-run Maven using the -X switch to enable full debug logging.
[ERROR] 
[ERROR] For more information about the errors and possible solutions, please read the following
articles:
[ERROR] [Help 1] http://cwiki.apache.org/confluence/display/MAVEN/MojoFailureException
[ERROR] 
[ERROR] After correcting the problems, you can resume the build with the command
[ERROR]   mvn <goals> -rf :hive-bridge
Build step 'Execute shell' marked build as failure
[CHECKSTYLE] Collecting checkstyle analysis files...
[CHECKSTYLE] Searching for all files in <https://builds.apache.org/job/Atlas-master-IntegrationTests/ws/>
that match the pattern **/target/checkstyle-result.xml
[CHECKSTYLE] Parsing 24 files in <https://builds.apache.org/job/Atlas-master-IntegrationTests/ws/>
[CHECKSTYLE] Successfully parsed file <https://builds.apache.org/job/Atlas-master-IntegrationTests/ws/addons/hdfs-model/target/checkstyle-result.xml>
with 0 unique warnings and 0 duplicates.
[CHECKSTYLE] Successfully parsed file <https://builds.apache.org/job/Atlas-master-IntegrationTests/ws/addons/hive-bridge-shim/target/checkstyle-result.xml>
with 15 unique warnings and 0 duplicates.
[CHECKSTYLE] Successfully parsed file <https://builds.apache.org/job/Atlas-master-IntegrationTests/ws/authorization/target/checkstyle-result.xml>
with 482 unique warnings and 0 duplicates.
[CHECKSTYLE] Successfully parsed file <https://builds.apache.org/job/Atlas-master-IntegrationTests/ws/catalog/target/checkstyle-result.xml>
with 2619 unique warnings and 0 duplicates.
[CHECKSTYLE] Successfully parsed file <https://builds.apache.org/job/Atlas-master-IntegrationTests/ws/client/target/checkstyle-result.xml>
with 4256 unique warnings and 0 duplicates.
[CHECKSTYLE] Successfully parsed file <https://builds.apache.org/job/Atlas-master-IntegrationTests/ws/common/target/checkstyle-result.xml>
with 5468 unique warnings and 0 duplicates.
[CHECKSTYLE] Successfully parsed file <https://builds.apache.org/job/Atlas-master-IntegrationTests/ws/dashboardv2/target/checkstyle-result.xml>
with 5468 unique warnings and 0 duplicates.
[CHECKSTYLE] Successfully parsed file <https://builds.apache.org/job/Atlas-master-IntegrationTests/ws/docs/target/checkstyle-result.xml>
with 5468 unique warnings and 0 duplicates.
[CHECKSTYLE] Successfully parsed file <https://builds.apache.org/job/Atlas-master-IntegrationTests/ws/graphdb/api/target/checkstyle-result.xml>
with 5737 unique warnings and 0 duplicates.
[CHECKSTYLE] Successfully parsed file <https://builds.apache.org/job/Atlas-master-IntegrationTests/ws/graphdb/common/target/checkstyle-result.xml>
with 5924 unique warnings and 0 duplicates.
[CHECKSTYLE] Successfully parsed file <https://builds.apache.org/job/Atlas-master-IntegrationTests/ws/graphdb/graphdb-impls/target/checkstyle-result.xml>
with 5924 unique warnings and 0 duplicates.
[CHECKSTYLE] Successfully parsed file <https://builds.apache.org/job/Atlas-master-IntegrationTests/ws/graphdb/target/checkstyle-result.xml>
with 5924 unique warnings and 0 duplicates.
[CHECKSTYLE] Successfully parsed file <https://builds.apache.org/job/Atlas-master-IntegrationTests/ws/graphdb/titan0/target/checkstyle-result.xml>
with 8198 unique warnings and 0 duplicates.
[CHECKSTYLE] Successfully parsed file <https://builds.apache.org/job/Atlas-master-IntegrationTests/ws/graphdb/titan1/target/checkstyle-result.xml>
with 9146 unique warnings and 0 duplicates.
[CHECKSTYLE] Successfully parsed file <https://builds.apache.org/job/Atlas-master-IntegrationTests/ws/intg/target/checkstyle-result.xml>
with 16711 unique warnings and 0 duplicates.
[CHECKSTYLE] Successfully parsed file <https://builds.apache.org/job/Atlas-master-IntegrationTests/ws/notification/target/checkstyle-result.xml>
with 17921 unique warnings and 0 duplicates.
[CHECKSTYLE] Successfully parsed file <https://builds.apache.org/job/Atlas-master-IntegrationTests/ws/plugin-classloader/target/checkstyle-result.xml>
with 18029 unique warnings and 0 duplicates.
[CHECKSTYLE] Successfully parsed file <https://builds.apache.org/job/Atlas-master-IntegrationTests/ws/repository/target/checkstyle-result.xml>
with 37546 unique warnings and 0 duplicates.
[CHECKSTYLE] Successfully parsed file <https://builds.apache.org/job/Atlas-master-IntegrationTests/ws/server-api/target/checkstyle-result.xml>
with 37925 unique warnings and 0 duplicates.
[CHECKSTYLE] Successfully parsed file <https://builds.apache.org/job/Atlas-master-IntegrationTests/ws/shaded/hbase-client-shaded/target/checkstyle-result.xml>
with 37925 unique warnings and 0 duplicates.
[CHECKSTYLE] Successfully parsed file <https://builds.apache.org/job/Atlas-master-IntegrationTests/ws/shaded/hbase-server-shaded/target/checkstyle-result.xml>
with 37925 unique warnings and 0 duplicates.
[CHECKSTYLE] Successfully parsed file <https://builds.apache.org/job/Atlas-master-IntegrationTests/ws/target/checkstyle-result.xml>
with 37925 unique warnings and 0 duplicates.
[CHECKSTYLE] Successfully parsed file <https://builds.apache.org/job/Atlas-master-IntegrationTests/ws/typesystem/target/checkstyle-result.xml>
with 42143 unique warnings and 0 duplicates.
[CHECKSTYLE] Successfully parsed file <https://builds.apache.org/job/Atlas-master-IntegrationTests/ws/webapp/target/checkstyle-result.xml>
with 50242 unique warnings and 0 duplicates.
<Git Blamer> Using GitBlamer to create author and commit information for all warnings.
<Git Blamer> GIT_COMMIT=58794583a1977a684ed5f5567d7376806b262090, workspace=<https://builds.apache.org/job/Atlas-master-IntegrationTests/ws/>
 > git rev-parse 58794583a1977a684ed5f5567d7376806b262090^{commit} # timeout=10
[FINDBUGS] Collecting findbugs analysis files...
[FINDBUGS] Searching for all files in <https://builds.apache.org/job/Atlas-master-IntegrationTests/ws/>
that match the pattern **/target/findbugs.xml
[FINDBUGS] Parsing 15 files in <https://builds.apache.org/job/Atlas-master-IntegrationTests/ws/>
[FINDBUGS] Successfully parsed file <https://builds.apache.org/job/Atlas-master-IntegrationTests/ws/addons/hive-bridge-shim/target/findbugs.xml>
with 0 unique warnings and 0 duplicates.
[FINDBUGS] Successfully parsed file <https://builds.apache.org/job/Atlas-master-IntegrationTests/ws/authorization/target/findbugs.xml>
with 0 unique warnings and 0 duplicates.
[FINDBUGS] Successfully parsed file <https://builds.apache.org/job/Atlas-master-IntegrationTests/ws/catalog/target/findbugs.xml>
with 0 unique warnings and 0 duplicates.
[FINDBUGS] Successfully parsed file <https://builds.apache.org/job/Atlas-master-IntegrationTests/ws/client/target/findbugs.xml>
with 0 unique warnings and 0 duplicates.
[FINDBUGS] Successfully parsed file <https://builds.apache.org/job/Atlas-master-IntegrationTests/ws/common/target/findbugs.xml>
with 0 unique warnings and 0 duplicates.
[FINDBUGS] Successfully parsed file <https://builds.apache.org/job/Atlas-master-IntegrationTests/ws/graphdb/api/target/findbugs.xml>
with 0 unique warnings and 0 duplicates.
[FINDBUGS] Successfully parsed file <https://builds.apache.org/job/Atlas-master-IntegrationTests/ws/graphdb/common/target/findbugs.xml>
with 0 unique warnings and 0 duplicates.
[FINDBUGS] Successfully parsed file <https://builds.apache.org/job/Atlas-master-IntegrationTests/ws/graphdb/titan0/target/findbugs.xml>
with 0 unique warnings and 0 duplicates.
[FINDBUGS] Successfully parsed file <https://builds.apache.org/job/Atlas-master-IntegrationTests/ws/intg/target/findbugs.xml>
with 0 unique warnings and 0 duplicates.
[FINDBUGS] Successfully parsed file <https://builds.apache.org/job/Atlas-master-IntegrationTests/ws/notification/target/findbugs.xml>
with 0 unique warnings and 0 duplicates.
[FINDBUGS] Successfully parsed file <https://builds.apache.org/job/Atlas-master-IntegrationTests/ws/plugin-classloader/target/findbugs.xml>
with 0 unique warnings and 0 duplicates.
[FINDBUGS] Successfully parsed file <https://builds.apache.org/job/Atlas-master-IntegrationTests/ws/repository/target/findbugs.xml>
with 0 unique warnings and 0 duplicates.
[FINDBUGS] Successfully parsed file <https://builds.apache.org/job/Atlas-master-IntegrationTests/ws/server-api/target/findbugs.xml>
with 0 unique warnings and 0 duplicates.
[FINDBUGS] Successfully parsed file <https://builds.apache.org/job/Atlas-master-IntegrationTests/ws/typesystem/target/findbugs.xml>
with 0 unique warnings and 0 duplicates.
[FINDBUGS] Successfully parsed file <https://builds.apache.org/job/Atlas-master-IntegrationTests/ws/webapp/target/findbugs.xml>
with 0 unique warnings and 0 duplicates.
<Git Blamer> Using GitBlamer to create author and commit information for all warnings.
<Git Blamer> GIT_COMMIT=58794583a1977a684ed5f5567d7376806b262090, workspace=<https://builds.apache.org/job/Atlas-master-IntegrationTests/ws/>
Archiving artifacts
[Fast Archiver] No prior successful build to compare, so performing full copy of artifacts
TestNG Reports Processing: START
Looking for TestNG results report in workspace using pattern: **/target/surefire-reports/testng-results.xml,**/target/failsafe-reports/testng-results.xml
Saving reports...
Processing '/x1/jenkins/jenkins-home/jobs/Atlas-master-IntegrationTests/builds/51/testng/testng-results-1.xml'
Processing '/x1/jenkins/jenkins-home/jobs/Atlas-master-IntegrationTests/builds/51/testng/testng-results.xml'
21.348314% of tests failed, which exceeded threshold of 0%. Marking build as UNSTABLE
TestNG Reports Processing: FINISH

Mime
View raw message