atlas-dev mailing list archives

Site index · List index
Message view « Date » · « Thread »
Top « Date » · « Thread »
From Apache Jenkins Server <jenk...@builds.apache.org>
Subject Build failed in Jenkins: Atlas-master-IntegrationTests #54
Date Thu, 31 Aug 2017 06:01:23 GMT
See <https://builds.apache.org/job/Atlas-master-IntegrationTests/54/display/redirect?page=changes>

Changes:

[amestry] ATLAS-2047: Exception Thrown by Kafka Consumer Ends up Filling Logs Due

------------------------------------------
[...truncated 37.08 MB...]
2017-08-31 05:56:29,467 DEBUG - [NotificationHookConsumer thread-0:] ~ Reading property Asset.name
from vertex[id=2626560 type=hive_process guid=34585edb-80f9-4702-971d-de666725e7b7] (GraphHelper:505)
2017-08-31 05:56:29,467 DEBUG - [NotificationHookConsumer thread-0:] ~ Mapping attributeInfo
description (GraphToTypedInstanceMapper:144)
2017-08-31 05:56:29,467 DEBUG - [NotificationHookConsumer thread-0:] ~ Adding primitive {name=description,
dataType={name=string, description=null}, multiplicity={lower=0, upper=1, isUnique=false},
isComposite=false, isUnique=false, isIndexable=false, reverseAttributeName=null} from vertex
Titan0Vertex [id=2626560] (GraphToTypedInstanceMapper:387)
2017-08-31 05:56:29,468 DEBUG - [NotificationHookConsumer thread-0:] ~ Reading property Asset.description
from vertex[id=2626560 type=hive_process guid=34585edb-80f9-4702-971d-de666725e7b7] (GraphHelper:505)
2017-08-31 05:56:29,469 DEBUG - [NotificationHookConsumer thread-0:] ~ Mapping attributeInfo
owner (GraphToTypedInstanceMapper:144)
2017-08-31 05:56:29,469 DEBUG - [NotificationHookConsumer thread-0:] ~ Adding primitive {name=owner,
dataType={name=string, description=null}, multiplicity={lower=0, upper=1, isUnique=false},
isComposite=false, isUnique=false, isIndexable=true, reverseAttributeName=null} from vertex
Titan0Vertex [id=2626560] (GraphToTypedInstanceMapper:387)
2017-08-31 05:56:29,471 DEBUG - [NotificationHookConsumer thread-0:] ~ Reading property Asset.owner
from vertex[id=2626560 type=hive_process guid=34585edb-80f9-4702-971d-de666725e7b7] (GraphHelper:505)
2017-08-31 05:56:29,483 DEBUG - [NotificationHookConsumer thread-0:] ~ Sending message for
topic ATLAS_ENTITIES: {"version":{"version":"1.0.0"},"message":{"entity":{"jsonClass":"org.apache.atlas.typesystem.json.InstanceSerialization$_Reference","id":{"jsonClass":"org.apache.atlas.typesystem.json.InstanceSerialization$_Id","id":"34585edb-80f9-4702-971d-de666725e7b7","version":0,"typeName":"hive_process","state":"ACTIVE"},"typeName":"hive_process","values":{"queryId":"jenkins_20170831055433_372fd6c3-4794-4607-b363-fe1dac4ad6b5","name":"create
 external table tablestaqsquhel(id int, name string) comment \u0027table comment\u0027  partitioned
by(dt string) location \u0027pfile:///home/jenkins/jenkins-slave/workspace/atlas-master-integrationtests/addons/hive-bridge/./target/sometestpath-data-x9cyzd8itx\u0027","startTime":"2017-08-31T05:54:33.667Z","queryPlan":"Not
Supported","operationType":"CREATETABLE","outputs":[{"jsonClass":"org.apache.atlas.typesystem.json.InstanceSerialization$_Id","id":"0f442384-450a-4b2f-9d7e-dd48272a2c41","version":0,"typeName":"DataSet","state":"DELETED"}],"endTime":"2017-08-31T05:54:33.854Z","recentQueries":["create
 external table tablestaqsquhel(id int, name string) comment \u0027table comment\u0027  partitioned
by(dt string) location \u0027pfile:///home/jenkins/jenkins-slave/workspace/atlas-master-integrationtests/addons/hive-bridge/./target/sometestpath-data-x9cyzd8itx\u0027"],"inputs":[{"jsonClass":"org.apache.atlas.typesystem.json.InstanceSerialization$_Id","id":"56edb168-97d2-4d92-91d9-21e062976f01","version":0,"typeName":"DataSet","state":"ACTIVE"}],"qualifiedName":"default.tablestaqsquhel@primary:1504158873000","queryText":"create
 external table tablestaqsquhel(id int, name string) comment \u0027table comment\u0027  partitioned
by(dt string) location \u0027pfile:///home/jenkins/jenkins-slave/workspace/atlas-master-integrationtests/addons/hive-bridge/./target/sometestpath-data-x9cyzd8itx\u0027","clusterName":"primary","userName":"jenkins"},"traitNames":[],"traits":{},"systemAttributes":{}},"operationType":"ENTITY_UPDATE","traits":[]}}
(KafkaNotification:218)
2017-08-31 05:56:30,913 INFO  - [ShutdownMonitor:] ~ Stopping service org.apache.atlas.notification.NotificationHookConsumer
(Services:65)
2017-08-31 05:56:30,913 INFO  - [ShutdownMonitor:] ~ ==> stopConsumerThreads() (NotificationHookConsumer:183)
2017-08-31 05:56:30,914 INFO  - [ShutdownMonitor:] ~ ==> HookConsumer shutdown() (NotificationHookConsumer$HookConsumer:487)
2017-08-31 05:56:30,914 INFO  - [ShutdownMonitor:] ~ [atlas-hook-consumer-thread], Shutting
down (Logging$class:68)
2017-08-31 05:56:31,292 DEBUG - [main-SendThread(localhost:19026):] ~ ==> InMemoryJAASConfiguration.getAppConfigurationEntry(Client)
(InMemoryJAASConfiguration:208)
2017-08-31 05:56:31,293 DEBUG - [main-SendThread(localhost:19026):] ~ <== InMemoryJAASConfiguration.getAppConfigurationEntry(Client):
{} (InMemoryJAASConfiguration:238)
2017-08-31 05:56:31,294 WARN  - [main-SendThread(localhost:19026):] ~ Session 0x15e36d7929d0002
for server null, unexpected error, closing socket connection and attempting reconnect (ClientCnxn$SendThread:1102)
java.net.ConnectException: Connection refused
	at sun.nio.ch.SocketChannelImpl.checkConnect(Native Method)
	at sun.nio.ch.SocketChannelImpl.finishConnect(SocketChannelImpl.java:744)
	at org.apache.zookeeper.ClientCnxnSocketNIO.doTransport(ClientCnxnSocketNIO.java:361)
	at org.apache.zookeeper.ClientCnxn$SendThread.run(ClientCnxn.java:1081)
2017-08-31 05:56:31,799 DEBUG - [Curator-Framework-0-SendThread(localhost:19026):] ~ ==>
InMemoryJAASConfiguration.getAppConfigurationEntry(Client) (InMemoryJAASConfiguration:208)
2017-08-31 05:56:31,800 DEBUG - [Curator-Framework-0-SendThread(localhost:19026):] ~ <==
InMemoryJAASConfiguration.getAppConfigurationEntry(Client): {} (InMemoryJAASConfiguration:238)
2017-08-31 05:56:33,098 DEBUG - [main-SendThread(localhost:19026):] ~ ==> InMemoryJAASConfiguration.getAppConfigurationEntry(Client)
(InMemoryJAASConfiguration:208)
2017-08-31 05:56:33,099 DEBUG - [main-SendThread(localhost:19026):] ~ <== InMemoryJAASConfiguration.getAppConfigurationEntry(Client):
{} (InMemoryJAASConfiguration:238)
2017-08-31 05:56:33,100 WARN  - [main-SendThread(localhost:19026):] ~ Session 0x15e36d7929d0002
for server null, unexpected error, closing socket connection and attempting reconnect (ClientCnxn$SendThread:1102)
java.net.ConnectException: Connection refused
	at sun.nio.ch.SocketChannelImpl.checkConnect(Native Method)
	at sun.nio.ch.SocketChannelImpl.finishConnect(SocketChannelImpl.java:744)
	at org.apache.zookeeper.ClientCnxnSocketNIO.doTransport(ClientCnxnSocketNIO.java:361)
	at org.apache.zookeeper.ClientCnxn$SendThread.run(ClientCnxn.java:1081)
2017-08-31 05:56:33,650 DEBUG - [Curator-Framework-0-SendThread(localhost:19026):] ~ ==>
InMemoryJAASConfiguration.getAppConfigurationEntry(Client) (InMemoryJAASConfiguration:208)
2017-08-31 05:56:33,651 DEBUG - [Curator-Framework-0-SendThread(localhost:19026):] ~ <==
InMemoryJAASConfiguration.getAppConfigurationEntry(Client): {} (InMemoryJAASConfiguration:238)
2017-08-31 05:56:33,983 DEBUG - [main-SendThread(localhost:19026):] ~ ==> InMemoryJAASConfiguration.getAppConfigurationEntry(Client)
(InMemoryJAASConfiguration:208)
2017-08-31 05:56:33,983 DEBUG - [main-SendThread(localhost:19026):] ~ <== InMemoryJAASConfiguration.getAppConfigurationEntry(Client):
{} (InMemoryJAASConfiguration:238)
2017-08-31 05:56:33,984 WARN  - [main-SendThread(localhost:19026):] ~ Session 0x15e36d7929d0002
for server null, unexpected error, closing socket connection and attempting reconnect (ClientCnxn$SendThread:1102)
java.net.ConnectException: Connection refused
	at sun.nio.ch.SocketChannelImpl.checkConnect(Native Method)
	at sun.nio.ch.SocketChannelImpl.finishConnect(SocketChannelImpl.java:744)
	at org.apache.zookeeper.ClientCnxnSocketNIO.doTransport(ClientCnxnSocketNIO.java:361)
	at org.apache.zookeeper.ClientCnxn$SendThread.run(ClientCnxn.java:1081)
2017-08-31 05:56:34,383 DEBUG - [Curator-Framework-0-SendThread(localhost:19026):] ~ ==>
InMemoryJAASConfiguration.getAppConfigurationEntry(Client) (InMemoryJAASConfiguration:208)
2017-08-31 05:56:34,384 DEBUG - [Curator-Framework-0-SendThread(localhost:19026):] ~ <==
InMemoryJAASConfiguration.getAppConfigurationEntry(Client): {} (InMemoryJAASConfiguration:238)
2017-08-31 05:56:35,445 DEBUG - [main-SendThread(localhost:19026):] ~ ==> InMemoryJAASConfiguration.getAppConfigurationEntry(Client)
(InMemoryJAASConfiguration:208)
2017-08-31 05:56:35,445 DEBUG - [main-SendThread(localhost:19026):] ~ <== InMemoryJAASConfiguration.getAppConfigurationEntry(Client):
{} (InMemoryJAASConfiguration:238)
2017-08-31 05:56:35,446 WARN  - [main-SendThread(localhost:19026):] ~ Session 0x15e36d7929d0002
for server null, unexpected error, closing socket connection and attempting reconnect (ClientCnxn$SendThread:1102)
java.net.ConnectException: Connection refused
	at sun.nio.ch.SocketChannelImpl.checkConnect(Native Method)
	at sun.nio.ch.SocketChannelImpl.finishConnect(SocketChannelImpl.java:744)
	at org.apache.zookeeper.ClientCnxnSocketNIO.doTransport(ClientCnxnSocketNIO.java:361)
	at org.apache.zookeeper.ClientCnxn$SendThread.run(ClientCnxn.java:1081)
2017-08-31 05:56:35,854 DEBUG - [Curator-Framework-0-SendThread(localhost:19026):] ~ ==>
InMemoryJAASConfiguration.getAppConfigurationEntry(Client) (InMemoryJAASConfiguration:208)
2017-08-31 05:56:35,855 DEBUG - [Curator-Framework-0-SendThread(localhost:19026):] ~ <==
InMemoryJAASConfiguration.getAppConfigurationEntry(Client): {} (InMemoryJAASConfiguration:238)
2017-08-31 05:56:35,908 DEBUG - [main-SendThread(localhost:19026):] ~ ==> InMemoryJAASConfiguration.getAppConfigurationEntry(Client)
(InMemoryJAASConfiguration:208)
2017-08-31 05:56:35,908 DEBUG - [main-SendThread(localhost:19026):] ~ <== InMemoryJAASConfiguration.getAppConfigurationEntry(Client):
{} (InMemoryJAASConfiguration:238)
2017-08-31 05:56:35,909 WARN  - [main-SendThread(localhost:19026):] ~ Session 0x15e36d7929d0002
for server null, unexpected error, closing socket connection and attempting reconnect (ClientCnxn$SendThread:1102)
java.net.ConnectException: Connection refused
	at sun.nio.ch.SocketChannelImpl.checkConnect(Native Method)
	at sun.nio.ch.SocketChannelImpl.finishConnect(SocketChannelImpl.java:744)
	at org.apache.zookeeper.ClientCnxnSocketNIO.doTransport(ClientCnxnSocketNIO.java:361)
	at org.apache.zookeeper.ClientCnxn$SendThread.run(ClientCnxn.java:1081)
2017-08-31 05:56:36,131 DEBUG - [Curator-Framework-0-SendThread(localhost:19026):] ~ ==>
InMemoryJAASConfiguration.getAppConfigurationEntry(Client) (InMemoryJAASConfiguration:208)
2017-08-31 05:56:36,132 DEBUG - [Curator-Framework-0-SendThread(localhost:19026):] ~ <==
InMemoryJAASConfiguration.getAppConfigurationEntry(Client): {} (InMemoryJAASConfiguration:238)
2017-08-31 05:56:37,773 DEBUG - [main-SendThread(localhost:19026):] ~ ==> InMemoryJAASConfiguration.getAppConfigurationEntry(Client)
(InMemoryJAASConfiguration:208)
2017-08-31 05:56:37,774 DEBUG - [main-SendThread(localhost:19026):] ~ <== InMemoryJAASConfiguration.getAppConfigurationEntry(Client):
{} (InMemoryJAASConfiguration:238)
2017-08-31 05:56:37,775 WARN  - [main-SendThread(localhost:19026):] ~ Session 0x15e36d7929d0002
for server null, unexpected error, closing socket connection and attempting reconnect (ClientCnxn$SendThread:1102)
java.net.ConnectException: Connection refused
	at sun.nio.ch.SocketChannelImpl.checkConnect(Native Method)
	at sun.nio.ch.SocketChannelImpl.finishConnect(SocketChannelImpl.java:744)
	at org.apache.zookeeper.ClientCnxnSocketNIO.doTransport(ClientCnxnSocketNIO.java:361)
	at org.apache.zookeeper.ClientCnxn$SendThread.run(ClientCnxn.java:1081)
2017-08-31 05:56:38,014 DEBUG - [Curator-Framework-0-SendThread(localhost:19026):] ~ ==>
InMemoryJAASConfiguration.getAppConfigurationEntry(Client) (InMemoryJAASConfiguration:208)
2017-08-31 05:56:38,015 DEBUG - [Curator-Framework-0-SendThread(localhost:19026):] ~ <==
InMemoryJAASConfiguration.getAppConfigurationEntry(Client): {} (InMemoryJAASConfiguration:238)
2017-08-31 05:56:38,091 DEBUG - [main-SendThread(localhost:19026):] ~ ==> InMemoryJAASConfiguration.getAppConfigurationEntry(Client)
(InMemoryJAASConfiguration:208)
2017-08-31 05:56:38,092 DEBUG - [main-SendThread(localhost:19026):] ~ <== InMemoryJAASConfiguration.getAppConfigurationEntry(Client):
{} (InMemoryJAASConfiguration:238)
2017-08-31 05:56:38,092 WARN  - [main-SendThread(localhost:19026):] ~ Session 0x15e36d7929d0002
for server null, unexpected error, closing socket connection and attempting reconnect (ClientCnxn$SendThread:1102)
java.net.ConnectException: Connection refused
	at sun.nio.ch.SocketChannelImpl.checkConnect(Native Method)
	at sun.nio.ch.SocketChannelImpl.finishConnect(SocketChannelImpl.java:744)
	at org.apache.zookeeper.ClientCnxnSocketNIO.doTransport(ClientCnxnSocketNIO.java:361)
	at org.apache.zookeeper.ClientCnxn$SendThread.run(ClientCnxn.java:1081)
[ERROR] 
java.net.SocketTimeoutException: Read timed out
	at java.net.SocketInputStream.socketRead0(Native Method)
	at java.net.SocketInputStream.read(SocketInputStream.java:152)
	at java.net.SocketInputStream.read(SocketInputStream.java:122)
	at sun.nio.cs.StreamDecoder.readBytes(StreamDecoder.java:283)
	at sun.nio.cs.StreamDecoder.implRead(StreamDecoder.java:325)
	at sun.nio.cs.StreamDecoder.read(StreamDecoder.java:177)
	at java.io.InputStreamReader.read(InputStreamReader.java:184)
	at java.io.BufferedReader.fill(BufferedReader.java:154)
	at java.io.BufferedReader.readLine(BufferedReader.java:317)
	at java.io.LineNumberReader.readLine(LineNumberReader.java:199)
	at org.eclipse.jetty.maven.plugin.JettyStopMojo.execute(JettyStopMojo.java:100)
	at org.apache.maven.plugin.DefaultBuildPluginManager.executeMojo(DefaultBuildPluginManager.java:134)
	at org.apache.maven.lifecycle.internal.MojoExecutor.execute(MojoExecutor.java:208)
	at org.apache.maven.lifecycle.internal.MojoExecutor.execute(MojoExecutor.java:154)
	at org.apache.maven.lifecycle.internal.MojoExecutor.execute(MojoExecutor.java:146)
	at org.apache.maven.lifecycle.internal.LifecycleModuleBuilder.buildProject(LifecycleModuleBuilder.java:117)
	at org.apache.maven.lifecycle.internal.LifecycleModuleBuilder.buildProject(LifecycleModuleBuilder.java:81)
	at org.apache.maven.lifecycle.internal.builder.singlethreaded.SingleThreadedBuilder.build(SingleThreadedBuilder.java:51)
	at org.apache.maven.lifecycle.internal.LifecycleStarter.execute(LifecycleStarter.java:128)
	at org.apache.maven.DefaultMaven.doExecute(DefaultMaven.java:309)
	at org.apache.maven.DefaultMaven.doExecute(DefaultMaven.java:194)
	at org.apache.maven.DefaultMaven.execute(DefaultMaven.java:107)
	at org.apache.maven.cli.MavenCli.execute(MavenCli.java:993)
	at org.apache.maven.cli.MavenCli.doMain(MavenCli.java:345)
	at org.apache.maven.cli.MavenCli.main(MavenCli.java:191)
	at sun.reflect.NativeMethodAccessorImpl.invoke0(Native Method)
	at sun.reflect.NativeMethodAccessorImpl.invoke(NativeMethodAccessorImpl.java:57)
	at sun.reflect.DelegatingMethodAccessorImpl.invoke(DelegatingMethodAccessorImpl.java:43)
	at java.lang.reflect.Method.invoke(Method.java:606)
	at org.codehaus.plexus.classworlds.launcher.Launcher.launchEnhanced(Launcher.java:289)
	at org.codehaus.plexus.classworlds.launcher.Launcher.launch(Launcher.java:229)
	at org.codehaus.plexus.classworlds.launcher.Launcher.mainWithExitCode(Launcher.java:415)
	at org.codehaus.plexus.classworlds.launcher.Launcher.main(Launcher.java:356)
[INFO] 
[INFO] --- maven-source-plugin:2.4:jar-no-fork (attach-sources) @ hive-bridge ---
[INFO] Building jar: <https://builds.apache.org/job/Atlas-master-IntegrationTests/ws/addons/hive-bridge/target/hive-bridge-0.9-SNAPSHOT-sources.jar>
[INFO] 
[INFO] --- maven-source-plugin:2.4:test-jar-no-fork (attach-sources) @ hive-bridge ---
[INFO] Building jar: <https://builds.apache.org/job/Atlas-master-IntegrationTests/ws/addons/hive-bridge/target/hive-bridge-0.9-SNAPSHOT-test-sources.jar>
[INFO] 
[INFO] --- maven-failsafe-plugin:2.19.1:verify (verify) @ hive-bridge ---
[INFO] ------------------------------------------------------------------------
[INFO] Reactor Summary:
[INFO] 
[INFO] Apache Atlas Server Build Tools .................... SUCCESS [  0.965 s]
[INFO] apache-atlas ....................................... SUCCESS [  4.911 s]
[INFO] Apache Atlas Integration ........................... SUCCESS [ 29.851 s]
[INFO] Apache Atlas Common ................................ SUCCESS [ 14.254 s]
[INFO] Apache Atlas Typesystem ............................ SUCCESS [01:04 min]
[INFO] Apache Atlas Client ................................ SUCCESS [ 16.125 s]
[INFO] Apache Atlas Server API ............................ SUCCESS [  9.528 s]
[INFO] Apache Atlas Notification .......................... SUCCESS [ 15.166 s]
[INFO] Apache Atlas Graph Database Projects ............... SUCCESS [  0.611 s]
[INFO] Apache Atlas Graph Database API .................... SUCCESS [  7.288 s]
[INFO] Graph Database Common Code ......................... SUCCESS [  7.797 s]
[INFO] Apache Atlas Titan 1.0.0 GraphDB Impl .............. SUCCESS [ 32.502 s]
[INFO] Shaded version of Apache hbase client .............. SUCCESS [  8.417 s]
[INFO] Apache Atlas Titan 0.5.4 Graph DB Impl ............. SUCCESS [ 43.328 s]
[INFO] Apache Atlas Graph Database Implementation Dependencies SUCCESS [  0.670 s]
[INFO] Shaded version of Apache hbase server .............. SUCCESS [ 24.062 s]
[INFO] Apache Atlas Repository ............................ SUCCESS [01:51 min]
[INFO] Apache Atlas Authorization ......................... SUCCESS [ 11.343 s]
[INFO] Apache Atlas Business Catalog ...................... SUCCESS [ 15.980 s]
[INFO] Apache Atlas UI .................................... SUCCESS [01:38 min]
[INFO] Apache Atlas Web Application ....................... SUCCESS [05:21 min]
[INFO] Apache Atlas Documentation ......................... SUCCESS [ 21.069 s]
[INFO] Apache Atlas FileSystem Model ...................... SUCCESS [  2.443 s]
[INFO] Apache Atlas Plugin Classloader .................... SUCCESS [ 10.089 s]
[INFO] Apache Atlas Hive Bridge Shim ...................... SUCCESS [  7.964 s]
[INFO] Apache Atlas Hive Bridge ........................... FAILURE [08:36 min]
[INFO] Apache Atlas Falcon Bridge Shim .................... SKIPPED
[INFO] Apache Atlas Falcon Bridge ......................... SKIPPED
[INFO] Apache Atlas Sqoop Bridge Shim ..................... SKIPPED
[INFO] Apache Atlas Sqoop Bridge .......................... SKIPPED
[INFO] Apache Atlas Storm Bridge Shim ..................... SKIPPED
[INFO] Apache Atlas Storm Bridge .......................... SKIPPED
[INFO] Apache Atlas Distribution .......................... SKIPPED
[INFO] ------------------------------------------------------------------------
[INFO] BUILD FAILURE
[INFO] ------------------------------------------------------------------------
[INFO] Total time: 23:18 min
[INFO] Finished at: 2017-08-31T05:56:38Z
[INFO] Final Memory: 573M/2310M
[INFO] ------------------------------------------------------------------------
2017-08-31 05:56:40,296 DEBUG - [main-SendThread(localhost:19026):] ~ ==> InMemoryJAASConfiguration.getAppConfigurationEntry(Client)
(InMemoryJAASConfiguration:208)
2017-08-31 05:56:40,299 DEBUG - [Curator-Framework-0-SendThread(localhost:19026):] ~ ==>
InMemoryJAASConfiguration.getAppConfigurationEntry(Client) (InMemoryJAASConfiguration:208)
2017-08-31 05:56:40,307 DEBUG - [main-SendThread(localhost:19026):] ~ <== InMemoryJAASConfiguration.getAppConfigurationEntry(Client):
{} (InMemoryJAASConfiguration:238)
2017-08-31 05:56:40,307 DEBUG - [Curator-Framework-0-SendThread(localhost:19026):] ~ <==
InMemoryJAASConfiguration.getAppConfigurationEntry(Client): {} (InMemoryJAASConfiguration:238)
2017-08-31 05:56:40,321 WARN  - [main-SendThread(localhost:19026):] ~ Session 0x15e36d7929d0002
for server null, unexpected error, closing socket connection and attempting reconnect (ClientCnxn$SendThread:1102)
java.net.ConnectException: Connection refused
	at sun.nio.ch.SocketChannelImpl.checkConnect(Native Method)
	at sun.nio.ch.SocketChannelImpl.finishConnect(SocketChannelImpl.java:744)
	at org.apache.zookeeper.ClientCnxnSocketNIO.doTransport(ClientCnxnSocketNIO.java:361)
	at org.apache.zookeeper.ClientCnxn$SendThread.run(ClientCnxn.java:1081)
[ERROR] Failed to execute goal org.apache.maven.plugins:maven-failsafe-plugin:2.19.1:verify
(verify) on project hive-bridge: There are test failures.
[ERROR] 
[ERROR] Please refer to <https://builds.apache.org/job/Atlas-master-IntegrationTests/ws/addons/hive-bridge/target/failsafe-reports>
for the individual test results.
[ERROR] -> [Help 1]
[ERROR] 
[ERROR] To see the full stack trace of the errors, re-run Maven with the -e switch.
[ERROR] Re-run Maven using the -X switch to enable full debug logging.
[ERROR] 
[ERROR] For more information about the errors and possible solutions, please read the following
articles:
[ERROR] [Help 1] http://cwiki.apache.org/confluence/display/MAVEN/MojoFailureException
[ERROR] 
[ERROR] After correcting the problems, you can resume the build with the command
[ERROR]   mvn <goals> -rf :hive-bridge
Build step 'Execute shell' marked build as failure
[CHECKSTYLE] Collecting checkstyle analysis files...
[CHECKSTYLE] Searching for all files in <https://builds.apache.org/job/Atlas-master-IntegrationTests/ws/>
that match the pattern **/target/checkstyle-result.xml
[CHECKSTYLE] Parsing 24 files in <https://builds.apache.org/job/Atlas-master-IntegrationTests/ws/>
[CHECKSTYLE] Successfully parsed file <https://builds.apache.org/job/Atlas-master-IntegrationTests/ws/addons/hdfs-model/target/checkstyle-result.xml>
with 0 unique warnings and 0 duplicates.
[CHECKSTYLE] Successfully parsed file <https://builds.apache.org/job/Atlas-master-IntegrationTests/ws/addons/hive-bridge-shim/target/checkstyle-result.xml>
with 15 unique warnings and 0 duplicates.
[CHECKSTYLE] Successfully parsed file <https://builds.apache.org/job/Atlas-master-IntegrationTests/ws/authorization/target/checkstyle-result.xml>
with 482 unique warnings and 0 duplicates.
[CHECKSTYLE] Successfully parsed file <https://builds.apache.org/job/Atlas-master-IntegrationTests/ws/catalog/target/checkstyle-result.xml>
with 2619 unique warnings and 0 duplicates.
[CHECKSTYLE] Successfully parsed file <https://builds.apache.org/job/Atlas-master-IntegrationTests/ws/client/target/checkstyle-result.xml>
with 4256 unique warnings and 0 duplicates.
[CHECKSTYLE] Successfully parsed file <https://builds.apache.org/job/Atlas-master-IntegrationTests/ws/common/target/checkstyle-result.xml>
with 5468 unique warnings and 0 duplicates.
[CHECKSTYLE] Successfully parsed file <https://builds.apache.org/job/Atlas-master-IntegrationTests/ws/dashboardv2/target/checkstyle-result.xml>
with 5468 unique warnings and 0 duplicates.
[CHECKSTYLE] Successfully parsed file <https://builds.apache.org/job/Atlas-master-IntegrationTests/ws/docs/target/checkstyle-result.xml>
with 5468 unique warnings and 0 duplicates.
[CHECKSTYLE] Successfully parsed file <https://builds.apache.org/job/Atlas-master-IntegrationTests/ws/graphdb/api/target/checkstyle-result.xml>
with 5737 unique warnings and 0 duplicates.
[CHECKSTYLE] Successfully parsed file <https://builds.apache.org/job/Atlas-master-IntegrationTests/ws/graphdb/common/target/checkstyle-result.xml>
with 5924 unique warnings and 0 duplicates.
[CHECKSTYLE] Successfully parsed file <https://builds.apache.org/job/Atlas-master-IntegrationTests/ws/graphdb/graphdb-impls/target/checkstyle-result.xml>
with 5924 unique warnings and 0 duplicates.
[CHECKSTYLE] Successfully parsed file <https://builds.apache.org/job/Atlas-master-IntegrationTests/ws/graphdb/target/checkstyle-result.xml>
with 5924 unique warnings and 0 duplicates.
[CHECKSTYLE] Successfully parsed file <https://builds.apache.org/job/Atlas-master-IntegrationTests/ws/graphdb/titan0/target/checkstyle-result.xml>
with 8198 unique warnings and 0 duplicates.
[CHECKSTYLE] Successfully parsed file <https://builds.apache.org/job/Atlas-master-IntegrationTests/ws/graphdb/titan1/target/checkstyle-result.xml>
with 9146 unique warnings and 0 duplicates.
[CHECKSTYLE] Successfully parsed file <https://builds.apache.org/job/Atlas-master-IntegrationTests/ws/intg/target/checkstyle-result.xml>
with 16711 unique warnings and 0 duplicates.
[CHECKSTYLE] Successfully parsed file <https://builds.apache.org/job/Atlas-master-IntegrationTests/ws/notification/target/checkstyle-result.xml>
with 17921 unique warnings and 0 duplicates.
[CHECKSTYLE] Successfully parsed file <https://builds.apache.org/job/Atlas-master-IntegrationTests/ws/plugin-classloader/target/checkstyle-result.xml>
with 18029 unique warnings and 0 duplicates.
[CHECKSTYLE] Successfully parsed file <https://builds.apache.org/job/Atlas-master-IntegrationTests/ws/repository/target/checkstyle-result.xml>
with 37569 unique warnings and 0 duplicates.
[CHECKSTYLE] Successfully parsed file <https://builds.apache.org/job/Atlas-master-IntegrationTests/ws/server-api/target/checkstyle-result.xml>
with 37948 unique warnings and 0 duplicates.
[CHECKSTYLE] Successfully parsed file <https://builds.apache.org/job/Atlas-master-IntegrationTests/ws/shaded/hbase-client-shaded/target/checkstyle-result.xml>
with 37948 unique warnings and 0 duplicates.
[CHECKSTYLE] Successfully parsed file <https://builds.apache.org/job/Atlas-master-IntegrationTests/ws/shaded/hbase-server-shaded/target/checkstyle-result.xml>
with 37948 unique warnings and 0 duplicates.
[CHECKSTYLE] Successfully parsed file <https://builds.apache.org/job/Atlas-master-IntegrationTests/ws/target/checkstyle-result.xml>
with 37948 unique warnings and 0 duplicates.
[CHECKSTYLE] Successfully parsed file <https://builds.apache.org/job/Atlas-master-IntegrationTests/ws/typesystem/target/checkstyle-result.xml>
with 42166 unique warnings and 0 duplicates.
[CHECKSTYLE] Successfully parsed file <https://builds.apache.org/job/Atlas-master-IntegrationTests/ws/webapp/target/checkstyle-result.xml>
with 50344 unique warnings and 0 duplicates.
<Git Blamer> Using GitBlamer to create author and commit information for all warnings.
<Git Blamer> GIT_COMMIT=b837c0ee304174a100fc2f4507cbdd7e9a4195b9, workspace=<https://builds.apache.org/job/Atlas-master-IntegrationTests/ws/>
 > git rev-parse b837c0ee304174a100fc2f4507cbdd7e9a4195b9^{commit} # timeout=10
[FINDBUGS] Collecting findbugs analysis files...
[FINDBUGS] Searching for all files in <https://builds.apache.org/job/Atlas-master-IntegrationTests/ws/>
that match the pattern **/target/findbugs.xml
[FINDBUGS] Parsing 15 files in <https://builds.apache.org/job/Atlas-master-IntegrationTests/ws/>
[FINDBUGS] Successfully parsed file <https://builds.apache.org/job/Atlas-master-IntegrationTests/ws/addons/hive-bridge-shim/target/findbugs.xml>
with 0 unique warnings and 0 duplicates.
[FINDBUGS] Successfully parsed file <https://builds.apache.org/job/Atlas-master-IntegrationTests/ws/authorization/target/findbugs.xml>
with 0 unique warnings and 0 duplicates.
[FINDBUGS] Successfully parsed file <https://builds.apache.org/job/Atlas-master-IntegrationTests/ws/catalog/target/findbugs.xml>
with 0 unique warnings and 0 duplicates.
[FINDBUGS] Successfully parsed file <https://builds.apache.org/job/Atlas-master-IntegrationTests/ws/client/target/findbugs.xml>
with 0 unique warnings and 0 duplicates.
[FINDBUGS] Successfully parsed file <https://builds.apache.org/job/Atlas-master-IntegrationTests/ws/common/target/findbugs.xml>
with 0 unique warnings and 0 duplicates.
[FINDBUGS] Successfully parsed file <https://builds.apache.org/job/Atlas-master-IntegrationTests/ws/graphdb/api/target/findbugs.xml>
with 0 unique warnings and 0 duplicates.
[FINDBUGS] Successfully parsed file <https://builds.apache.org/job/Atlas-master-IntegrationTests/ws/graphdb/common/target/findbugs.xml>
with 0 unique warnings and 0 duplicates.
[FINDBUGS] Successfully parsed file <https://builds.apache.org/job/Atlas-master-IntegrationTests/ws/graphdb/titan0/target/findbugs.xml>
with 0 unique warnings and 0 duplicates.
[FINDBUGS] Successfully parsed file <https://builds.apache.org/job/Atlas-master-IntegrationTests/ws/intg/target/findbugs.xml>
with 0 unique warnings and 0 duplicates.
[FINDBUGS] Successfully parsed file <https://builds.apache.org/job/Atlas-master-IntegrationTests/ws/notification/target/findbugs.xml>
with 0 unique warnings and 0 duplicates.
[FINDBUGS] Successfully parsed file <https://builds.apache.org/job/Atlas-master-IntegrationTests/ws/plugin-classloader/target/findbugs.xml>
with 0 unique warnings and 0 duplicates.
[FINDBUGS] Successfully parsed file <https://builds.apache.org/job/Atlas-master-IntegrationTests/ws/repository/target/findbugs.xml>
with 0 unique warnings and 0 duplicates.
[FINDBUGS] Successfully parsed file <https://builds.apache.org/job/Atlas-master-IntegrationTests/ws/server-api/target/findbugs.xml>
with 0 unique warnings and 0 duplicates.
[FINDBUGS] Successfully parsed file <https://builds.apache.org/job/Atlas-master-IntegrationTests/ws/typesystem/target/findbugs.xml>
with 0 unique warnings and 0 duplicates.
[FINDBUGS] Successfully parsed file <https://builds.apache.org/job/Atlas-master-IntegrationTests/ws/webapp/target/findbugs.xml>
with 0 unique warnings and 0 duplicates.
<Git Blamer> Using GitBlamer to create author and commit information for all warnings.
<Git Blamer> GIT_COMMIT=b837c0ee304174a100fc2f4507cbdd7e9a4195b9, workspace=<https://builds.apache.org/job/Atlas-master-IntegrationTests/ws/>
Archiving artifacts
[Fast Archiver] No prior successful build to compare, so performing full copy of artifacts
TestNG Reports Processing: START
Looking for TestNG results report in workspace using pattern: **/target/surefire-reports/testng-results.xml,**/target/failsafe-reports/testng-results.xml
Saving reports...
Processing '/x1/jenkins/jenkins-home/jobs/Atlas-master-IntegrationTests/builds/54/testng/testng-results-1.xml'
Processing '/x1/jenkins/jenkins-home/jobs/Atlas-master-IntegrationTests/builds/54/testng/testng-results.xml'
21.348314% of tests failed, which exceeded threshold of 0%. Marking build as UNSTABLE
TestNG Reports Processing: FINISH

Mime
View raw message