atlas-dev mailing list archives

Site index · List index
Message view « Date » · « Thread »
Top « Date » · « Thread »
From Apache Jenkins Server <jenk...@builds.apache.org>
Subject Build failed in Jenkins: Atlas-0.8-IntegrationTests #17
Date Sat, 19 Aug 2017 01:00:24 GMT
See <https://builds.apache.org/job/Atlas-0.8-IntegrationTests/17/display/redirect?page=changes>

Changes:

[ssubramanian] ATLAS-2062: Add flag to disable v1 gremlin search API using

[madhan] ATLAS-2061: fixed basic-search handling of enum attributes in filter

------------------------------------------
[...truncated 652.11 KB...]
127.0.0.1 - - [19/Aug/2017:00:55:20 +0000] "GET /api/atlas/v2/types/typedef/name/b47iDno9FD
HTTP/1.1" 404 - "-" "Java/1.7.0_80"
127.0.0.1 - - [19/Aug/2017:00:55:20 +0000] "POST /api/atlas/types HTTP/1.1" 201 - "-" "Java/1.7.0_80"
127.0.0.1 - - [19/Aug/2017:00:55:20 +0000] "POST /api/atlas/entities HTTP/1.1" 201 - "-" "Java/1.7.0_80"
127.0.0.1 - - [19/Aug/2017:00:55:20 +0000] "GET /api/atlas/entities/db5eedd5-f7ac-42e1-b609-8870420b5eed
HTTP/1.1" 200 - "-" "Java/1.7.0_80"
127.0.0.1 - - [19/Aug/2017:00:55:20 +0000] "GET /api/atlas/v2/entity/guid/16c7a70b-530b-48a4-bc6e-95a209dfcfd7
HTTP/1.1" 200 - "-" "Java/1.7.0_80"
127.0.0.1 - - [19/Aug/2017:00:55:20 +0000] "POST /api/atlas/v2/entity/ HTTP/1.1" 200 - "-"
"Java/1.7.0_80"
127.0.0.1 - - [19/Aug/2017:00:55:20 +0000] "POST /api/atlas/v2/entity/guid/random/classifications
HTTP/1.1" 404 - "-" "Java/1.7.0_80"
127.0.0.1 - - [19/Aug/2017:00:55:20 +0000] "POST /api/atlas/v2/entity/bulk/ HTTP/1.1" 200
- "-" "Java/1.7.0_80"
127.0.0.1 - - [19/Aug/2017:00:55:20 +0000] "POST /api/atlas/v2/entity/ HTTP/1.1" 200 - "-"
"Java/1.7.0_80"
127.0.0.1 - - [19/Aug/2017:00:55:21 +0000] "POST /api/atlas/v2/entity/ HTTP/1.1" 200 - "-"
"Java/1.7.0_80"
127.0.0.1 - - [19/Aug/2017:00:55:21 +0000] "DELETE /api/atlas/v2/entity/bulk/?guid=608c79a4-ee27-48b1-91b2-c889ecdaaf24&guid=9fb243b1-466a-4ab7-9a67-010275da8d48
HTTP/1.1" 200 - "-" "Java/1.7.0_80"
127.0.0.1 - - [19/Aug/2017:00:55:21 +0000] "POST /api/atlas/v2/entity/ HTTP/1.1" 200 - "-"
"Java/1.7.0_80"
127.0.0.1 - - [19/Aug/2017:00:55:21 +0000] "DELETE /api/atlas/v2/entity/uniqueAttribute/type/hive_db_v2?attr:name=dbX0pqyE9dmk%E5%BA%86%E0%A4%98%E2%80%AB%E3%9C%A4%F2%AA%A0%A4%EF%81%97%E3%BB%BE%E8%A6%99%E2%BF%94
HTTP/1.1" 200 - "-" "Java/1.7.0_80"
127.0.0.1 - - [19/Aug/2017:00:55:21 +0000] "DELETE /api/atlas/v2/entity/guid/random/classification/blah_trait
HTTP/1.1" 400 - "-" "Java/1.7.0_80"
127.0.0.1 - - [19/Aug/2017:00:55:21 +0000] "GET /api/atlas/discovery/search/dsl?query=hive_db_v2+where+name%3D'dbX0pqyE9dmk'&limit=10&offset=0
HTTP/1.1" 200 - "-" "Java/1.7.0_80"
127.0.0.1 - - [19/Aug/2017:00:55:22 +0000] "GET /api/atlas/discovery/search/dsl?query=hive_db_v2+where+name%3D'dbX0pqyE9dmk'&limit=10&offset=0
HTTP/1.1" 200 - "-" "Java/1.7.0_80"
127.0.0.1 - - [19/Aug/2017:00:55:22 +0000] "POST /api/atlas/v2/entity/ HTTP/1.1" 200 - "-"
"Java/1.7.0_80"
127.0.0.1 - - [19/Aug/2017:00:55:23 +0000] "GET /api/atlas/discovery/search/dsl?query=hive_db_v2+where+name%3D'dbX0pqyE9dmk'&limit=10&offset=0
HTTP/1.1" 200 - "-" "Java/1.7.0_80"
127.0.0.1 - - [19/Aug/2017:00:55:24 +0000] "POST /api/atlas/v2/types/typedefs/ HTTP/1.1" 200
- "-" "Java/1.7.0_80"
127.0.0.1 - - [19/Aug/2017:00:55:24 +0000] "POST /api/atlas/v2/entity/ HTTP/1.1" 200 - "-"
"Java/1.7.0_80"
127.0.0.1 - - [19/Aug/2017:00:55:24 +0000] "PUT /api/atlas/v2/types/typedefs/ HTTP/1.1" 200
- "-" "Java/1.7.0_80"
127.0.0.1 - - [19/Aug/2017:00:55:24 +0000] "GET /api/atlas/v2/entity/guid/22184e8f-0f9a-4337-a982-bce76b8052d9
HTTP/1.1" 200 - "-" "Java/1.7.0_80"
127.0.0.1 - - [19/Aug/2017:00:55:24 +0000] "POST /api/atlas/v2/entity/ HTTP/1.1" 404 - "-"
"Java/1.7.0_80"
127.0.0.1 - - [19/Aug/2017:00:55:24 +0000] "POST /api/atlas/v2/entity/ HTTP/1.1" 200 - "-"
"Java/1.7.0_80"
127.0.0.1 - - [19/Aug/2017:00:55:24 +0000] "POST /api/atlas/v2/entity/ HTTP/1.1" 200 - "-"
"Java/1.7.0_80"
127.0.0.1 - - [19/Aug/2017:00:55:24 +0000] "GET /api/atlas/v2/entity/uniqueAttribute/type/hive_db_v2?attr:name=dbX0pqyE9dmk
HTTP/1.1" 200 - "-" "Java/1.7.0_80"
127.0.0.1 - - [19/Aug/2017:00:55:24 +0000] "GET /api/atlas/v2/entity/guid/blah HTTP/1.1" 404
- "-" "Java/1.7.0_80"
127.0.0.1 - - [19/Aug/2017:00:55:24 +0000] "POST /api/atlas/v2/entity/ HTTP/1.1" 200 - "-"
"Java/1.7.0_80"
127.0.0.1 - - [19/Aug/2017:00:55:24 +0000] "GET /api/atlas/entities/e07b59d7-96a5-4c24-b8e4-1df73b9f2bf9/audit?count=10
HTTP/1.1" 200 - "-" "Java/1.7.0_80"
127.0.0.1 - - [19/Aug/2017:00:55:24 +0000] "POST /api/atlas/v2/entity/ HTTP/1.1" 200 - "-"
"Java/1.7.0_80"
127.0.0.1 - - [19/Aug/2017:00:55:24 +0000] "POST /api/atlas/v2/entity/ HTTP/1.1" 200 - "-"
"Java/1.7.0_80"
127.0.0.1 - - [19/Aug/2017:00:55:24 +0000] "GET /api/atlas/v2/types/typedef/name/U016WIs1tq
HTTP/1.1" 404 - "-" "Java/1.7.0_80"
127.0.0.1 - - [19/Aug/2017:00:55:24 +0000] "POST /api/atlas/v2/types/typedefs/ HTTP/1.1" 200
- "-" "Java/1.7.0_80"
127.0.0.1 - - [19/Aug/2017:00:55:24 +0000] "POST /api/atlas/v2/entity/ HTTP/1.1" 200 - "-"
"Java/1.7.0_80"
127.0.0.1 - - [19/Aug/2017:00:55:24 +0000] "GET /api/atlas/v2/entity/guid/ca9c0ef3-eddc-493e-b78f-eb8f96aa1d69
HTTP/1.1" 200 - "-" "Java/1.7.0_80"
127.0.0.1 - - [19/Aug/2017:00:55:24 +0000] "GET /api/atlas/discovery/search/dsl?query=from+hive_db_v1+name%3D%22dbRzkHekkbpz%22
HTTP/1.1" 200 - "-" "Java/1.7.0_80"
127.0.0.1 - - [19/Aug/2017:00:55:25 +0000] "GET /api/atlas/discovery/search/dsl?query=from+blah
HTTP/1.1" 400 - "-" "Java/1.7.0_80"
127.0.0.1 - - [19/Aug/2017:00:55:25 +0000] "GET /api/atlas/discovery/search?query=* HTTP/1.1"
200 - "-" "Java/1.7.0_80"
127.0.0.1 - - [19/Aug/2017:00:55:25 +0000] "GET /api/atlas/discovery/search?query=from+hive_db_v1+name%3D%22dbRzkHekkbpz%22
HTTP/1.1" 200 - "-" "Java/1.7.0_80"
127.0.0.1 - - [19/Aug/2017:00:55:26 +0000] "GET /api/atlas/discovery/search/gremlin?query=g.V.has('type',+'hive_table_v1').toList()
HTTP/1.1" 400 - "-" "Java/1.7.0_80"
127.0.0.1 - - [19/Aug/2017:00:55:26 +0000] "POST /api/atlas/v2/types/typedefs/ HTTP/1.1" 200
- "-" "Java/1.7.0_80"
127.0.0.1 - - [19/Aug/2017:00:55:26 +0000] "POST /api/atlas/v2/types/typedefs/ HTTP/1.1" 409
- "-" "Java/1.7.0_80"
127.0.0.1 - - [19/Aug/2017:00:55:26 +0000] "GET /api/atlas/v2/types/enumdef/name/blah HTTP/1.1"
404 - "-" "Java/1.7.0_80"
127.0.0.1 - - [19/Aug/2017:00:55:26 +0000] "GET /api/atlas/v2/types/enumdef/guid/blah HTTP/1.1"
404 - "-" "Java/1.7.0_80"
127.0.0.1 - - [19/Aug/2017:00:55:26 +0000] "GET /api/atlas/v2/types/structdef/name/blah HTTP/1.1"
404 - "-" "Java/1.7.0_80"
127.0.0.1 - - [19/Aug/2017:00:55:26 +0000] "GET /api/atlas/v2/types/structdef/guid/blah HTTP/1.1"
404 - "-" "Java/1.7.0_80"
127.0.0.1 - - [19/Aug/2017:00:55:26 +0000] "GET /api/atlas/v2/types/classificationdef/name/blah
HTTP/1.1" 404 - "-" "Java/1.7.0_80"
127.0.0.1 - - [19/Aug/2017:00:55:26 +0000] "GET /api/atlas/v2/types/classificationdef/guid/blah
HTTP/1.1" 404 - "-" "Java/1.7.0_80"
127.0.0.1 - - [19/Aug/2017:00:55:26 +0000] "GET /api/atlas/v2/types/entitydef/name/blah HTTP/1.1"
404 - "-" "Java/1.7.0_80"
127.0.0.1 - - [19/Aug/2017:00:55:26 +0000] "GET /api/atlas/v2/types/entitydef/guid/blah HTTP/1.1"
404 - "-" "Java/1.7.0_80"
127.0.0.1 - - [19/Aug/2017:00:55:26 +0000] "POST /api/atlas/v2/types/typedefs/ HTTP/1.1" 200
- "-" "Java/1.7.0_80"
127.0.0.1 - - [19/Aug/2017:00:55:27 +0000] "GET /api/atlas/v2/types/typedefs/?supertype=APMek0dLcmf&type=CLASS
HTTP/1.1" 200 - "-" "Java/1.7.0_80"
127.0.0.1 - - [19/Aug/2017:00:55:27 +0000] "GET /api/atlas/v2/types/typedefs/?notsupertype=BidRue2Rl2A&supertype=APMek0dLcmf&type=CLASS
HTTP/1.1" 200 - "-" "Java/1.7.0_80"
127.0.0.1 - - [19/Aug/2017:00:55:27 +0000] "POST /api/atlas/v2/types/typedefs/ HTTP/1.1" 200
- "-" "Java/1.7.0_80"
127.0.0.1 - - [19/Aug/2017:00:55:27 +0000] "PUT /api/atlas/v2/types/typedefs/ HTTP/1.1" 200
- "-" "Java/1.7.0_80"
127.0.0.1 - - [19/Aug/2017:00:55:27 +0000] "GET /api/atlas/v2/types/typedefs/?type=ENTITY
HTTP/1.1" 200 - "-" "Java/1.7.0_80"
127.0.0.1 - - [19/Aug/2017:00:55:27 +0000] "POST /api/atlas/types HTTP/1.1" 201 - "-" "Java/1.7.0_80"
127.0.0.1 - - [19/Aug/2017:00:55:27 +0000] "POST /api/atlas/types HTTP/1.1" 409 - "-" "Java/1.7.0_80"
127.0.0.1 - - [19/Aug/2017:00:55:27 +0000] "GET /api/atlas/v2/types/typedef/name/AfZR1MjusFk
HTTP/1.1" 404 - "-" "Java/1.7.0_80"
127.0.0.1 - - [19/Aug/2017:00:55:27 +0000] "POST /api/atlas/types HTTP/1.1" 201 - "-" "Java/1.7.0_80"
127.0.0.1 - - [19/Aug/2017:00:55:27 +0000] "GET /api/atlas/v2/types/typedef/name/A1yj9JtJtDye
HTTP/1.1" 404 - "-" "Java/1.7.0_80"
127.0.0.1 - - [19/Aug/2017:00:55:27 +0000] "POST /api/atlas/types HTTP/1.1" 201 - "-" "Java/1.7.0_80"
127.0.0.1 - - [19/Aug/2017:00:55:27 +0000] "GET /api/atlas/v2/types/typedef/name/Bo9yEYIfZrv
HTTP/1.1" 404 - "-" "Java/1.7.0_80"
127.0.0.1 - - [19/Aug/2017:00:55:27 +0000] "POST /api/atlas/types HTTP/1.1" 201 - "-" "Java/1.7.0_80"
127.0.0.1 - - [19/Aug/2017:00:55:28 +0000] "GET /api/atlas/v2/types/typedef/name/CC9EdyjQUzq
HTTP/1.1" 404 - "-" "Java/1.7.0_80"
127.0.0.1 - - [19/Aug/2017:00:55:28 +0000] "POST /api/atlas/types HTTP/1.1" 201 - "-" "Java/1.7.0_80"
127.0.0.1 - - [19/Aug/2017:00:55:28 +0000] "GET /api/atlas/types?type=CLASS&supertype=AfZR1MjusFk&notsupertype=Bo9yEYIfZrv
HTTP/1.1" 200 - "-" "Java/1.7.0_80"
127.0.0.1 - - [19/Aug/2017:00:55:28 +0000] "GET /api/atlas/v2/types/typedef/name/class_trait
HTTP/1.1" 404 - "-" "Java/1.7.0_80"
127.0.0.1 - - [19/Aug/2017:00:55:28 +0000] "POST /api/atlas/types HTTP/1.1" 201 - "-" "Java/1.7.0_80"
127.0.0.1 - - [19/Aug/2017:00:55:28 +0000] "GET /api/atlas/v2/types/typedef/name/secure_trait
HTTP/1.1" 404 - "-" "Java/1.7.0_80"
127.0.0.1 - - [19/Aug/2017:00:55:28 +0000] "POST /api/atlas/types HTTP/1.1" 201 - "-" "Java/1.7.0_80"
127.0.0.1 - - [19/Aug/2017:00:55:28 +0000] "GET /api/atlas/v2/types/typedef/name/pii_trait
HTTP/1.1" 404 - "-" "Java/1.7.0_80"
127.0.0.1 - - [19/Aug/2017:00:55:28 +0000] "POST /api/atlas/types HTTP/1.1" 201 - "-" "Java/1.7.0_80"
127.0.0.1 - - [19/Aug/2017:00:55:28 +0000] "GET /api/atlas/v2/types/typedef/name/ssn_trait
HTTP/1.1" 404 - "-" "Java/1.7.0_80"
127.0.0.1 - - [19/Aug/2017:00:55:28 +0000] "POST /api/atlas/types HTTP/1.1" 201 - "-" "Java/1.7.0_80"
127.0.0.1 - - [19/Aug/2017:00:55:28 +0000] "GET /api/atlas/v2/types/typedef/name/salary_trait
HTTP/1.1" 404 - "-" "Java/1.7.0_80"
127.0.0.1 - - [19/Aug/2017:00:55:28 +0000] "POST /api/atlas/types HTTP/1.1" 201 - "-" "Java/1.7.0_80"
127.0.0.1 - - [19/Aug/2017:00:55:28 +0000] "GET /api/atlas/v2/types/typedef/name/sox_trait
HTTP/1.1" 404 - "-" "Java/1.7.0_80"
127.0.0.1 - - [19/Aug/2017:00:55:28 +0000] "POST /api/atlas/types HTTP/1.1" 201 - "-" "Java/1.7.0_80"
127.0.0.1 - - [19/Aug/2017:00:55:29 +0000] "GET /api/atlas/types?type=TRAIT HTTP/1.1" 200
- "-" "Java/1.7.0_80"
127.0.0.1 - - [19/Aug/2017:00:55:29 +0000] "POST /api/atlas/types HTTP/1.1" 201 - "-" "Java/1.7.0_80"
127.0.0.1 - - [19/Aug/2017:00:55:29 +0000] "PUT /api/atlas/types HTTP/1.1" 200 - "-" "Java/1.7.0_80"
127.0.0.1 - - [19/Aug/2017:00:55:29 +0000] "GET /api/atlas/types/sIm2kiAsNj HTTP/1.1" 200
- "-" "Java/1.7.0_80"
127.0.0.1 - - [19/Aug/2017:00:55:29 +0000] "GET /api/atlas/types/blah HTTP/1.1" 404 - "-"
"Java/1.7.0_80"
127.0.0.1 - - [19/Aug/2017:00:55:34 +0000] "POST /api/atlas/v2/types/typedefs/ HTTP/1.1" 409
- "-" "Java/1.7.0_80"
Tests run: 133, Failures: 6, Errors: 0, Skipped: 5, Time elapsed: 254.338 sec <<<
FAILURE! - in TestSuite
testDeleteByQualifiedName(org.apache.atlas.notification.NotificationHookConsumerIT)  Time
elapsed: 60.105 sec  <<< FAILURE!
java.lang.Exception: Waiting timed out after 60000 msec
	at org.apache.atlas.notification.NotificationHookConsumerIT.testDeleteByQualifiedName(NotificationHookConsumerIT.java:184)

testUpdateEntityPartial(org.apache.atlas.notification.NotificationHookConsumerIT)  Time elapsed:
60.111 sec  <<< FAILURE!
java.lang.Exception: Waiting timed out after 60000 msec
	at org.apache.atlas.notification.NotificationHookConsumerIT.testUpdateEntityPartial(NotificationHookConsumerIT.java:127)

testAddReferenceProperty(org.apache.atlas.web.integration.EntityJerseyResourceIT)  Time elapsed:
0.181 sec  <<< FAILURE!
java.lang.AssertionError: expected:<2> but was:<1>
	at org.apache.atlas.web.integration.EntityJerseyResourceIT.testAddReferenceProperty(EntityJerseyResourceIT.java:452)

testPartialUpdate(org.apache.atlas.web.integration.EntityJerseyResourceIT)  Time elapsed:
0.71 sec  <<< FAILURE!
org.apache.atlas.AtlasServiceException: Metadata service API org.apache.atlas.AtlasBaseClient$APIInfo@2a044148
failed with status 500 (Internal Server Error) Response Body ({"error":"Could not commit transaction
due to exception during persistence"})
	at org.apache.atlas.web.integration.EntityJerseyResourceIT.testPartialUpdate(EntityJerseyResourceIT.java:898)

testSearchUsingGremlin(org.apache.atlas.web.integration.MetadataDiscoveryJerseyResourceIT)
 Time elapsed: 0.006 sec  <<< FAILURE!
org.apache.atlas.AtlasServiceException: Metadata service API org.apache.atlas.AtlasBaseClient$APIInfo@10eb1b33
failed with status 400 (Bad Request) Response Body ({"error":"Gremlin search is not enabled."})
	at org.apache.atlas.web.integration.MetadataDiscoveryJerseyResourceIT.testSearchUsingGremlin(MetadataDiscoveryJerseyResourceIT.java:153)

runQuickStart(org.apache.atlas.examples.QuickStartV2IT)  Time elapsed: 5.071 sec  <<<
FAILURE!
org.apache.atlas.AtlasServiceException: Metadata service API org.apache.atlas.AtlasBaseClient$APIInfo@17c22ade
failed with status 409 (Conflict) Response Body ({"errorCode":"ATLAS-409-00-001","errorMessage":"Given
type Dimension already exists"})
	at org.apache.atlas.examples.QuickStartV2IT.runQuickStart(QuickStartV2IT.java:49)


Results :

Failed tests: 
  QuickStartV2IT.runQuickStart:49 » AtlasService Metadata service API org.apache...
  NotificationHookConsumerIT.testDeleteByQualifiedName:184->BaseResourceIT.waitFor:626
» 
  NotificationHookConsumerIT.testUpdateEntityPartial:127->BaseResourceIT.waitFor:626 »

  EntityJerseyResourceIT.testAddReferenceProperty:452 expected:<2> but was:<1>
  EntityJerseyResourceIT.testPartialUpdate:898 » AtlasService Metadata service A...
  MetadataDiscoveryJerseyResourceIT.testSearchUsingGremlin:153 » AtlasService Me...

Tests run: 133, Failures: 6, Errors: 0, Skipped: 5

[INFO] 
[INFO] --- jetty-maven-plugin:9.2.12.v20150709:stop (stop-jetty) @ atlas-webapp ---
[INFO] Waiting 10 seconds for jetty to stop
[INFO] Stopped ServerConnector@395648bc{HTTP/1.1}{0.0.0.0:31000}
[INFO] Closing Spring root WebApplicationContext
[INFO] Shutting down log4j
[INFO] Stopped o.e.j.m.p.JettyWebAppContext@10b3c3f2{/,<https://builds.apache.org/job/Atlas-0.8-IntegrationTests/ws/webapp/target/atlas-webapp-0.8.1-SNAPSHOT/,UNAVAILABLE}{/home/jenkins/jenkins-slave/workspace/Atlas-0.8-IntegrationTests/webapp/target/atlas-webapp-0.8.1-SNAPSHOT.war}>
[INFO] Server reports itself as stopped
[INFO] 
[INFO] --- maven-source-plugin:2.4:jar-no-fork (attach-sources) @ atlas-webapp ---
[INFO] Building jar: <https://builds.apache.org/job/Atlas-0.8-IntegrationTests/ws/webapp/target/atlas-webapp-0.8.1-SNAPSHOT-sources.jar>
log4j:WARN No appenders could be found for logger (org.apache.zookeeper.ClientCnxn).
log4j:WARN Please initialize the log4j system properly.
log4j:WARN See http://logging.apache.org/log4j/1.2/faq.html#noconfig for more info.
[INFO] 
[INFO] --- maven-source-plugin:2.4:test-jar-no-fork (attach-sources) @ atlas-webapp ---
[INFO] Building jar: <https://builds.apache.org/job/Atlas-0.8-IntegrationTests/ws/webapp/target/atlas-webapp-0.8.1-SNAPSHOT-test-sources.jar>
[INFO] 
[INFO] --- maven-failsafe-plugin:2.19.1:verify (verify) @ atlas-webapp ---
[INFO] ------------------------------------------------------------------------
[INFO] Reactor Summary:
[INFO] 
[INFO] Apache Atlas Server Build Tools .................... SUCCESS [  1.249 s]
[INFO] apache-atlas ....................................... SUCCESS [ 10.361 s]
[INFO] Apache Atlas Integration ........................... SUCCESS [ 37.640 s]
[INFO] Apache Atlas Common ................................ SUCCESS [ 19.313 s]
[INFO] Apache Atlas Typesystem ............................ SUCCESS [01:24 min]
[INFO] Apache Atlas Client ................................ SUCCESS [ 21.035 s]
[INFO] Apache Atlas Server API ............................ SUCCESS [ 12.009 s]
[INFO] Apache Atlas Notification .......................... SUCCESS [ 19.903 s]
[INFO] Apache Atlas Graph Database Projects ............... SUCCESS [  0.762 s]
[INFO] Apache Atlas Graph Database API .................... SUCCESS [  9.502 s]
[INFO] Graph Database Common Code ......................... SUCCESS [  8.926 s]
[INFO] Apache Atlas Titan 1.0.0 GraphDB Impl .............. SUCCESS [ 35.634 s]
[INFO] Shaded version of Apache hbase client .............. SUCCESS [ 10.157 s]
[INFO] Apache Atlas Titan 0.5.4 Graph DB Impl ............. SUCCESS [ 51.196 s]
[INFO] Apache Atlas Graph Database Implementation Dependencies SUCCESS [  0.864 s]
[INFO] Shaded version of Apache hbase server .............. SUCCESS [ 25.831 s]
[INFO] Apache Atlas Repository ............................ SUCCESS [02:22 min]
[INFO] Apache Atlas Authorization ......................... SUCCESS [ 14.816 s]
[INFO] Apache Atlas Business Catalog ...................... SUCCESS [ 20.824 s]
[INFO] Apache Atlas UI .................................... SUCCESS [01:15 min]
[INFO] Apache Atlas Web Application ....................... FAILURE [06:21 min]
[INFO] Apache Atlas Documentation ......................... SKIPPED
[INFO] Apache Atlas FileSystem Model ...................... SKIPPED
[INFO] Apache Atlas Plugin Classloader .................... SKIPPED
[INFO] Apache Atlas Hive Bridge Shim ...................... SKIPPED
[INFO] Apache Atlas Hive Bridge ........................... SKIPPED
[INFO] Apache Atlas Falcon Bridge Shim .................... SKIPPED
[INFO] Apache Atlas Falcon Bridge ......................... SKIPPED
[INFO] Apache Atlas Sqoop Bridge Shim ..................... SKIPPED
[INFO] Apache Atlas Sqoop Bridge .......................... SKIPPED
[INFO] Apache Atlas Storm Bridge Shim ..................... SKIPPED
[INFO] Apache Atlas Storm Bridge .......................... SKIPPED
[INFO] Apache Atlas Distribution .......................... SKIPPED
[INFO] ------------------------------------------------------------------------
[INFO] BUILD FAILURE
[INFO] ------------------------------------------------------------------------
[INFO] Total time: 16:26 min
[INFO] Finished at: 2017-08-19T00:55:41Z
[INFO] Final Memory: 372M/2137M
[INFO] ------------------------------------------------------------------------
[ERROR] Failed to execute goal org.apache.maven.plugins:maven-failsafe-plugin:2.19.1:verify
(verify) on project atlas-webapp: There are test failures.
[ERROR] 
[ERROR] Please refer to <https://builds.apache.org/job/Atlas-0.8-IntegrationTests/ws/webapp/target/failsafe-reports>
for the individual test results.
[ERROR] -> [Help 1]
[ERROR] 
[ERROR] To see the full stack trace of the errors, re-run Maven with the -e switch.
[ERROR] Re-run Maven using the -X switch to enable full debug logging.
[ERROR] 
[ERROR] For more information about the errors and possible solutions, please read the following
articles:
[ERROR] [Help 1] http://cwiki.apache.org/confluence/display/MAVEN/MojoFailureException
[ERROR] 
[ERROR] After correcting the problems, you can resume the build with the command
[ERROR]   mvn <goals> -rf :atlas-webapp
Build step 'Execute shell' marked build as failure
[CHECKSTYLE] Collecting checkstyle analysis files...
[CHECKSTYLE] Searching for all files in <https://builds.apache.org/job/Atlas-0.8-IntegrationTests/ws/>
that match the pattern **/target/checkstyle-result.xml
[CHECKSTYLE] Parsing 19 files in <https://builds.apache.org/job/Atlas-0.8-IntegrationTests/ws/>
[CHECKSTYLE] Successfully parsed file <https://builds.apache.org/job/Atlas-0.8-IntegrationTests/ws/authorization/target/checkstyle-result.xml>
with 467 unique warnings and 0 duplicates.
[CHECKSTYLE] Successfully parsed file <https://builds.apache.org/job/Atlas-0.8-IntegrationTests/ws/catalog/target/checkstyle-result.xml>
with 2612 unique warnings and 0 duplicates.
[CHECKSTYLE] Successfully parsed file <https://builds.apache.org/job/Atlas-0.8-IntegrationTests/ws/client/target/checkstyle-result.xml>
with 4250 unique warnings and 0 duplicates.
[CHECKSTYLE] Successfully parsed file <https://builds.apache.org/job/Atlas-0.8-IntegrationTests/ws/common/target/checkstyle-result.xml>
with 5456 unique warnings and 0 duplicates.
[CHECKSTYLE] Successfully parsed file <https://builds.apache.org/job/Atlas-0.8-IntegrationTests/ws/dashboardv2/target/checkstyle-result.xml>
with 5456 unique warnings and 0 duplicates.
[CHECKSTYLE] Successfully parsed file <https://builds.apache.org/job/Atlas-0.8-IntegrationTests/ws/graphdb/api/target/checkstyle-result.xml>
with 5725 unique warnings and 0 duplicates.
[CHECKSTYLE] Successfully parsed file <https://builds.apache.org/job/Atlas-0.8-IntegrationTests/ws/graphdb/common/target/checkstyle-result.xml>
with 5912 unique warnings and 0 duplicates.
[CHECKSTYLE] Successfully parsed file <https://builds.apache.org/job/Atlas-0.8-IntegrationTests/ws/graphdb/graphdb-impls/target/checkstyle-result.xml>
with 5912 unique warnings and 0 duplicates.
[CHECKSTYLE] Successfully parsed file <https://builds.apache.org/job/Atlas-0.8-IntegrationTests/ws/graphdb/target/checkstyle-result.xml>
with 5912 unique warnings and 0 duplicates.
[CHECKSTYLE] Successfully parsed file <https://builds.apache.org/job/Atlas-0.8-IntegrationTests/ws/graphdb/titan0/target/checkstyle-result.xml>
with 8186 unique warnings and 0 duplicates.
[CHECKSTYLE] Successfully parsed file <https://builds.apache.org/job/Atlas-0.8-IntegrationTests/ws/graphdb/titan1/target/checkstyle-result.xml>
with 9134 unique warnings and 0 duplicates.
[CHECKSTYLE] Successfully parsed file <https://builds.apache.org/job/Atlas-0.8-IntegrationTests/ws/intg/target/checkstyle-result.xml>
with 15438 unique warnings and 0 duplicates.
[CHECKSTYLE] Successfully parsed file <https://builds.apache.org/job/Atlas-0.8-IntegrationTests/ws/notification/target/checkstyle-result.xml>
with 16648 unique warnings and 0 duplicates.
[CHECKSTYLE] Successfully parsed file <https://builds.apache.org/job/Atlas-0.8-IntegrationTests/ws/repository/target/checkstyle-result.xml>
with 35015 unique warnings and 0 duplicates.
[CHECKSTYLE] Successfully parsed file <https://builds.apache.org/job/Atlas-0.8-IntegrationTests/ws/server-api/target/checkstyle-result.xml>
with 35394 unique warnings and 0 duplicates.
[CHECKSTYLE] Successfully parsed file <https://builds.apache.org/job/Atlas-0.8-IntegrationTests/ws/shaded/hbase-client-shaded/target/checkstyle-result.xml>
with 35394 unique warnings and 0 duplicates.
[CHECKSTYLE] Successfully parsed file <https://builds.apache.org/job/Atlas-0.8-IntegrationTests/ws/shaded/hbase-server-shaded/target/checkstyle-result.xml>
with 35394 unique warnings and 0 duplicates.
[CHECKSTYLE] Successfully parsed file <https://builds.apache.org/job/Atlas-0.8-IntegrationTests/ws/target/checkstyle-result.xml>
with 35394 unique warnings and 0 duplicates.
[CHECKSTYLE] Successfully parsed file <https://builds.apache.org/job/Atlas-0.8-IntegrationTests/ws/typesystem/target/checkstyle-result.xml>
with 39612 unique warnings and 0 duplicates.
<Git Blamer> Using GitBlamer to create author and commit information for all warnings.
<Git Blamer> GIT_COMMIT=acdcb7df904d9192832902a04b2f8d1329c50e83, workspace=<https://builds.apache.org/job/Atlas-0.8-IntegrationTests/ws/>
 > git rev-parse acdcb7df904d9192832902a04b2f8d1329c50e83^{commit} # timeout=10
[FINDBUGS] Collecting findbugs analysis files...
[FINDBUGS] Searching for all files in <https://builds.apache.org/job/Atlas-0.8-IntegrationTests/ws/>
that match the pattern **/target/findbugs.xml
[FINDBUGS] Parsing 12 files in <https://builds.apache.org/job/Atlas-0.8-IntegrationTests/ws/>
[FINDBUGS] Successfully parsed file <https://builds.apache.org/job/Atlas-0.8-IntegrationTests/ws/authorization/target/findbugs.xml>
with 0 unique warnings and 0 duplicates.
[FINDBUGS] Successfully parsed file <https://builds.apache.org/job/Atlas-0.8-IntegrationTests/ws/catalog/target/findbugs.xml>
with 0 unique warnings and 0 duplicates.
[FINDBUGS] Successfully parsed file <https://builds.apache.org/job/Atlas-0.8-IntegrationTests/ws/client/target/findbugs.xml>
with 0 unique warnings and 0 duplicates.
[FINDBUGS] Successfully parsed file <https://builds.apache.org/job/Atlas-0.8-IntegrationTests/ws/common/target/findbugs.xml>
with 0 unique warnings and 0 duplicates.
[FINDBUGS] Successfully parsed file <https://builds.apache.org/job/Atlas-0.8-IntegrationTests/ws/graphdb/api/target/findbugs.xml>
with 0 unique warnings and 0 duplicates.
[FINDBUGS] Successfully parsed file <https://builds.apache.org/job/Atlas-0.8-IntegrationTests/ws/graphdb/common/target/findbugs.xml>
with 0 unique warnings and 0 duplicates.
[FINDBUGS] Successfully parsed file <https://builds.apache.org/job/Atlas-0.8-IntegrationTests/ws/graphdb/titan0/target/findbugs.xml>
with 0 unique warnings and 0 duplicates.
[FINDBUGS] Successfully parsed file <https://builds.apache.org/job/Atlas-0.8-IntegrationTests/ws/intg/target/findbugs.xml>
with 0 unique warnings and 0 duplicates.
[FINDBUGS] Successfully parsed file <https://builds.apache.org/job/Atlas-0.8-IntegrationTests/ws/notification/target/findbugs.xml>
with 0 unique warnings and 0 duplicates.
[FINDBUGS] Successfully parsed file <https://builds.apache.org/job/Atlas-0.8-IntegrationTests/ws/repository/target/findbugs.xml>
with 0 unique warnings and 0 duplicates.
[FINDBUGS] Successfully parsed file <https://builds.apache.org/job/Atlas-0.8-IntegrationTests/ws/server-api/target/findbugs.xml>
with 0 unique warnings and 0 duplicates.
[FINDBUGS] Successfully parsed file <https://builds.apache.org/job/Atlas-0.8-IntegrationTests/ws/typesystem/target/findbugs.xml>
with 0 unique warnings and 0 duplicates.
<Git Blamer> Using GitBlamer to create author and commit information for all warnings.
<Git Blamer> GIT_COMMIT=acdcb7df904d9192832902a04b2f8d1329c50e83, workspace=<https://builds.apache.org/job/Atlas-0.8-IntegrationTests/ws/>
Archiving artifacts
[Fast Archiver] No prior successful build to compare, so performing full copy of artifacts
TestNG Reports Processing: START
Looking for TestNG results report in workspace using pattern: **/target/surefire-reports/testng-results.xml,**/target/failsafe-reports/testng-results.xml
Saving reports...
Processing '/x1/jenkins/jenkins-home/jobs/Atlas-0.8-IntegrationTests/builds/17/testng/testng-results.xml'
3.787879% of tests failed, which exceeded threshold of 0%. Marking build as UNSTABLE
TestNG Reports Processing: FINISH

Mime
View raw message