atlas-dev mailing list archives

Site index · List index
Message view « Date » · « Thread »
Top « Date » · « Thread »
From Apache Jenkins Server <jenk...@builds.apache.org>
Subject Build failed in Jenkins: Atlas-master-IntegrationTests #26
Date Wed, 23 Aug 2017 17:52:29 GMT
See <https://builds.apache.org/job/Atlas-master-IntegrationTests/26/display/redirect?page=changes>

Changes:

[madhan] ATLAS-2080: fix - tag filters should not be added in the results

[ssubramanian] ATLAS-2079: Fix coverity scan issue and IT failures introduced by

------------------------------------------
[...truncated 36.44 MB...]
	at org.apache.atlas.hive.hook.HiveHookIT.testLoadDFSPathPartitioned(HiveHookIT.java:448)
Caused by: org.apache.atlas.AtlasServiceException: Metadata service API org.apache.atlas.AtlasBaseClient$APIInfo@6dbb9e18
failed with status 404 (Not Found) Response Body ({"error":"Instance hive_table with unique
attribute {qualifiedName=default.tablekhabo9fwut@primary} does not exist"})
	at org.apache.atlas.hive.hook.HiveHookIT.testLoadDFSPathPartitioned(HiveHookIT.java:448)

testLoadLocalPath(org.apache.atlas.hive.hook.HiveHookIT)  Time elapsed: 0.121 sec  <<<
FAILURE!
java.lang.AssertionError: expected:<0> but was:<40000>
	at org.apache.atlas.hive.hook.HiveHookIT.testLoadLocalPath(HiveHookIT.java:428)

testLoadLocalPathIntoPartition(org.apache.atlas.hive.hook.HiveHookIT)  Time elapsed: 0.166
sec  <<< FAILURE!
java.lang.AssertionError: expected:<0> but was:<40000>
	at org.apache.atlas.hive.hook.HiveHookIT.testLoadLocalPathIntoPartition(HiveHookIT.java:439)

testTraitsPreservedOnColumnRename(org.apache.atlas.hive.hook.HiveHookIT)  Time elapsed: 5.548
sec  <<< FAILURE!
java.lang.AssertionError: Assertions failed. Failing after waiting for timeout 1000 msecs
	at org.apache.atlas.hive.hook.HiveHookIT.assertColumnIsRegistered(HiveHookIT.java:283)
	at org.apache.atlas.hive.hook.HiveHookIT.assertColumnIsRegistered(HiveHookIT.java:278)
	at org.apache.atlas.hive.hook.HiveHookIT.testTraitsPreservedOnColumnRename(HiveHookIT.java:1255)
Caused by: org.apache.atlas.AtlasServiceException: Metadata service API org.apache.atlas.AtlasBaseClient$APIInfo@7f3d18a6
failed with status 404 (Not Found) Response Body ({"error":"Instance hive_column with unique
attribute {qualifiedName=dbblv2qpgsui.table4bchiybgb1.id@primary} does not exist"})
	at org.apache.atlas.hive.hook.HiveHookIT.assertColumnIsRegistered(HiveHookIT.java:283)
	at org.apache.atlas.hive.hook.HiveHookIT.assertColumnIsRegistered(HiveHookIT.java:278)
	at org.apache.atlas.hive.hook.HiveHookIT.testTraitsPreservedOnColumnRename(HiveHookIT.java:1255)

testTruncateTable(org.apache.atlas.hive.hook.HiveHookIT)  Time elapsed: 5.485 sec  <<<
FAILURE!
java.lang.AssertionError: Assertions failed. Failing after waiting for timeout 1000 msecs
	at org.apache.atlas.hive.hook.HiveHookIT.testTruncateTable(HiveHookIT.java:1197)
Caused by: org.apache.atlas.AtlasServiceException: Metadata service API org.apache.atlas.AtlasBaseClient$APIInfo@bf5ca10
failed with status 404 (Not Found) Response Body ({"error":"Instance hive_table with unique
attribute {qualifiedName=default.tabletrviye4h3c@primary} does not exist"})
	at org.apache.atlas.hive.hook.HiveHookIT.testTruncateTable(HiveHookIT.java:1197)

testUpdateProcess(org.apache.atlas.hive.hook.HiveHookIT)  Time elapsed: 9.99 sec  <<<
FAILURE!
java.lang.AssertionError: Assertions failed. Failing after waiting for timeout 1000 msecs
	at org.apache.atlas.hive.hook.HiveHookIT.assertProcessIsRegistered(HiveHookIT.java:1735)
	at org.apache.atlas.hive.hook.HiveHookIT.validateProcess(HiveHookIT.java:487)
	at org.apache.atlas.hive.hook.HiveHookIT.validateProcess(HiveHookIT.java:507)
	at org.apache.atlas.hive.hook.HiveHookIT.testUpdateProcess(HiveHookIT.java:590)
Caused by: org.apache.atlas.AtlasServiceException: Metadata service API org.apache.atlas.AtlasBaseClient$APIInfo@37af0eaf
failed with status 404 (Not Found) Response Body ({"error":"Instance hive_process with unique
attribute {qualifiedName=QUERY:default.tablezgarvajuuj@primary:1503510421000->:PATH_WRITE}
does not exist"})
	at org.apache.atlas.hive.hook.HiveHookIT.assertProcessIsRegistered(HiveHookIT.java:1735)
	at org.apache.atlas.hive.hook.HiveHookIT.validateProcess(HiveHookIT.java:487)
	at org.apache.atlas.hive.hook.HiveHookIT.validateProcess(HiveHookIT.java:507)
	at org.apache.atlas.hive.hook.HiveHookIT.testUpdateProcess(HiveHookIT.java:590)


Results :

Failed tests: 
  HiveMetastoreBridgeIT.testCreateTableAndImport:41->HiveITBase.assertDatabaseIsRegistered:237->HiveITBase.assertDatabaseIsRegistered:243->HiveITBase.assertEntityIsRegistered:158->HiveITBase.waitFor:202
Assertions failed. Failing after waiting for timeout 1000 msecs
  HiveMetastoreBridgeIT.testImportCreatedTable:77->HiveITBase.assertDatabaseIsRegistered:237->HiveITBase.assertDatabaseIsRegistered:243->HiveITBase.assertEntityIsRegistered:158->HiveITBase.waitFor:202
Assertions failed. Failing after waiting for timeout 1000 msecs
  HiveHookIT.testAlterDBOwner:1577->HiveITBase.assertDatabaseIsRegistered:243->HiveITBase.assertEntityIsRegistered:158->HiveITBase.waitFor:202
Assertions failed. Failing after waiting for timeout 1000 msecs
  HiveHookIT.testAlterDBProperties:1589->testAlterProperties:1616->verifyEntityProperties:1652->HiveITBase.assertDatabaseIsRegistered:243->HiveITBase.assertEntityIsRegistered:158->HiveITBase.waitFor:202
Assertions failed. Failing after waiting for timeout 1000 msecs
  HiveHookIT.testAlterTableBucketingClusterSort:1356->runBucketSortQuery:1365->assertTableIsRegistered:1802->HiveITBase.assertTableIsRegistered:152->HiveITBase.assertEntityIsRegistered:158->HiveITBase.waitFor:202
Assertions failed. Failing after waiting for timeout 1000 msecs
  HiveHookIT.testAlterTableChangeColumn:1023->assertColumnIsRegistered:283->HiveITBase.assertEntityIsRegistered:158->HiveITBase.waitFor:202
Assertions failed. Failing after waiting for timeout 1000 msecs
  HiveHookIT.testAlterTableFileFormat:1315->assertTableIsRegistered:1802->HiveITBase.assertTableIsRegistered:152->HiveITBase.assertEntityIsRegistered:158->HiveITBase.waitFor:202
Assertions failed. Failing after waiting for timeout 1000 msecs
  HiveHookIT.testAlterTableLocation:1291->assertTableIsRegistered:1802->HiveITBase.assertTableIsRegistered:152->HiveITBase.assertEntityIsRegistered:158->HiveITBase.waitFor:202
Assertions failed. Failing after waiting for timeout 1000 msecs
  HiveHookIT.testAlterTablePartitionColumnType:1217->assertColumnIsRegistered:283->HiveITBase.assertEntityIsRegistered:158->HiveITBase.waitFor:202
Assertions failed. Failing after waiting for timeout 1000 msecs
  HiveHookIT.testAlterTableProperties:1596->testAlterProperties:1610->verifyEntityProperties:1644->assertTableIsRegistered:1802->HiveITBase.assertTableIsRegistered:152->HiveITBase.assertEntityIsRegistered:158->HiveITBase.waitFor:202
Assertions failed. Failing after waiting for timeout 1000 msecs
  HiveHookIT.testAlterTableRename:879->HiveITBase.assertTableIsRegistered:146->HiveITBase.assertTableIsRegistered:152->HiveITBase.assertEntityIsRegistered:158->HiveITBase.waitFor:202
Assertions failed. Failing after waiting for timeout 1000 msecs
  HiveHookIT.testAlterTableRenameAliasRegistered:863->HiveITBase.assertTableIsRegistered:146->HiveITBase.assertTableIsRegistered:152->HiveITBase.assertEntityIsRegistered:158->HiveITBase.waitFor:202
Assertions failed. Failing after waiting for timeout 1000 msecs
  HiveHookIT.testAlterTableSerde:1403->runSerdePropsQuery:1550->verifyTableSdProperties:1663->assertTableIsRegistered:1802->HiveITBase.assertTableIsRegistered:152->HiveITBase.assertEntityIsRegistered:158->HiveITBase.waitFor:202
Assertions failed. Failing after waiting for timeout 1000 msecs
  HiveHookIT.testAlterTableWithoutHookConf:1243->HiveITBase.assertTableIsRegistered:146->HiveITBase.assertTableIsRegistered:152->HiveITBase.assertEntityIsRegistered:158->HiveITBase.waitFor:202
Assertions failed. Failing after waiting for timeout 1000 msecs
  HiveHookIT.testAlterViewAsSelect:380->HiveITBase.assertTableIsRegistered:146->HiveITBase.assertTableIsRegistered:152->HiveITBase.assertEntityIsRegistered:158->HiveITBase.waitFor:202
Assertions failed. Failing after waiting for timeout 1000 msecs
  HiveHookIT.testAlterViewProperties:1637->testAlterProperties:1610->verifyEntityProperties:1644->assertTableIsRegistered:1802->HiveITBase.assertTableIsRegistered:152->HiveITBase.assertEntityIsRegistered:158->HiveITBase.waitFor:202
Assertions failed. Failing after waiting for timeout 1000 msecs
  HiveHookIT.testAlterViewRename:1279->HiveITBase.assertTableIsRegistered:146->HiveITBase.assertTableIsRegistered:152->HiveITBase.assertEntityIsRegistered:158->HiveITBase.waitFor:202
Assertions failed. Failing after waiting for timeout 1000 msecs
  HiveHookIT.testCTAS:309->assertProcessIsRegistered:1710->HiveITBase.assertEntityIsRegistered:158->HiveITBase.waitFor:202
Assertions failed. Failing after waiting for timeout 1000 msecs
  HiveHookIT.testCreateDatabase:77->HiveITBase.assertDatabaseIsRegistered:237->HiveITBase.assertDatabaseIsRegistered:243->HiveITBase.assertEntityIsRegistered:158->HiveITBase.waitFor:202
Assertions failed. Failing after waiting for timeout 1000 msecs
  HiveHookIT.testCreateTable:142->HiveITBase.assertTableIsRegistered:146->HiveITBase.assertTableIsRegistered:152->HiveITBase.assertEntityIsRegistered:158->HiveITBase.waitFor:202
Assertions failed. Failing after waiting for timeout 1000 msecs
  HiveHookIT.testCreateView:368->assertProcessIsRegistered:1710->HiveITBase.assertEntityIsRegistered:158->HiveITBase.waitFor:202
Assertions failed. Failing after waiting for timeout 1000 msecs
  HiveHookIT.testDropAndRecreateCTASOutput:338->HiveITBase.assertTableIsRegistered:146->HiveITBase.assertTableIsRegistered:152->HiveITBase.assertEntityIsRegistered:158->HiveITBase.waitFor:202
Assertions failed. Failing after waiting for timeout 1000 msecs
  HiveHookIT.testDropTable:1416->HiveITBase.assertTableIsRegistered:146->HiveITBase.assertTableIsRegistered:152->HiveITBase.assertEntityIsRegistered:158->HiveITBase.waitFor:202
Assertions failed. Failing after waiting for timeout 1000 msecs
  HiveHookIT.testDropView:1526->HiveITBase.assertTableIsRegistered:146->HiveITBase.assertTableIsRegistered:152->HiveITBase.assertEntityIsRegistered:158->HiveITBase.waitFor:202
Assertions failed. Failing after waiting for timeout 1000 msecs
  HiveHookIT.testEmptyStringAsValue:328->HiveITBase.assertTableIsRegistered:146->HiveITBase.assertTableIsRegistered:152->HiveITBase.assertEntityIsRegistered:158->HiveITBase.waitFor:202
Assertions failed. Failing after waiting for timeout 1000 msecs
  HiveHookIT.testExportImportPartitionedTable:780->HiveITBase.assertTableIsRegistered:146->HiveITBase.assertTableIsRegistered:152->HiveITBase.assertEntityIsRegistered:158->HiveITBase.waitFor:202
Assertions failed. Failing after waiting for timeout 1000 msecs
  HiveHookIT.testExportImportUnPartitionedTable:736->HiveITBase.assertTableIsRegistered:146->HiveITBase.assertTableIsRegistered:152->HiveITBase.assertEntityIsRegistered:158->HiveITBase.waitFor:202
Assertions failed. Failing after waiting for timeout 1000 msecs
  HiveHookIT.testInsertIntoDFSDirPartitioned:638->validateProcess:487->assertProcessIsRegistered:1735->HiveITBase.assertEntityIsRegistered:158->HiveITBase.waitFor:202
Assertions failed. Failing after waiting for timeout 1000 msecs
  HiveHookIT.testInsertIntoLocalDir:571->validateProcess:507->validateProcess:487->assertProcessIsRegistered:1735->HiveITBase.assertEntityIsRegistered:158->HiveITBase.waitFor:202
Assertions failed. Failing after waiting for timeout 1000 msecs
  HiveHookIT.testInsertIntoPartition:717->validateProcess:487->assertProcessIsRegistered:1735->HiveITBase.assertEntityIsRegistered:158->HiveITBase.waitFor:202
Assertions failed. Failing after waiting for timeout 1000 msecs
2017-08-23 17:47:15,135 DEBUG - [NotificationHookConsumer thread-0:] ~ Sent message for topic
- ATLAS_ENTITIES, partition - 0, offset - 1179 (KafkaNotification:228)
  HiveHookIT.testInsertIntoTable:515->HiveITBase.assertTableIsRegistered:146->HiveITBase.assertTableIsRegistered:152->HiveITBase.assertEntityIsRegistered:158->HiveITBase.waitFor:202
Assertions failed. Failing after waiting for timeout 1000 msecs
  HiveHookIT.testLineage:1831->HiveITBase.assertTableIsRegistered:146->HiveITBase.assertTableIsRegistered:152->HiveITBase.assertEntityIsRegistered:158->HiveITBase.waitFor:202
Assertions failed. Failing after waiting for timeout 1000 msecs
  HiveHookIT.testLoadDFSPathPartitioned:448->HiveITBase.assertTableIsRegistered:146->HiveITBase.assertTableIsRegistered:152->HiveITBase.assertEntityIsRegistered:158->HiveITBase.waitFor:202
Assertions failed. Failing after waiting for timeout 1000 msecs
  HiveHookIT.testLoadLocalPath:428->HiveITBase.runCommand:105->HiveITBase.runCommandWithDelay:113->HiveITBase.runCommandWithDelay:120
expected:<0> but was:<40000>
  HiveHookIT.testLoadLocalPathIntoPartition:439->HiveITBase.runCommand:105->HiveITBase.runCommandWithDelay:113->HiveITBase.runCommandWithDelay:120
expected:<0> but was:<40000>
  HiveHookIT.testTraitsPreservedOnColumnRename:1255->assertColumnIsRegistered:278->assertColumnIsRegistered:283->HiveITBase.assertEntityIsRegistered:158->HiveITBase.waitFor:202
Assertions failed. Failing after waiting for timeout 1000 msecs
  HiveHookIT.testTruncateTable:1197->HiveITBase.assertTableIsRegistered:146->HiveITBase.assertTableIsRegistered:152->HiveITBase.assertEntityIsRegistered:158->HiveITBase.waitFor:202
Assertions failed. Failing after waiting for timeout 1000 msecs
  HiveHookIT.testUpdateProcess:590->validateProcess:507->validateProcess:487->assertProcessIsRegistered:1735->HiveITBase.assertEntityIsRegistered:158->HiveITBase.waitFor:202
Assertions failed. Failing after waiting for timeout 1000 msecs

Tests run: 45, Failures: 38, Errors: 0, Skipped: 0

[INFO] 
[INFO] --- jetty-maven-plugin:9.2.12.v20150709:stop (stop-jetty) @ hive-bridge ---
[INFO] Waiting 10 seconds for jetty to stop
[INFO] Stopped ServerConnector@2b22f746{HTTP/1.1}{0.0.0.0:31000}
2017-08-23 17:47:15,159 DEBUG - [NotificationHookConsumer thread-0:] ~ Sent message for topic
- ATLAS_ENTITIES, partition - 0, offset - 1180 (KafkaNotification:228)
2017-08-23 17:47:15,184 DEBUG - [NotificationHookConsumer thread-0:] ~ Sent message for topic
- ATLAS_ENTITIES, partition - 0, offset - 1181 (KafkaNotification:228)
2017-08-23 17:47:15,209 DEBUG - [NotificationHookConsumer thread-0:] ~ Sent message for topic
- ATLAS_ENTITIES, partition - 0, offset - 1182 (KafkaNotification:228)
2017-08-23 17:47:15,234 DEBUG - [NotificationHookConsumer thread-0:] ~ Sent message for topic
- ATLAS_ENTITIES, partition - 0, offset - 1183 (KafkaNotification:228)
[INFO] Closing Spring root WebApplicationContext
2017-08-23 17:47:15,658 DEBUG - [ShutdownMonitor:] ~ ==> AtlasAuthorizationFilter destroy
(AtlasAuthorizationFilter:78)
2017-08-23 17:47:15,658 DEBUG - [ShutdownMonitor:] ~ ==> +SimpleAtlasAuthorizer cleanUp
(SimpleAtlasAuthorizer:327)
2017-08-23 17:47:15,658 DEBUG - [ShutdownMonitor:] ~ <== +SimpleAtlasAuthorizer cleanUp
(SimpleAtlasAuthorizer:338)
2017-08-23 17:47:15,659 INFO  - [ShutdownMonitor:] ~ Stopping service org.apache.atlas.web.service.ActiveInstanceElectorService
(Services:65)
2017-08-23 17:47:15,659 INFO  - [ShutdownMonitor:] ~ HA is not enabled, no need to stop leader
election service (ActiveInstanceElectorService:124)
2017-08-23 17:47:15,659 INFO  - [ShutdownMonitor:] ~ Stopping service org.apache.atlas.kafka.KafkaNotification
(Services:65)
2017-08-23 17:47:16,093 DEBUG - [NotificationHookConsumer thread-0:] ~ graph commit (GraphTransactionInterceptor:65)
2017-08-23 17:47:16,094 DEBUG - [NotificationHookConsumer thread-0:] ~ ==> releaseLockedObjects():
lockedGuids.size: 0 (GraphTransactionInterceptor$ObjectUpdateSynchronizer:187)
2017-08-23 17:47:16,094 DEBUG - [NotificationHookConsumer thread-0:] ~ <== releaseLockedObjects():
lockedGuids.size: 0 (GraphTransactionInterceptor$ObjectUpdateSynchronizer:197)
2017-08-23 17:47:16,094 INFO  - [NotificationHookConsumer thread-0:] ~  commiting the offset
==>> 108 (AtlasKafkaConsumer:87)
2017-08-23 17:47:17,460 INFO  - [ShutdownMonitor:] ~ Stopping service org.apache.atlas.notification.NotificationHookConsumer
(Services:65)
2017-08-23 17:47:17,461 INFO  - [ShutdownMonitor:] ~ ==> stopConsumerThreads() (NotificationHookConsumer:175)
2017-08-23 17:47:17,461 INFO  - [ShutdownMonitor:] ~ ==> HookConsumer shutdown() (NotificationHookConsumer$HookConsumer:423)
2017-08-23 17:47:17,461 INFO  - [ShutdownMonitor:] ~ [atlas-hook-consumer-thread], Shutting
down (Logging$class:68)
2017-08-23 17:47:17,462 DEBUG - [NotificationHookConsumer thread-0:] ~ PERF|ENTITY_FULL_UPDATE|5290
(AtlasPerfTracer:77)
2017-08-23 17:47:17,462 INFO  - [NotificationHookConsumer thread-0:] ~ closing NotificationConsumer
(NotificationHookConsumer$HookConsumer:253)
2017-08-23 17:47:17,467 INFO  - [NotificationHookConsumer thread-0:] ~ <== HookConsumer
doWork() (NotificationHookConsumer$HookConsumer:258)
2017-08-23 17:47:17,468 INFO  - [NotificationHookConsumer thread-0:] ~ [atlas-hook-consumer-thread],
Stopped  (Logging$class:68)
2017-08-23 17:47:17,468 INFO  - [ShutdownMonitor:] ~ [atlas-hook-consumer-thread], Shutdown
completed (Logging$class:68)
2017-08-23 17:47:17,469 INFO  - [ShutdownMonitor:] ~ <== HookConsumer shutdown() (NotificationHookConsumer$HookConsumer:438)
2017-08-23 17:47:17,469 INFO  - [ShutdownMonitor:] ~ <== stopConsumerThreads() (NotificationHookConsumer:184)
[INFO] Shutting down log4j
[INFO] Stopped o.e.j.m.p.JettyWebAppContext@74720374{/,<https://builds.apache.org/job/Atlas-master-IntegrationTests/ws/webapp/target/atlas-webapp-0.9-SNAPSHOT/,UNAVAILABLE}{/home/jenkins/jenkins-slave/workspace/Atlas-master-IntegrationTests/webapp/target/atlas-webapp-0.9-SNAPSHOT.war}>
[INFO] Server reports itself as stopped
[INFO] 
[INFO] --- maven-source-plugin:2.4:jar-no-fork (attach-sources) @ hive-bridge ---
[INFO] Building jar: <https://builds.apache.org/job/Atlas-master-IntegrationTests/ws/addons/hive-bridge/target/hive-bridge-0.9-SNAPSHOT-sources.jar>
[INFO] 
[INFO] --- maven-source-plugin:2.4:test-jar-no-fork (attach-sources) @ hive-bridge ---
[INFO] Building jar: <https://builds.apache.org/job/Atlas-master-IntegrationTests/ws/addons/hive-bridge/target/hive-bridge-0.9-SNAPSHOT-test-sources.jar>
[INFO] 
[INFO] --- maven-failsafe-plugin:2.19.1:verify (verify) @ hive-bridge ---
[INFO] ------------------------------------------------------------------------
[INFO] Reactor Summary:
[INFO] 
[INFO] Apache Atlas Server Build Tools .................... SUCCESS [  1.443 s]
[INFO] apache-atlas ....................................... SUCCESS [ 15.625 s]
[INFO] Apache Atlas Integration ........................... SUCCESS [ 34.350 s]
[INFO] Apache Atlas Common ................................ SUCCESS [ 19.713 s]
[INFO] Apache Atlas Typesystem ............................ SUCCESS [01:23 min]
[INFO] Apache Atlas Client ................................ SUCCESS [ 17.993 s]
[INFO] Apache Atlas Server API ............................ SUCCESS [ 12.106 s]
[INFO] Apache Atlas Notification .......................... SUCCESS [ 18.121 s]
[INFO] Apache Atlas Graph Database Projects ............... SUCCESS [  0.804 s]
[INFO] Apache Atlas Graph Database API .................... SUCCESS [  7.987 s]
[INFO] Graph Database Common Code ......................... SUCCESS [  7.995 s]
[INFO] Apache Atlas Titan 1.0.0 GraphDB Impl .............. SUCCESS [ 34.277 s]
[INFO] Shaded version of Apache hbase client .............. SUCCESS [  9.206 s]
[INFO] Apache Atlas Titan 0.5.4 Graph DB Impl ............. SUCCESS [ 51.425 s]
[INFO] Apache Atlas Graph Database Implementation Dependencies SUCCESS [  0.915 s]
[INFO] Shaded version of Apache hbase server .............. SUCCESS [ 32.389 s]
[INFO] Apache Atlas Repository ............................ SUCCESS [02:01 min]
[INFO] Apache Atlas Authorization ......................... SUCCESS [ 13.269 s]
[INFO] Apache Atlas Business Catalog ...................... SUCCESS [ 18.291 s]
[INFO] Apache Atlas UI .................................... SUCCESS [01:12 min]
[INFO] Apache Atlas Web Application ....................... SUCCESS [05:52 min]
[INFO] Apache Atlas Documentation ......................... SUCCESS [  8.067 s]
[INFO] Apache Atlas FileSystem Model ...................... SUCCESS [  2.898 s]
[INFO] Apache Atlas Plugin Classloader .................... SUCCESS [ 10.691 s]
[INFO] Apache Atlas Hive Bridge Shim ...................... SUCCESS [  8.909 s]
[INFO] Apache Atlas Hive Bridge ........................... FAILURE [08:55 min]
[INFO] Apache Atlas Falcon Bridge Shim .................... SKIPPED
[INFO] Apache Atlas Falcon Bridge ......................... SKIPPED
[INFO] Apache Atlas Sqoop Bridge Shim ..................... SKIPPED
[INFO] Apache Atlas Sqoop Bridge .......................... SKIPPED
[INFO] Apache Atlas Storm Bridge Shim ..................... SKIPPED
[INFO] Apache Atlas Storm Bridge .......................... SKIPPED
[INFO] Apache Atlas Distribution .......................... SKIPPED
[INFO] ------------------------------------------------------------------------
[INFO] BUILD FAILURE
[INFO] ------------------------------------------------------------------------
[INFO] Total time: 24:55 min
[INFO] Finished at: 2017-08-23T17:47:17Z
[INFO] Final Memory: 549M/1751M
[INFO] ------------------------------------------------------------------------
log4j:WARN No appenders could be found for logger (org.apache.atlas.security.InMemoryJAASConfiguration).
log4j:WARN Please initialize the log4j system properly.
log4j:WARN No appenders could be found for logger (org.apache.atlas.security.InMemoryJAASConfiguration).
log4j:WARN Please initialize the log4j system properly.
log4j:WARN See http://logging.apache.org/log4j/1.2/faq.html#noconfig for more info.
log4j:WARN See http://logging.apache.org/log4j/1.2/faq.html#noconfig for more info.
[ERROR] Failed to execute goal org.apache.maven.plugins:maven-failsafe-plugin:2.19.1:verify
(verify) on project hive-bridge: There are test failures.
[ERROR] 
[ERROR] Please refer to <https://builds.apache.org/job/Atlas-master-IntegrationTests/ws/addons/hive-bridge/target/failsafe-reports>
for the individual test results.
[ERROR] -> [Help 1]
[ERROR] 
[ERROR] To see the full stack trace of the errors, re-run Maven with the -e switch.
[ERROR] Re-run Maven using the -X switch to enable full debug logging.
[ERROR] 
[ERROR] For more information about the errors and possible solutions, please read the following
articles:
[ERROR] [Help 1] http://cwiki.apache.org/confluence/display/MAVEN/MojoFailureException
[ERROR] 
[ERROR] After correcting the problems, you can resume the build with the command
[ERROR]   mvn <goals> -rf :hive-bridge
Build step 'Execute shell' marked build as failure
[CHECKSTYLE] Collecting checkstyle analysis files...
[CHECKSTYLE] Searching for all files in <https://builds.apache.org/job/Atlas-master-IntegrationTests/ws/>
that match the pattern **/target/checkstyle-result.xml
[CHECKSTYLE] Parsing 24 files in <https://builds.apache.org/job/Atlas-master-IntegrationTests/ws/>
[CHECKSTYLE] Successfully parsed file <https://builds.apache.org/job/Atlas-master-IntegrationTests/ws/addons/hdfs-model/target/checkstyle-result.xml>
with 0 unique warnings and 0 duplicates.
[CHECKSTYLE] Successfully parsed file <https://builds.apache.org/job/Atlas-master-IntegrationTests/ws/addons/hive-bridge-shim/target/checkstyle-result.xml>
with 15 unique warnings and 0 duplicates.
[CHECKSTYLE] Successfully parsed file <https://builds.apache.org/job/Atlas-master-IntegrationTests/ws/authorization/target/checkstyle-result.xml>
with 482 unique warnings and 0 duplicates.
[CHECKSTYLE] Successfully parsed file <https://builds.apache.org/job/Atlas-master-IntegrationTests/ws/catalog/target/checkstyle-result.xml>
with 2627 unique warnings and 0 duplicates.
[CHECKSTYLE] Successfully parsed file <https://builds.apache.org/job/Atlas-master-IntegrationTests/ws/client/target/checkstyle-result.xml>
with 4264 unique warnings and 0 duplicates.
[CHECKSTYLE] Successfully parsed file <https://builds.apache.org/job/Atlas-master-IntegrationTests/ws/common/target/checkstyle-result.xml>
with 5476 unique warnings and 0 duplicates.
[CHECKSTYLE] Successfully parsed file <https://builds.apache.org/job/Atlas-master-IntegrationTests/ws/dashboardv2/target/checkstyle-result.xml>
with 5476 unique warnings and 0 duplicates.
[CHECKSTYLE] Successfully parsed file <https://builds.apache.org/job/Atlas-master-IntegrationTests/ws/docs/target/checkstyle-result.xml>
with 5476 unique warnings and 0 duplicates.
[CHECKSTYLE] Successfully parsed file <https://builds.apache.org/job/Atlas-master-IntegrationTests/ws/graphdb/api/target/checkstyle-result.xml>
with 5745 unique warnings and 0 duplicates.
[CHECKSTYLE] Successfully parsed file <https://builds.apache.org/job/Atlas-master-IntegrationTests/ws/graphdb/common/target/checkstyle-result.xml>
with 5932 unique warnings and 0 duplicates.
[CHECKSTYLE] Successfully parsed file <https://builds.apache.org/job/Atlas-master-IntegrationTests/ws/graphdb/graphdb-impls/target/checkstyle-result.xml>
with 5932 unique warnings and 0 duplicates.
[CHECKSTYLE] Successfully parsed file <https://builds.apache.org/job/Atlas-master-IntegrationTests/ws/graphdb/target/checkstyle-result.xml>
with 5932 unique warnings and 0 duplicates.
[CHECKSTYLE] Successfully parsed file <https://builds.apache.org/job/Atlas-master-IntegrationTests/ws/graphdb/titan0/target/checkstyle-result.xml>
with 8206 unique warnings and 0 duplicates.
[CHECKSTYLE] Successfully parsed file <https://builds.apache.org/job/Atlas-master-IntegrationTests/ws/graphdb/titan1/target/checkstyle-result.xml>
with 9154 unique warnings and 0 duplicates.
[CHECKSTYLE] Successfully parsed file <https://builds.apache.org/job/Atlas-master-IntegrationTests/ws/intg/target/checkstyle-result.xml>
with 16672 unique warnings and 0 duplicates.
[CHECKSTYLE] Successfully parsed file <https://builds.apache.org/job/Atlas-master-IntegrationTests/ws/notification/target/checkstyle-result.xml>
with 17882 unique warnings and 0 duplicates.
[CHECKSTYLE] Successfully parsed file <https://builds.apache.org/job/Atlas-master-IntegrationTests/ws/plugin-classloader/target/checkstyle-result.xml>
with 17990 unique warnings and 0 duplicates.
[CHECKSTYLE] Successfully parsed file <https://builds.apache.org/job/Atlas-master-IntegrationTests/ws/repository/target/checkstyle-result.xml>
with 37498 unique warnings and 0 duplicates.
[CHECKSTYLE] Successfully parsed file <https://builds.apache.org/job/Atlas-master-IntegrationTests/ws/server-api/target/checkstyle-result.xml>
with 37877 unique warnings and 0 duplicates.
[CHECKSTYLE] Successfully parsed file <https://builds.apache.org/job/Atlas-master-IntegrationTests/ws/shaded/hbase-client-shaded/target/checkstyle-result.xml>
with 37877 unique warnings and 0 duplicates.
[CHECKSTYLE] Successfully parsed file <https://builds.apache.org/job/Atlas-master-IntegrationTests/ws/shaded/hbase-server-shaded/target/checkstyle-result.xml>
with 37877 unique warnings and 0 duplicates.
[CHECKSTYLE] Successfully parsed file <https://builds.apache.org/job/Atlas-master-IntegrationTests/ws/target/checkstyle-result.xml>
with 37877 unique warnings and 0 duplicates.
[CHECKSTYLE] Successfully parsed file <https://builds.apache.org/job/Atlas-master-IntegrationTests/ws/typesystem/target/checkstyle-result.xml>
with 42095 unique warnings and 0 duplicates.
[CHECKSTYLE] Successfully parsed file <https://builds.apache.org/job/Atlas-master-IntegrationTests/ws/webapp/target/checkstyle-result.xml>
with 50183 unique warnings and 0 duplicates.
<Git Blamer> Using GitBlamer to create author and commit information for all warnings.
<Git Blamer> GIT_COMMIT=bb1897663b43feb79faf6e2fc2818380fd16b9dd, workspace=<https://builds.apache.org/job/Atlas-master-IntegrationTests/ws/>
 > git rev-parse bb1897663b43feb79faf6e2fc2818380fd16b9dd^{commit} # timeout=10
[FINDBUGS] Collecting findbugs analysis files...
[FINDBUGS] Searching for all files in <https://builds.apache.org/job/Atlas-master-IntegrationTests/ws/>
that match the pattern **/target/findbugs.xml
[FINDBUGS] Parsing 15 files in <https://builds.apache.org/job/Atlas-master-IntegrationTests/ws/>
[FINDBUGS] Successfully parsed file <https://builds.apache.org/job/Atlas-master-IntegrationTests/ws/addons/hive-bridge-shim/target/findbugs.xml>
with 0 unique warnings and 0 duplicates.
[FINDBUGS] Successfully parsed file <https://builds.apache.org/job/Atlas-master-IntegrationTests/ws/authorization/target/findbugs.xml>
with 0 unique warnings and 0 duplicates.
[FINDBUGS] Successfully parsed file <https://builds.apache.org/job/Atlas-master-IntegrationTests/ws/catalog/target/findbugs.xml>
with 0 unique warnings and 0 duplicates.
[FINDBUGS] Successfully parsed file <https://builds.apache.org/job/Atlas-master-IntegrationTests/ws/client/target/findbugs.xml>
with 0 unique warnings and 0 duplicates.
[FINDBUGS] Successfully parsed file <https://builds.apache.org/job/Atlas-master-IntegrationTests/ws/common/target/findbugs.xml>
with 0 unique warnings and 0 duplicates.
[FINDBUGS] Successfully parsed file <https://builds.apache.org/job/Atlas-master-IntegrationTests/ws/graphdb/api/target/findbugs.xml>
with 0 unique warnings and 0 duplicates.
[FINDBUGS] Successfully parsed file <https://builds.apache.org/job/Atlas-master-IntegrationTests/ws/graphdb/common/target/findbugs.xml>
with 0 unique warnings and 0 duplicates.
[FINDBUGS] Successfully parsed file <https://builds.apache.org/job/Atlas-master-IntegrationTests/ws/graphdb/titan0/target/findbugs.xml>
with 0 unique warnings and 0 duplicates.
[FINDBUGS] Successfully parsed file <https://builds.apache.org/job/Atlas-master-IntegrationTests/ws/intg/target/findbugs.xml>
with 0 unique warnings and 0 duplicates.
[FINDBUGS] Successfully parsed file <https://builds.apache.org/job/Atlas-master-IntegrationTests/ws/notification/target/findbugs.xml>
with 0 unique warnings and 0 duplicates.
[FINDBUGS] Successfully parsed file <https://builds.apache.org/job/Atlas-master-IntegrationTests/ws/plugin-classloader/target/findbugs.xml>
with 0 unique warnings and 0 duplicates.
[FINDBUGS] Successfully parsed file <https://builds.apache.org/job/Atlas-master-IntegrationTests/ws/repository/target/findbugs.xml>
with 0 unique warnings and 0 duplicates.
[FINDBUGS] Successfully parsed file <https://builds.apache.org/job/Atlas-master-IntegrationTests/ws/server-api/target/findbugs.xml>
with 0 unique warnings and 0 duplicates.
[FINDBUGS] Successfully parsed file <https://builds.apache.org/job/Atlas-master-IntegrationTests/ws/typesystem/target/findbugs.xml>
with 0 unique warnings and 0 duplicates.
[FINDBUGS] Successfully parsed file <https://builds.apache.org/job/Atlas-master-IntegrationTests/ws/webapp/target/findbugs.xml>
with 0 unique warnings and 0 duplicates.
<Git Blamer> Using GitBlamer to create author and commit information for all warnings.
<Git Blamer> GIT_COMMIT=bb1897663b43feb79faf6e2fc2818380fd16b9dd, workspace=<https://builds.apache.org/job/Atlas-master-IntegrationTests/ws/>
Archiving artifacts
[Fast Archiver] No prior successful build to compare, so performing full copy of artifacts
TestNG Reports Processing: START
Looking for TestNG results report in workspace using pattern: **/target/surefire-reports/testng-results.xml,**/target/failsafe-reports/testng-results.xml
Saving reports...
Processing '/x1/jenkins/jenkins-home/jobs/Atlas-master-IntegrationTests/builds/26/testng/testng-results-1.xml'
Processing '/x1/jenkins/jenkins-home/jobs/Atlas-master-IntegrationTests/builds/26/testng/testng-results.xml'
21.348314% of tests failed, which exceeded threshold of 0%. Marking build as UNSTABLE
TestNG Reports Processing: FINISH

Mime
View raw message