atlas-dev mailing list archives

Site index · List index
Message view « Date » · « Thread »
Top « Date » · « Thread »
From Apache Jenkins Server <jenk...@builds.apache.org>
Subject Build failed in Jenkins: Atlas-master-NoTests #16
Date Thu, 17 Aug 2017 07:28:53 GMT
See <https://builds.apache.org/job/Atlas-master-NoTests/16/display/redirect>

------------------------------------------
[...truncated 18.95 KB...]
[INFO] --- maven-checkstyle-plugin:2.9.1:check (checkstyle-check) @ atlas-intg ---
[INFO] 
[INFO] >>> findbugs-maven-plugin:3.0.1:check (findbugs-check) > :findbugs @ atlas-intg
>>>
[INFO] 
[INFO] --- findbugs-maven-plugin:3.0.1:findbugs (findbugs) @ atlas-intg ---
[INFO] 
[INFO] <<< findbugs-maven-plugin:3.0.1:check (findbugs-check) < :findbugs @ atlas-intg
<<<
[INFO] 
[INFO] 
[INFO] --- findbugs-maven-plugin:3.0.1:check (findbugs-check) @ atlas-intg ---
[INFO] 
[INFO] --- maven-install-plugin:2.5.2:install (default-install) @ atlas-intg ---
[INFO] Installing <https://builds.apache.org/job/Atlas-master-NoTests/ws/intg/target/atlas-intg-0.9-SNAPSHOT.jar>
to /home/jenkins/.m2/repository/org/apache/atlas/atlas-intg/0.9-SNAPSHOT/atlas-intg-0.9-SNAPSHOT.jar
[INFO] Installing <https://builds.apache.org/job/Atlas-master-NoTests/ws/intg/pom.xml>
to /home/jenkins/.m2/repository/org/apache/atlas/atlas-intg/0.9-SNAPSHOT/atlas-intg-0.9-SNAPSHOT.pom
[INFO] Installing <https://builds.apache.org/job/Atlas-master-NoTests/ws/intg/target/atlas-intg-0.9-SNAPSHOT-tests.jar>
to /home/jenkins/.m2/repository/org/apache/atlas/atlas-intg/0.9-SNAPSHOT/atlas-intg-0.9-SNAPSHOT-tests.jar
[INFO] Installing <https://builds.apache.org/job/Atlas-master-NoTests/ws/intg/target/atlas-intg-0.9-SNAPSHOT-sources.jar>
to /home/jenkins/.m2/repository/org/apache/atlas/atlas-intg/0.9-SNAPSHOT/atlas-intg-0.9-SNAPSHOT-sources.jar
[INFO] Installing <https://builds.apache.org/job/Atlas-master-NoTests/ws/intg/target/atlas-intg-0.9-SNAPSHOT-test-sources.jar>
to /home/jenkins/.m2/repository/org/apache/atlas/atlas-intg/0.9-SNAPSHOT/atlas-intg-0.9-SNAPSHOT-test-sources.jar
[INFO] 
[INFO] ------------------------------------------------------------------------
[INFO] Building Apache Atlas Common 0.9-SNAPSHOT
[INFO] ------------------------------------------------------------------------
[INFO] 
[INFO] --- maven-clean-plugin:2.5:clean (default-clean) @ atlas-common ---
[INFO] Deleting <https://builds.apache.org/job/Atlas-master-NoTests/ws/common/target>
[INFO] Deleting <https://builds.apache.org/job/Atlas-master-NoTests/ws/common> (includes
= [**/*.pyc], excludes = [])
[INFO] 
[INFO] --- buildnumber-maven-plugin:1.4:create (default) @ atlas-common ---
[INFO] Executing: /bin/sh -c cd '<https://builds.apache.org/job/Atlas-master-NoTests/ws/common'>
&& 'git' 'rev-parse' '--verify' 'HEAD'
[INFO] Working directory: <https://builds.apache.org/job/Atlas-master-NoTests/ws/common>
[INFO] Storing buildNumber: 56374ff7e3a6faa3e444db1ba3fa14905f356dc9 at timestamp: 1502954649384
[WARNING] Cannot get the branch information from the git repository: 
Detecting the current branch failed: fatal: ref HEAD is not a symbolic ref

[INFO] Executing: /bin/sh -c cd '<https://builds.apache.org/job/Atlas-master-NoTests/ws/common'>
&& 'git' 'rev-parse' '--verify' 'HEAD'
[INFO] Working directory: <https://builds.apache.org/job/Atlas-master-NoTests/ws/common>
[INFO] Storing buildScmBranch: UNKNOWN
[INFO] 
[INFO] --- maven-remote-resources-plugin:1.5:process (default) @ atlas-common ---
[INFO] 
[INFO] --- maven-resources-plugin:2.7:resources (default-resources) @ atlas-common ---
[INFO] Using 'UTF-8' encoding to copy filtered resources.
[INFO] skip non existing resourceDirectory <https://builds.apache.org/job/Atlas-master-NoTests/ws/common/src/main/resources>
[INFO] Copying 2 resources to META-INF
[INFO] Copying 3 resources
[INFO] 
[INFO] --- maven-compiler-plugin:3.1:compile (default-compile) @ atlas-common ---
[INFO] Changes detected - recompiling the module!
[INFO] Compiling 44 source files to <https://builds.apache.org/job/Atlas-master-NoTests/ws/common/target/classes>
[WARNING] <https://builds.apache.org/job/Atlas-master-NoTests/ws/common/src/main/java/org/apache/atlas/ApplicationProperties.java>:
<https://builds.apache.org/job/Atlas-master-NoTests/ws/common/src/main/java/org/apache/atlas/ApplicationProperties.java>
uses unchecked or unsafe operations.
[WARNING] <https://builds.apache.org/job/Atlas-master-NoTests/ws/common/src/main/java/org/apache/atlas/ApplicationProperties.java>:
Recompile with -Xlint:unchecked for details.
[INFO] 
[INFO] --- maven-resources-plugin:2.7:testResources (default-testResources) @ atlas-common
---
[INFO] Using 'UTF-8' encoding to copy filtered resources.
[INFO] Copying 2 resources
[INFO] skip non existing resourceDirectory <https://builds.apache.org/job/Atlas-master-NoTests/ws/common/typesystem/src/test/resources>
[INFO] Copying 3 resources
[INFO] 
[INFO] --- maven-compiler-plugin:3.1:testCompile (default-testCompile) @ atlas-common ---
[INFO] Changes detected - recompiling the module!
[INFO] Compiling 5 source files to <https://builds.apache.org/job/Atlas-master-NoTests/ws/common/target/test-classes>
[INFO] 
[INFO] --- maven-surefire-plugin:2.18.1:test (default-test) @ atlas-common ---
[INFO] Tests are skipped.
[INFO] 
[INFO] --- maven-jar-plugin:2.5:jar (default-jar) @ atlas-common ---
[INFO] Building jar: <https://builds.apache.org/job/Atlas-master-NoTests/ws/common/target/atlas-common-0.9-SNAPSHOT.jar>
[INFO] 
[INFO] --- maven-site-plugin:3.4:attach-descriptor (attach-descriptor) @ atlas-common ---
[INFO] 
[INFO] --- maven-failsafe-plugin:2.19.1:integration-test (integration-test) @ atlas-common
---
[INFO] Tests are skipped.
[INFO] 
[INFO] --- maven-source-plugin:2.4:jar-no-fork (attach-sources) @ atlas-common ---
[INFO] Building jar: <https://builds.apache.org/job/Atlas-master-NoTests/ws/common/target/atlas-common-0.9-SNAPSHOT-sources.jar>
[INFO] 
[INFO] --- maven-source-plugin:2.4:test-jar-no-fork (attach-sources) @ atlas-common ---
[INFO] Building jar: <https://builds.apache.org/job/Atlas-master-NoTests/ws/common/target/atlas-common-0.9-SNAPSHOT-test-sources.jar>
[INFO] 
[INFO] --- maven-failsafe-plugin:2.19.1:verify (verify) @ atlas-common ---
[INFO] Tests are skipped.
[INFO] 
[INFO] --- apache-rat-plugin:0.7:check (rat-check) @ atlas-common ---
[INFO] Exclude: **/dependency-reduced-pom.xml
[INFO] Exclude: **/javax.script.ScriptEngineFactory
[INFO] Exclude: .reviewboardrc
[INFO] Exclude: 3party-licenses/**
[INFO] Exclude: **/.cache
[INFO] Exclude: **/.cache-main
[INFO] Exclude: **/.cache-tests
[INFO] Exclude: **/.checkstyle
[INFO] Exclude: *.txt
[INFO] Exclude: **/*.json
[INFO] Exclude: .pc/**
[INFO] Exclude: debian/**
[INFO] Exclude: .svn/**
[INFO] Exclude: .git/**
[INFO] Exclude: .gitignore
[INFO] Exclude: **/.idea/**
[INFO] Exclude: **/*.twiki
[INFO] Exclude: **/*.iml
[INFO] Exclude: **/*.json
[INFO] Exclude: **/*.log
[INFO] Exclude: **/target/**
[INFO] Exclude: **/target*/**
[INFO] Exclude: **/build/**
[INFO] Exclude: **/*.patch
[INFO] Exclude: derby.log
[INFO] Exclude: **/logs/**
[INFO] Exclude: **/.classpath
[INFO] Exclude: **/.project
[INFO] Exclude: **/.settings/**
[INFO] Exclude: **/test-output/**
[INFO] Exclude: **/mock/**
[INFO] Exclude: **/data/**
[INFO] Exclude: **/maven-eclipse.xml
[INFO] Exclude: **/.externalToolBuilders/**
[INFO] Exclude: **/build.log
[INFO] Exclude: **/.bowerrc
[INFO] Exclude: *.json
[INFO] Exclude: **/overlays/**
[INFO] Exclude: dev-support/**
[INFO] Exclude: **/users-credentials.properties
[INFO] Exclude: **/public/css/animate.min.css
[INFO] Exclude: **/public/css/bootstrap-sidebar.css
[INFO] Exclude: **/public/js/external_lib/**
[INFO] Exclude: **/node_modules/**
[INFO] Exclude: **/public/js/libs/**
[INFO] Exclude: **/atlas.data/**
[INFO] Exclude: **/${sys:atlas.data}/**
[INFO] Exclude: **/policy-store.txt
[INFO] Exclude: **/*rebel*.xml
[INFO] Exclude: **/*rebel*.xml.bak
[INFO] 
[INFO] --- maven-checkstyle-plugin:2.9.1:check (checkstyle-check) @ atlas-common ---
[INFO] 
[INFO] >>> findbugs-maven-plugin:3.0.1:check (findbugs-check) > :findbugs @ atlas-common
>>>
[INFO] 
[INFO] --- findbugs-maven-plugin:3.0.1:findbugs (findbugs) @ atlas-common ---
[INFO] 
[INFO] <<< findbugs-maven-plugin:3.0.1:check (findbugs-check) < :findbugs @ atlas-common
<<<
[INFO] 
[INFO] 
[INFO] --- findbugs-maven-plugin:3.0.1:check (findbugs-check) @ atlas-common ---
[INFO] 
[INFO] --- maven-install-plugin:2.5.2:install (default-install) @ atlas-common ---
[INFO] Installing <https://builds.apache.org/job/Atlas-master-NoTests/ws/common/target/atlas-common-0.9-SNAPSHOT.jar>
to /home/jenkins/.m2/repository/org/apache/atlas/atlas-common/0.9-SNAPSHOT/atlas-common-0.9-SNAPSHOT.jar
[INFO] Installing <https://builds.apache.org/job/Atlas-master-NoTests/ws/common/pom.xml>
to /home/jenkins/.m2/repository/org/apache/atlas/atlas-common/0.9-SNAPSHOT/atlas-common-0.9-SNAPSHOT.pom
[INFO] Installing <https://builds.apache.org/job/Atlas-master-NoTests/ws/common/target/atlas-common-0.9-SNAPSHOT-sources.jar>
to /home/jenkins/.m2/repository/org/apache/atlas/atlas-common/0.9-SNAPSHOT/atlas-common-0.9-SNAPSHOT-sources.jar
[INFO] Installing <https://builds.apache.org/job/Atlas-master-NoTests/ws/common/target/atlas-common-0.9-SNAPSHOT-test-sources.jar>
to /home/jenkins/.m2/repository/org/apache/atlas/atlas-common/0.9-SNAPSHOT/atlas-common-0.9-SNAPSHOT-test-sources.jar
[INFO] 
[INFO] ------------------------------------------------------------------------
[INFO] Building Apache Atlas Typesystem 0.9-SNAPSHOT
[INFO] ------------------------------------------------------------------------
[INFO] 
[INFO] --- maven-clean-plugin:2.5:clean (default-clean) @ atlas-typesystem ---
[INFO] Deleting <https://builds.apache.org/job/Atlas-master-NoTests/ws/typesystem/target>
[INFO] Deleting <https://builds.apache.org/job/Atlas-master-NoTests/ws/typesystem> (includes
= [**/*.pyc], excludes = [])
[INFO] 
[INFO] --- buildnumber-maven-plugin:1.4:create (default) @ atlas-typesystem ---
[INFO] Executing: /bin/sh -c cd '<https://builds.apache.org/job/Atlas-master-NoTests/ws/typesystem'>
&& 'git' 'rev-parse' '--verify' 'HEAD'
[INFO] Working directory: <https://builds.apache.org/job/Atlas-master-NoTests/ws/typesystem>
[INFO] Storing buildNumber: 56374ff7e3a6faa3e444db1ba3fa14905f356dc9 at timestamp: 1502954651625
[WARNING] Cannot get the branch information from the git repository: 
Detecting the current branch failed: fatal: ref HEAD is not a symbolic ref

[INFO] Executing: /bin/sh -c cd '<https://builds.apache.org/job/Atlas-master-NoTests/ws/typesystem'>
&& 'git' 'rev-parse' '--verify' 'HEAD'
[INFO] Working directory: <https://builds.apache.org/job/Atlas-master-NoTests/ws/typesystem>
[INFO] Storing buildScmBranch: UNKNOWN
[INFO] 
[INFO] --- maven-remote-resources-plugin:1.5:process (default) @ atlas-typesystem ---
[INFO] 
[INFO] --- maven-resources-plugin:2.7:resources (default-resources) @ atlas-typesystem ---
[INFO] Using 'UTF-8' encoding to copy filtered resources.
[INFO] Copying 1 resource
[INFO] Copying 2 resources to META-INF
[INFO] Copying 3 resources
[INFO] 
[INFO] --- scala-maven-plugin:3.2.0:compile (scala-compile-first) @ atlas-typesystem ---
[WARNING] Zinc server is not available at port 3030 - reverting to normal incremental compile
[INFO] Using incremental compilation
[INFO] Compiling 6 Scala sources and 47 Java sources to <https://builds.apache.org/job/Atlas-master-NoTests/ws/typesystem/target/classes...>
[INFO] ------------------------------------------------------------------------
[INFO] Reactor Summary:
[INFO] 
[INFO] Apache Atlas Server Build Tools .................... SUCCESS [  0.816 s]
[INFO] apache-atlas ....................................... SUCCESS [  5.162 s]
[INFO] Apache Atlas Integration ........................... SUCCESS [  7.462 s]
[INFO] Apache Atlas Common ................................ SUCCESS [  2.212 s]
[INFO] Apache Atlas Typesystem ............................ FAILURE [ 45.208 s]
[INFO] Apache Atlas Client ................................ SKIPPED
[INFO] Apache Atlas Server API ............................ SKIPPED
[INFO] Apache Atlas Notification .......................... SKIPPED
[INFO] Apache Atlas Graph Database Projects ............... SKIPPED
[INFO] Apache Atlas Graph Database API .................... SKIPPED
[INFO] Graph Database Common Code ......................... SKIPPED
[INFO] Apache Atlas Titan 1.0.0 GraphDB Impl .............. SKIPPED
[INFO] Shaded version of Apache hbase client .............. SKIPPED
[INFO] Apache Atlas Titan 0.5.4 Graph DB Impl ............. SKIPPED
[INFO] Apache Atlas Graph Database Implementation Dependencies SKIPPED
[INFO] Shaded version of Apache hbase server .............. SKIPPED
[INFO] Apache Atlas Repository ............................ SKIPPED
[INFO] Apache Atlas Authorization ......................... SKIPPED
[INFO] Apache Atlas Business Catalog ...................... SKIPPED
[INFO] Apache Atlas UI .................................... SKIPPED
[INFO] Apache Atlas Web Application ....................... SKIPPED
[INFO] Apache Atlas Documentation ......................... SKIPPED
[INFO] Apache Atlas FileSystem Model ...................... SKIPPED
[INFO] Apache Atlas Plugin Classloader .................... SKIPPED
[INFO] Apache Atlas Hive Bridge Shim ...................... SKIPPED
[INFO] Apache Atlas Hive Bridge ........................... SKIPPED
[INFO] Apache Atlas Falcon Bridge Shim .................... SKIPPED
[INFO] Apache Atlas Falcon Bridge ......................... SKIPPED
[INFO] Apache Atlas Sqoop Bridge Shim ..................... SKIPPED
[INFO] Apache Atlas Sqoop Bridge .......................... SKIPPED
[INFO] Apache Atlas Storm Bridge Shim ..................... SKIPPED
[INFO] Apache Atlas Storm Bridge .......................... SKIPPED
[INFO] Apache Atlas Distribution .......................... SKIPPED
[INFO] ------------------------------------------------------------------------
[INFO] BUILD FAILURE
[INFO] ------------------------------------------------------------------------
[INFO] Total time: 01:03 min
[INFO] Finished at: 2017-08-17T07:24:56Z
[INFO] Final Memory: 119M/19742M
[INFO] ------------------------------------------------------------------------
[ERROR] PermGen space -> [Help 1]
[ERROR] 
[ERROR] To see the full stack trace of the errors, re-run Maven with the -e switch.
[ERROR] Re-run Maven using the -X switch to enable full debug logging.
[ERROR] 
[ERROR] For more information about the errors and possible solutions, please read the following
articles:
[ERROR] [Help 1] http://cwiki.apache.org/confluence/display/MAVEN/OutOfMemoryError
Build step 'Execute shell' marked build as failure
[CHECKSTYLE] Collecting checkstyle analysis files...
[CHECKSTYLE] Searching for all files in <https://builds.apache.org/job/Atlas-master-NoTests/ws/>
that match the pattern **/target/checkstyle-result.xml
[CHECKSTYLE] No files found. Configuration error?
<Git Blamer> Using GitBlamer to create author and commit information for all warnings.
<Git Blamer> GIT_COMMIT=56374ff7e3a6faa3e444db1ba3fa14905f356dc9, workspace=<https://builds.apache.org/job/Atlas-master-NoTests/ws/>
[CHECKSTYLE] Computing warning deltas based on reference build #14
[FINDBUGS] Collecting findbugs analysis files...
[FINDBUGS] Searching for all files in <https://builds.apache.org/job/Atlas-master-NoTests/ws/>
that match the pattern **/target/findbugs.xml
[FINDBUGS] No files found. Configuration error?
<Git Blamer> Using GitBlamer to create author and commit information for all warnings.
<Git Blamer> GIT_COMMIT=56374ff7e3a6faa3e444db1ba3fa14905f356dc9, workspace=<https://builds.apache.org/job/Atlas-master-NoTests/ws/>
[FINDBUGS] Computing warning deltas based on reference build #14
Archiving artifacts
[Fast Archiver] Compressed 546.49 MB of artifacts by 19.3% relative to #14
TestNG Reports Processing: START
Looking for TestNG results report in workspace using pattern: **/target/surefire-reports/testng-results.xml,**/target/failsafe-reports/testng-results.xml
Did not find any matching files.

Mime
View raw message