atlas-dev mailing list archives

Site index · List index
Message view « Date » · « Thread »
Top « Date » · « Thread »
From Apache Jenkins Server <jenk...@builds.apache.org>
Subject Build failed in Jenkins: apache-atlas-nightly #765
Date Fri, 02 Jun 2017 21:17:55 GMT
See <https://builds.apache.org/job/apache-atlas-nightly/765/display/redirect?page=changes>

Changes:

[ssubramanian] ATLAS-1857: Fix for unit test failure in jenkins

------------------------------------------
[...truncated 538.50 KB...]
127.0.0.1 - - [02/Jun/2017:21:14:33 +0000] "GET /api/atlas/entities/5dc842e2-140a-4e93-b695-da36e37315cc/traitDefinitions/PII_TraitVFdxdMiHAA
HTTP/1.1" 200 - "-" "Java/1.7.0_80"
127.0.0.1 - - [02/Jun/2017:21:14:33 +0000] "GET /api/atlas/entities/5dc842e2-140a-4e93-b695-da36e37315cc/traitDefinitions
HTTP/1.1" 200 - "-" "Java/1.7.0_80"
127.0.0.1 - - [02/Jun/2017:21:14:33 +0000] "POST /api/atlas/entities HTTP/1.1" 201 - "-" "Java/1.7.0_80"
127.0.0.1 - - [02/Jun/2017:21:14:33 +0000] "POST /api/atlas/entities HTTP/1.1" 201 - "-" "Java/1.7.0_80"
127.0.0.1 - - [02/Jun/2017:21:14:33 +0000] "GET /api/atlas/entities/7b7124cf-8878-489b-805d-97a71008edcd/traits
HTTP/1.1" 200 - "-" "Java/1.7.0_80"
127.0.0.1 - - [02/Jun/2017:21:14:33 +0000] "POST /api/atlas/entities HTTP/1.1" 201 - "-" "Java/1.7.0_80"
127.0.0.1 - - [02/Jun/2017:21:14:33 +0000] "POST /api/atlas/entities HTTP/1.1" 201 - "-" "Java/1.7.0_80"
127.0.0.1 - - [02/Jun/2017:21:14:33 +0000] "POST /api/atlas/entities/2db0b226-5d24-429e-9f10-273f215a9396
HTTP/1.1" 200 - "-" "Java/1.7.0_80"
127.0.0.1 - - [02/Jun/2017:21:14:33 +0000] "GET /api/atlas/entities/2db0b226-5d24-429e-9f10-273f215a9396
HTTP/1.1" 200 - "-" "Java/1.7.0_80"
127.0.0.1 - - [02/Jun/2017:21:14:33 +0000] "POST /api/atlas/entities/qualifiedName?type=hive_table&property=qualifiedName&value=tableCTkPByvZz2
HTTP/1.1" 200 - "-" "Java/1.7.0_80"
127.0.0.1 - - [02/Jun/2017:21:14:33 +0000] "GET /api/atlas/entities/2db0b226-5d24-429e-9f10-273f215a9396
HTTP/1.1" 200 - "-" "Java/1.7.0_80"
127.0.0.1 - - [02/Jun/2017:21:14:33 +0000] "POST /api/atlas/entities HTTP/1.1" 201 - "-" "Java/1.7.0_80"
127.0.0.1 - - [02/Jun/2017:21:14:33 +0000] "GET /api/atlas/entities/1ac22009-2c2e-47b6-ab85-e6a3915c67b6/audit?count=10
HTTP/1.1" 200 - "-" "Java/1.7.0_80"
127.0.0.1 - - [02/Jun/2017:21:14:33 +0000] "POST /api/atlas/entities HTTP/1.1" 201 - "-" "Java/1.7.0_80"
127.0.0.1 - - [02/Jun/2017:21:14:33 +0000] "POST /api/atlas/entities HTTP/1.1" 201 - "-" "Java/1.7.0_80"
127.0.0.1 - - [02/Jun/2017:21:14:33 +0000] "POST /api/atlas/entities HTTP/1.1" 201 - "-" "Java/1.7.0_80"
127.0.0.1 - - [02/Jun/2017:21:14:33 +0000] "POST /api/atlas/entities HTTP/1.1" 400 - "-" "Java/1.7.0_80"
127.0.0.1 - - [02/Jun/2017:21:14:33 +0000] "POST /api/atlas/entities HTTP/1.1" 201 - "-" "Java/1.7.0_80"
127.0.0.1 - - [02/Jun/2017:21:14:33 +0000] "GET /api/atlas/v2/types/typedef/name/dQLI6lqK7D
HTTP/1.1" 404 - "-" "Java/1.7.0_80"
127.0.0.1 - - [02/Jun/2017:21:14:33 +0000] "POST /api/atlas/types HTTP/1.1" 201 - "-" "Java/1.7.0_80"
127.0.0.1 - - [02/Jun/2017:21:14:33 +0000] "POST /api/atlas/entities HTTP/1.1" 201 - "-" "Java/1.7.0_80"
127.0.0.1 - - [02/Jun/2017:21:14:33 +0000] "GET /api/atlas/entities/49a28f03-1462-41ea-b9a1-c02c359853bb
HTTP/1.1" 200 - "-" "Java/1.7.0_80"
127.0.0.1 - - [02/Jun/2017:21:14:33 +0000] "GET /api/atlas/v2/entity/guid/0b0e8ce1-0455-4115-80b3-2a9efdd77188
HTTP/1.1" 200 - "-" "Java/1.7.0_80"
127.0.0.1 - - [02/Jun/2017:21:14:33 +0000] "POST /api/atlas/v2/entity/ HTTP/1.1" 200 - "-"
"Java/1.7.0_80"
127.0.0.1 - - [02/Jun/2017:21:14:34 +0000] "POST /api/atlas/v2/entity/guid/random/classifications
HTTP/1.1" 404 - "-" "Java/1.7.0_80"
127.0.0.1 - - [02/Jun/2017:21:14:34 +0000] "POST /api/atlas/v2/entity/bulk/ HTTP/1.1" 200
- "-" "Java/1.7.0_80"
127.0.0.1 - - [02/Jun/2017:21:14:34 +0000] "POST /api/atlas/v2/entity/ HTTP/1.1" 200 - "-"
"Java/1.7.0_80"
127.0.0.1 - - [02/Jun/2017:21:14:34 +0000] "POST /api/atlas/v2/entity/ HTTP/1.1" 200 - "-"
"Java/1.7.0_80"
127.0.0.1 - - [02/Jun/2017:21:14:34 +0000] "DELETE /api/atlas/v2/entity/bulk/?guid=1889a53a-a2d1-4b51-937a-a527b67ecc5c&guid=d03f09b0-fd6e-4514-89dd-840a5f043caf
HTTP/1.1" 200 - "-" "Java/1.7.0_80"
127.0.0.1 - - [02/Jun/2017:21:14:34 +0000] "POST /api/atlas/v2/entity/ HTTP/1.1" 200 - "-"
"Java/1.7.0_80"
127.0.0.1 - - [02/Jun/2017:21:14:34 +0000] "DELETE /api/atlas/v2/entity/uniqueAttribute/type/hive_db_v2?attr:name=dbyxYf4DBxnc%EB%B3%AD%E2%93%B1%E8%9A%BC%E8%86%92%EA%A9%96%E2%A2%9E%EE%BE%98%E9%AC%88%EF%B6%93%E3%B5%A0
HTTP/1.1" 200 - "-" "Java/1.7.0_80"
127.0.0.1 - - [02/Jun/2017:21:14:34 +0000] "DELETE /api/atlas/v2/entity/guid/random/classification/blah_trait
HTTP/1.1" 400 - "-" "Java/1.7.0_80"
127.0.0.1 - - [02/Jun/2017:21:14:34 +0000] "GET /api/atlas/discovery/search/dsl?query=hive_db_v2+where+name%3D'dbyxYf4DBxnc'&limit=10&offset=0
HTTP/1.1" 200 - "-" "Java/1.7.0_80"
127.0.0.1 - - [02/Jun/2017:21:15:35 +0000] "POST /api/atlas/v2/types/typedefs/ HTTP/1.1" 200
- "-" "Java/1.7.0_80"
127.0.0.1 - - [02/Jun/2017:21:15:35 +0000] "POST /api/atlas/v2/entity/ HTTP/1.1" 200 - "-"
"Java/1.7.0_80"
127.0.0.1 - - [02/Jun/2017:21:15:35 +0000] "PUT /api/atlas/v2/types/typedefs/ HTTP/1.1" 200
- "-" "Java/1.7.0_80"
127.0.0.1 - - [02/Jun/2017:21:15:35 +0000] "GET /api/atlas/v2/entity/guid/80b1d285-abc1-41f1-ba6e-9a764caeab82
HTTP/1.1" 200 - "-" "Java/1.7.0_80"
127.0.0.1 - - [02/Jun/2017:21:15:35 +0000] "POST /api/atlas/v2/entity/ HTTP/1.1" 404 - "-"
"Java/1.7.0_80"
127.0.0.1 - - [02/Jun/2017:21:15:35 +0000] "POST /api/atlas/v2/entity/ HTTP/1.1" 200 - "-"
"Java/1.7.0_80"
127.0.0.1 - - [02/Jun/2017:21:15:35 +0000] "POST /api/atlas/v2/entity/ HTTP/1.1" 200 - "-"
"Java/1.7.0_80"
127.0.0.1 - - [02/Jun/2017:21:15:35 +0000] "GET /api/atlas/v2/entity/uniqueAttribute/type/hive_db_v2?attr:name=dbyxYf4DBxnc
HTTP/1.1" 200 - "-" "Java/1.7.0_80"
127.0.0.1 - - [02/Jun/2017:21:15:35 +0000] "GET /api/atlas/v2/entity/guid/blah HTTP/1.1" 404
- "-" "Java/1.7.0_80"
127.0.0.1 - - [02/Jun/2017:21:15:35 +0000] "POST /api/atlas/v2/entity/ HTTP/1.1" 200 - "-"
"Java/1.7.0_80"
127.0.0.1 - - [02/Jun/2017:21:15:35 +0000] "GET /api/atlas/entities/6c3e81fe-50b1-4815-b028-2dab80efb746/audit?count=10
HTTP/1.1" 200 - "-" "Java/1.7.0_80"
127.0.0.1 - - [02/Jun/2017:21:15:35 +0000] "POST /api/atlas/v2/entity/ HTTP/1.1" 200 - "-"
"Java/1.7.0_80"
127.0.0.1 - - [02/Jun/2017:21:15:35 +0000] "POST /api/atlas/v2/entity/ HTTP/1.1" 200 - "-"
"Java/1.7.0_80"
127.0.0.1 - - [02/Jun/2017:21:15:35 +0000] "GET /api/atlas/v2/types/typedef/name/s0ucmppBqd
HTTP/1.1" 404 - "-" "Java/1.7.0_80"
127.0.0.1 - - [02/Jun/2017:21:15:35 +0000] "POST /api/atlas/v2/types/typedefs/ HTTP/1.1" 200
- "-" "Java/1.7.0_80"
127.0.0.1 - - [02/Jun/2017:21:15:35 +0000] "POST /api/atlas/v2/entity/ HTTP/1.1" 200 - "-"
"Java/1.7.0_80"
127.0.0.1 - - [02/Jun/2017:21:15:36 +0000] "GET /api/atlas/v2/entity/guid/46d2dde0-dc36-49e6-bb0b-3af62468bc5c
HTTP/1.1" 200 - "-" "Java/1.7.0_80"
127.0.0.1 - - [02/Jun/2017:21:15:36 +0000] "GET /api/atlas/discovery/search/dsl?query=from+hive_db_v1+name%3D%22dbPF8ZoA565V%22
HTTP/1.1" 200 - "-" "Java/1.7.0_80"
127.0.0.1 - - [02/Jun/2017:21:15:36 +0000] "GET /api/atlas/discovery/search/dsl?query=from+blah
HTTP/1.1" 400 - "-" "Java/1.7.0_80"
127.0.0.1 - - [02/Jun/2017:21:15:36 +0000] "GET /api/atlas/discovery/search?query=* HTTP/1.1"
200 - "-" "Java/1.7.0_80"
127.0.0.1 - - [02/Jun/2017:21:15:36 +0000] "GET /api/atlas/discovery/search?query=from+hive_db_v1+name%3D%22dbPF8ZoA565V%22
HTTP/1.1" 200 - "-" "Java/1.7.0_80"
127.0.0.1 - - [02/Jun/2017:21:15:37 +0000] "GET /api/atlas/discovery/search/gremlin?query=g.V.has('type',+'hive_table_v1').toList()
HTTP/1.1" 200 - "-" "Java/1.7.0_80"
127.0.0.1 - - [02/Jun/2017:21:15:38 +0000] "POST /api/atlas/v2/types/typedefs/ HTTP/1.1" 200
- "-" "Java/1.7.0_80"
127.0.0.1 - - [02/Jun/2017:21:15:39 +0000] "POST /api/atlas/v2/types/typedefs/ HTTP/1.1" 409
- "-" "Java/1.7.0_80"
127.0.0.1 - - [02/Jun/2017:21:15:39 +0000] "GET /api/atlas/v2/types/enumdef/name/blah HTTP/1.1"
404 - "-" "Java/1.7.0_80"
127.0.0.1 - - [02/Jun/2017:21:15:39 +0000] "GET /api/atlas/v2/types/enumdef/guid/blah HTTP/1.1"
404 - "-" "Java/1.7.0_80"
127.0.0.1 - - [02/Jun/2017:21:15:39 +0000] "GET /api/atlas/v2/types/structdef/name/blah HTTP/1.1"
404 - "-" "Java/1.7.0_80"
127.0.0.1 - - [02/Jun/2017:21:15:39 +0000] "GET /api/atlas/v2/types/structdef/guid/blah HTTP/1.1"
404 - "-" "Java/1.7.0_80"
127.0.0.1 - - [02/Jun/2017:21:15:39 +0000] "GET /api/atlas/v2/types/classificationdef/name/blah
HTTP/1.1" 404 - "-" "Java/1.7.0_80"
127.0.0.1 - - [02/Jun/2017:21:15:39 +0000] "GET /api/atlas/v2/types/classificationdef/guid/blah
HTTP/1.1" 404 - "-" "Java/1.7.0_80"
127.0.0.1 - - [02/Jun/2017:21:15:39 +0000] "GET /api/atlas/v2/types/entitydef/name/blah HTTP/1.1"
404 - "-" "Java/1.7.0_80"
127.0.0.1 - - [02/Jun/2017:21:15:39 +0000] "GET /api/atlas/v2/types/entitydef/guid/blah HTTP/1.1"
404 - "-" "Java/1.7.0_80"
127.0.0.1 - - [02/Jun/2017:21:15:39 +0000] "POST /api/atlas/v2/types/typedefs/ HTTP/1.1" 200
- "-" "Java/1.7.0_80"
127.0.0.1 - - [02/Jun/2017:21:15:39 +0000] "GET /api/atlas/v2/types/typedefs/?supertype=AvJo4E8qgIz&type=CLASS
HTTP/1.1" 200 - "-" "Java/1.7.0_80"
127.0.0.1 - - [02/Jun/2017:21:15:39 +0000] "GET /api/atlas/v2/types/typedefs/?notsupertype=BgDHIJzOYPn&supertype=AvJo4E8qgIz&type=CLASS
HTTP/1.1" 200 - "-" "Java/1.7.0_80"
127.0.0.1 - - [02/Jun/2017:21:15:39 +0000] "POST /api/atlas/v2/types/typedefs/ HTTP/1.1" 200
- "-" "Java/1.7.0_80"
127.0.0.1 - - [02/Jun/2017:21:15:39 +0000] "PUT /api/atlas/v2/types/typedefs/ HTTP/1.1" 200
- "-" "Java/1.7.0_80"
127.0.0.1 - - [02/Jun/2017:21:15:39 +0000] "GET /api/atlas/v2/types/typedefs/?type=ENTITY
HTTP/1.1" 200 - "-" "Java/1.7.0_80"
127.0.0.1 - - [02/Jun/2017:21:15:39 +0000] "POST /api/atlas/types HTTP/1.1" 201 - "-" "Java/1.7.0_80"
127.0.0.1 - - [02/Jun/2017:21:15:39 +0000] "POST /api/atlas/types HTTP/1.1" 409 - "-" "Java/1.7.0_80"
127.0.0.1 - - [02/Jun/2017:21:15:39 +0000] "GET /api/atlas/types/blah HTTP/1.1" 404 - "-"
"Java/1.7.0_80"
127.0.0.1 - - [02/Jun/2017:21:15:39 +0000] "GET /api/atlas/v2/types/typedef/name/class_trait
HTTP/1.1" 404 - "-" "Java/1.7.0_80"
127.0.0.1 - - [02/Jun/2017:21:15:39 +0000] "POST /api/atlas/types HTTP/1.1" 201 - "-" "Java/1.7.0_80"
127.0.0.1 - - [02/Jun/2017:21:15:40 +0000] "GET /api/atlas/v2/types/typedef/name/secure_trait
HTTP/1.1" 404 - "-" "Java/1.7.0_80"
127.0.0.1 - - [02/Jun/2017:21:15:40 +0000] "POST /api/atlas/types HTTP/1.1" 201 - "-" "Java/1.7.0_80"
127.0.0.1 - - [02/Jun/2017:21:15:40 +0000] "GET /api/atlas/v2/types/typedef/name/pii_trait
HTTP/1.1" 404 - "-" "Java/1.7.0_80"
127.0.0.1 - - [02/Jun/2017:21:15:40 +0000] "POST /api/atlas/types HTTP/1.1" 201 - "-" "Java/1.7.0_80"
127.0.0.1 - - [02/Jun/2017:21:15:40 +0000] "GET /api/atlas/v2/types/typedef/name/ssn_trait
HTTP/1.1" 404 - "-" "Java/1.7.0_80"
127.0.0.1 - - [02/Jun/2017:21:15:40 +0000] "POST /api/atlas/types HTTP/1.1" 201 - "-" "Java/1.7.0_80"
127.0.0.1 - - [02/Jun/2017:21:15:40 +0000] "GET /api/atlas/v2/types/typedef/name/salary_trait
HTTP/1.1" 404 - "-" "Java/1.7.0_80"
127.0.0.1 - - [02/Jun/2017:21:15:40 +0000] "POST /api/atlas/types HTTP/1.1" 201 - "-" "Java/1.7.0_80"
127.0.0.1 - - [02/Jun/2017:21:15:40 +0000] "GET /api/atlas/v2/types/typedef/name/sox_trait
HTTP/1.1" 404 - "-" "Java/1.7.0_80"
127.0.0.1 - - [02/Jun/2017:21:15:40 +0000] "POST /api/atlas/types HTTP/1.1" 201 - "-" "Java/1.7.0_80"
127.0.0.1 - - [02/Jun/2017:21:15:40 +0000] "GET /api/atlas/types?type=TRAIT HTTP/1.1" 200
- "-" "Java/1.7.0_80"
127.0.0.1 - - [02/Jun/2017:21:15:40 +0000] "GET /api/atlas/v2/types/typedef/name/ADBl9ZCHHap
HTTP/1.1" 404 - "-" "Java/1.7.0_80"
127.0.0.1 - - [02/Jun/2017:21:15:40 +0000] "POST /api/atlas/types HTTP/1.1" 201 - "-" "Java/1.7.0_80"
127.0.0.1 - - [02/Jun/2017:21:15:40 +0000] "GET /api/atlas/v2/types/typedef/name/A1L83xgw94Ms
HTTP/1.1" 404 - "-" "Java/1.7.0_80"
127.0.0.1 - - [02/Jun/2017:21:15:40 +0000] "POST /api/atlas/types HTTP/1.1" 201 - "-" "Java/1.7.0_80"
127.0.0.1 - - [02/Jun/2017:21:15:40 +0000] "GET /api/atlas/v2/types/typedef/name/BiMDqCSzwXf
HTTP/1.1" 404 - "-" "Java/1.7.0_80"
127.0.0.1 - - [02/Jun/2017:21:15:40 +0000] "POST /api/atlas/types HTTP/1.1" 201 - "-" "Java/1.7.0_80"
127.0.0.1 - - [02/Jun/2017:21:15:41 +0000] "GET /api/atlas/v2/types/typedef/name/ClEMdtG8wm1
HTTP/1.1" 404 - "-" "Java/1.7.0_80"
127.0.0.1 - - [02/Jun/2017:21:15:41 +0000] "POST /api/atlas/types HTTP/1.1" 201 - "-" "Java/1.7.0_80"
127.0.0.1 - - [02/Jun/2017:21:15:41 +0000] "GET /api/atlas/types?type=CLASS&supertype=ADBl9ZCHHap&notsupertype=BiMDqCSzwXf
HTTP/1.1" 200 - "-" "Java/1.7.0_80"
127.0.0.1 - - [02/Jun/2017:21:15:41 +0000] "POST /api/atlas/types HTTP/1.1" 201 - "-" "Java/1.7.0_80"
127.0.0.1 - - [02/Jun/2017:21:15:41 +0000] "PUT /api/atlas/types HTTP/1.1" 200 - "-" "Java/1.7.0_80"
127.0.0.1 - - [02/Jun/2017:21:15:41 +0000] "GET /api/atlas/types/hhAEuHdXn9 HTTP/1.1" 200
- "-" "Java/1.7.0_80"
Tests run: 134, Failures: 2, Errors: 0, Skipped: 5, Time elapsed: 186.848 sec <<<
FAILURE! - in TestSuite
runQuickStart(org.apache.atlas.examples.QuickStartV2IT)  Time elapsed: 0.717 sec  <<<
FAILURE!
org.apache.atlas.AtlasServiceException: Metadata service API org.apache.atlas.AtlasBaseClient$APIInfo@1c64340d
failed with status 409 (Conflict) Response Body ({"errorCode":"ATLAS-409-00-001","errorMessage":"Given
type Dimension already exists"})
	at org.apache.atlas.examples.QuickStartV2IT.runQuickStart(QuickStartV2IT.java:49)

testEntityDeduping(org.apache.atlas.web.integration.EntityV2JerseyResourceIT)  Time elapsed:
60.821 sec  <<< FAILURE!
java.lang.Exception: Waiting timed out after 60000 msec
	at org.apache.atlas.web.integration.EntityV2JerseyResourceIT.testEntityDeduping(EntityV2JerseyResourceIT.java:170)


Results :

Failed tests: 
  QuickStartV2IT.runQuickStart:49 » AtlasService Metadata service API org.apache...
  EntityV2JerseyResourceIT.testEntityDeduping:170->BaseResourceIT.waitForNotification:633->BaseResourceIT.waitFor:625
» 

Tests run: 134, Failures: 2, Errors: 0, Skipped: 5

[INFO] 
[INFO] --- jetty-maven-plugin:9.2.12.v20150709:stop (stop-jetty) @ atlas-webapp ---
[INFO] Waiting 10 seconds for jetty to stop
[INFO] Stopped ServerConnector@5d5dbe36{HTTP/1.1}{0.0.0.0:31000}
[INFO] Closing Spring root WebApplicationContext
[INFO] Shutting down log4j
[INFO] Stopped o.e.j.m.p.JettyWebAppContext@124b88c1{/,<https://builds.apache.org/job/apache-atlas-nightly/ws/webapp/target/atlas-webapp-0.9-incubating-SNAPSHOT/,UNAVAILABLE}{/home/jenkins/jenkins-slave/workspace/apache-atlas-nightly/webapp/target/atlas-webapp-0.9-incubating-SNAPSHOT.war}>
[INFO] Server reports itself as stopped
[INFO] 
[INFO] --- maven-source-plugin:2.4:jar-no-fork (attach-sources) @ atlas-webapp ---
[INFO] Building jar: <https://builds.apache.org/job/apache-atlas-nightly/ws/webapp/target/atlas-webapp-0.9-incubating-SNAPSHOT-sources.jar>
log4j:WARN No appenders could be found for logger (org.apache.zookeeper.ClientCnxn).
log4j:WARN Please initialize the log4j system properly.
log4j:WARN See http://logging.apache.org/log4j/1.2/faq.html#noconfig for more info.
[INFO] 
[INFO] --- maven-source-plugin:2.4:test-jar-no-fork (attach-sources) @ atlas-webapp ---
[INFO] Building jar: <https://builds.apache.org/job/apache-atlas-nightly/ws/webapp/target/atlas-webapp-0.9-incubating-SNAPSHOT-test-sources.jar>
[INFO] 
[INFO] --- maven-failsafe-plugin:2.19.1:verify (verify) @ atlas-webapp ---
[INFO] ------------------------------------------------------------------------
[INFO] Reactor Summary:
[INFO] 
[INFO] Apache Atlas Server Build Tools .................... SUCCESS [  0.955 s]
[INFO] apache-atlas ....................................... SUCCESS [  7.845 s]
[INFO] Apache Atlas Integration ........................... SUCCESS [ 36.367 s]
[INFO] Apache Atlas Common ................................ SUCCESS [ 17.194 s]
[INFO] Apache Atlas Typesystem ............................ SUCCESS [01:12 min]
[INFO] Apache Atlas Client ................................ SUCCESS [ 21.585 s]
[INFO] Apache Atlas Server API ............................ SUCCESS [ 10.748 s]
[INFO] Apache Atlas Notification .......................... SUCCESS [ 24.034 s]
[INFO] Apache Atlas Graph Database Projects ............... SUCCESS [  0.745 s]
[INFO] Apache Atlas Graph Database API .................... SUCCESS [  8.385 s]
[INFO] Graph Database Common Code ......................... SUCCESS [  8.360 s]
[INFO] Apache Atlas Titan 1.0.0 GraphDB Impl .............. SUCCESS [ 37.411 s]
[INFO] Shaded version of Apache hbase client .............. SUCCESS [ 10.226 s]
[INFO] Apache Atlas Titan 0.5.4 Graph DB Impl ............. SUCCESS [01:30 min]
[INFO] Apache Atlas Graph Database Implementation Dependencies SUCCESS [  0.872 s]
[INFO] Shaded version of Apache hbase server .............. SUCCESS [ 26.492 s]
[INFO] Apache Atlas Repository ............................ SUCCESS [06:44 min]
[INFO] Apache Atlas Authorization ......................... SUCCESS [ 13.632 s]
[INFO] Apache Atlas Business Catalog ...................... SUCCESS [ 19.920 s]
[INFO] Apache Atlas UI .................................... SUCCESS [ 58.755 s]
[INFO] Apache Atlas Web Application ....................... FAILURE [08:14 min]
[INFO] Apache Atlas Documentation ......................... SKIPPED
[INFO] Apache Atlas FileSystem Model ...................... SKIPPED
[INFO] Apache Atlas Plugin Classloader .................... SKIPPED
[INFO] Apache Atlas Hive Bridge Shim ...................... SKIPPED
[INFO] Apache Atlas Hive Bridge ........................... SKIPPED
[INFO] Apache Atlas Falcon Bridge Shim .................... SKIPPED
[INFO] Apache Atlas Falcon Bridge ......................... SKIPPED
[INFO] Apache Atlas Sqoop Bridge Shim ..................... SKIPPED
[INFO] Apache Atlas Sqoop Bridge .......................... SKIPPED
[INFO] Apache Atlas Storm Bridge Shim ..................... SKIPPED
[INFO] Apache Atlas Storm Bridge .......................... SKIPPED
[INFO] Apache Atlas Distribution .......................... SKIPPED
[INFO] ------------------------------------------------------------------------
[INFO] BUILD FAILURE
[INFO] ------------------------------------------------------------------------
[INFO] Total time: 22:48 min
[INFO] Finished at: 2017-06-02T21:15:49Z
[INFO] Final Memory: 357M/1235M
[INFO] ------------------------------------------------------------------------
[ERROR] Failed to execute goal org.apache.maven.plugins:maven-failsafe-plugin:2.19.1:verify
(verify) on project atlas-webapp: There are test failures.
[ERROR] 
[ERROR] Please refer to <https://builds.apache.org/job/apache-atlas-nightly/ws/webapp/target/failsafe-reports>
for the individual test results.
[ERROR] -> [Help 1]
[ERROR] 
[ERROR] To see the full stack trace of the errors, re-run Maven with the -e switch.
[ERROR] Re-run Maven using the -X switch to enable full debug logging.
[ERROR] 
[ERROR] For more information about the errors and possible solutions, please read the following
articles:
[ERROR] [Help 1] http://cwiki.apache.org/confluence/display/MAVEN/MojoFailureException
[ERROR] 
[ERROR] After correcting the problems, you can resume the build with the command
[ERROR]   mvn <goals> -rf :atlas-webapp
Build step 'Execute shell' marked build as failure
[CHECKSTYLE] Collecting checkstyle analysis files...
[CHECKSTYLE] Searching for all files in <https://builds.apache.org/job/apache-atlas-nightly/ws/>
that match the pattern **/target/checkstyle-result.xml
[CHECKSTYLE] Parsing 19 files in <https://builds.apache.org/job/apache-atlas-nightly/ws/>
[CHECKSTYLE] Successfully parsed file <https://builds.apache.org/job/apache-atlas-nightly/ws/authorization/target/checkstyle-result.xml>
with 465 unique warnings and 0 duplicates.
[CHECKSTYLE] Successfully parsed file <https://builds.apache.org/job/apache-atlas-nightly/ws/catalog/target/checkstyle-result.xml>
with 2610 unique warnings and 0 duplicates.
[CHECKSTYLE] Successfully parsed file <https://builds.apache.org/job/apache-atlas-nightly/ws/client/target/checkstyle-result.xml>
with 4184 unique warnings and 0 duplicates.
[CHECKSTYLE] Successfully parsed file <https://builds.apache.org/job/apache-atlas-nightly/ws/common/target/checkstyle-result.xml>
with 5381 unique warnings and 0 duplicates.
[CHECKSTYLE] Successfully parsed file <https://builds.apache.org/job/apache-atlas-nightly/ws/dashboardv2/target/checkstyle-result.xml>
with 5381 unique warnings and 0 duplicates.
[CHECKSTYLE] Successfully parsed file <https://builds.apache.org/job/apache-atlas-nightly/ws/graphdb/api/target/checkstyle-result.xml>
with 5629 unique warnings and 0 duplicates.
[CHECKSTYLE] Successfully parsed file <https://builds.apache.org/job/apache-atlas-nightly/ws/graphdb/common/target/checkstyle-result.xml>
with 5795 unique warnings and 0 duplicates.
[CHECKSTYLE] Successfully parsed file <https://builds.apache.org/job/apache-atlas-nightly/ws/graphdb/graphdb-impls/target/checkstyle-result.xml>
with 5795 unique warnings and 0 duplicates.
[CHECKSTYLE] Successfully parsed file <https://builds.apache.org/job/apache-atlas-nightly/ws/graphdb/target/checkstyle-result.xml>
with 5795 unique warnings and 0 duplicates.
[CHECKSTYLE] Successfully parsed file <https://builds.apache.org/job/apache-atlas-nightly/ws/graphdb/titan0/target/checkstyle-result.xml>
with 8025 unique warnings and 0 duplicates.
[CHECKSTYLE] Successfully parsed file <https://builds.apache.org/job/apache-atlas-nightly/ws/graphdb/titan1/target/checkstyle-result.xml>
with 8938 unique warnings and 0 duplicates.
[CHECKSTYLE] Successfully parsed file <https://builds.apache.org/job/apache-atlas-nightly/ws/intg/target/checkstyle-result.xml>
with 14950 unique warnings and 0 duplicates.
[CHECKSTYLE] Successfully parsed file <https://builds.apache.org/job/apache-atlas-nightly/ws/notification/target/checkstyle-result.xml>
with 16131 unique warnings and 0 duplicates.
[CHECKSTYLE] Successfully parsed file <https://builds.apache.org/job/apache-atlas-nightly/ws/repository/target/checkstyle-result.xml>
with 32453 unique warnings and 0 duplicates.
[CHECKSTYLE] Successfully parsed file <https://builds.apache.org/job/apache-atlas-nightly/ws/server-api/target/checkstyle-result.xml>
with 32832 unique warnings and 0 duplicates.
[CHECKSTYLE] Successfully parsed file <https://builds.apache.org/job/apache-atlas-nightly/ws/shaded/hbase-client-shaded/target/checkstyle-result.xml>
with 32832 unique warnings and 0 duplicates.
[CHECKSTYLE] Successfully parsed file <https://builds.apache.org/job/apache-atlas-nightly/ws/shaded/hbase-server-shaded/target/checkstyle-result.xml>
with 32832 unique warnings and 0 duplicates.
[CHECKSTYLE] Successfully parsed file <https://builds.apache.org/job/apache-atlas-nightly/ws/target/checkstyle-result.xml>
with 32832 unique warnings and 0 duplicates.
[CHECKSTYLE] Successfully parsed file <https://builds.apache.org/job/apache-atlas-nightly/ws/typesystem/target/checkstyle-result.xml>
with 37049 unique warnings and 0 duplicates.
[CHECKSTYLE] Computing warning deltas based on reference build #711
[FINDBUGS] Collecting findbugs analysis files...
[FINDBUGS] Searching for all files in <https://builds.apache.org/job/apache-atlas-nightly/ws/>
that match the pattern **/target/findbugs.xml
[FINDBUGS] Parsing 12 files in <https://builds.apache.org/job/apache-atlas-nightly/ws/>
[FINDBUGS] Successfully parsed file <https://builds.apache.org/job/apache-atlas-nightly/ws/authorization/target/findbugs.xml>
with 0 unique warnings and 0 duplicates.
[FINDBUGS] Successfully parsed file <https://builds.apache.org/job/apache-atlas-nightly/ws/catalog/target/findbugs.xml>
with 0 unique warnings and 0 duplicates.
[FINDBUGS] Successfully parsed file <https://builds.apache.org/job/apache-atlas-nightly/ws/client/target/findbugs.xml>
with 0 unique warnings and 0 duplicates.
[FINDBUGS] Successfully parsed file <https://builds.apache.org/job/apache-atlas-nightly/ws/common/target/findbugs.xml>
with 0 unique warnings and 0 duplicates.
[FINDBUGS] Successfully parsed file <https://builds.apache.org/job/apache-atlas-nightly/ws/graphdb/api/target/findbugs.xml>
with 0 unique warnings and 0 duplicates.
[FINDBUGS] Successfully parsed file <https://builds.apache.org/job/apache-atlas-nightly/ws/graphdb/common/target/findbugs.xml>
with 0 unique warnings and 0 duplicates.
[FINDBUGS] Successfully parsed file <https://builds.apache.org/job/apache-atlas-nightly/ws/graphdb/titan0/target/findbugs.xml>
with 0 unique warnings and 0 duplicates.
[FINDBUGS] Successfully parsed file <https://builds.apache.org/job/apache-atlas-nightly/ws/intg/target/findbugs.xml>
with 0 unique warnings and 0 duplicates.
[FINDBUGS] Successfully parsed file <https://builds.apache.org/job/apache-atlas-nightly/ws/notification/target/findbugs.xml>
with 0 unique warnings and 0 duplicates.
[FINDBUGS] Successfully parsed file <https://builds.apache.org/job/apache-atlas-nightly/ws/repository/target/findbugs.xml>
with 0 unique warnings and 0 duplicates.
[FINDBUGS] Successfully parsed file <https://builds.apache.org/job/apache-atlas-nightly/ws/server-api/target/findbugs.xml>
with 0 unique warnings and 0 duplicates.
[FINDBUGS] Successfully parsed file <https://builds.apache.org/job/apache-atlas-nightly/ws/typesystem/target/findbugs.xml>
with 0 unique warnings and 0 duplicates.
[FINDBUGS] Computing warning deltas based on reference build #711
Archiving artifacts
TestNG Reports Processing: START
Looking for TestNG results report in workspace using pattern: **/target/surefire-reports/testng-results.xml,**/target/failsafe-reports/testng-results.xml
Saving reports...
Processing '/x1/jenkins/jenkins-home/jobs/apache-atlas-nightly/builds/765/testng/testng-results-1.xml'
Processing '/x1/jenkins/jenkins-home/jobs/apache-atlas-nightly/builds/765/testng/testng-results-10.xml'
Processing '/x1/jenkins/jenkins-home/jobs/apache-atlas-nightly/builds/765/testng/testng-results-2.xml'
Processing '/x1/jenkins/jenkins-home/jobs/apache-atlas-nightly/builds/765/testng/testng-results-3.xml'
Processing '/x1/jenkins/jenkins-home/jobs/apache-atlas-nightly/builds/765/testng/testng-results-4.xml'
Processing '/x1/jenkins/jenkins-home/jobs/apache-atlas-nightly/builds/765/testng/testng-results-5.xml'
Processing '/x1/jenkins/jenkins-home/jobs/apache-atlas-nightly/builds/765/testng/testng-results-6.xml'
Processing '/x1/jenkins/jenkins-home/jobs/apache-atlas-nightly/builds/765/testng/testng-results-7.xml'
Processing '/x1/jenkins/jenkins-home/jobs/apache-atlas-nightly/builds/765/testng/testng-results-8.xml'
Processing '/x1/jenkins/jenkins-home/jobs/apache-atlas-nightly/builds/765/testng/testng-results-9.xml'
Processing '/x1/jenkins/jenkins-home/jobs/apache-atlas-nightly/builds/765/testng/testng-results.xml'
0.188324% of tests failed, which exceeded threshold of 0%. Marking build as UNSTABLE
TestNG Reports Processing: FINISH

Mime
View raw message