atlas-dev mailing list archives

Site index · List index
Message view « Date » · « Thread »
Top « Date » · « Thread »
From Apache Jenkins Server <jenk...@builds.apache.org>
Subject Build failed in Jenkins: apache-atlas-nightly #763
Date Fri, 02 Jun 2017 18:33:28 GMT
See <https://builds.apache.org/job/apache-atlas-nightly/763/display/redirect>

------------------------------------------
[...truncated 273.53 KB...]
[WARNING] <https://builds.apache.org/job/apache-atlas-nightly/ws/repository/src/test/java/org/apache/atlas/repository/typestore/StoreBackedTypeCacheTest.java>:
Some input files use unchecked or unsafe operations.
[WARNING] <https://builds.apache.org/job/apache-atlas-nightly/ws/repository/src/test/java/org/apache/atlas/repository/typestore/StoreBackedTypeCacheTest.java>:
Recompile with -Xlint:unchecked for details.
[INFO] 
[INFO] --- maven-surefire-plugin:2.18.1:test (default-test) @ atlas-repository ---
[INFO] Surefire report directory: <https://builds.apache.org/job/apache-atlas-nightly/ws/repository/target/surefire-reports>
[INFO] Using configured provider org.apache.maven.surefire.testng.TestNGProvider
[WARNING] file.encoding cannot be set as system property, use <argLine>-Dfile.encoding=...<argLine>
instead

-------------------------------------------------------
 T E S T S
-------------------------------------------------------
Running org.apache.atlas.repository.graph.GraphBackedRepositoryHardDeleteTest
Running org.apache.atlas.repository.graph.TestIntSequence
Running org.apache.atlas.repository.typestore.GraphBackedTypeStoreTest
Running org.apache.atlas.service.StoreBackedTypeCacheMetadataServiceTest
Running org.apache.atlas.repository.graph.GraphBackedSearchIndexerTest
Running org.apache.atlas.discovery.DataSetLineageServiceTest
Running org.apache.atlas.repository.graph.ReverseReferenceUpdateSoftDeleteTest
Running org.apache.atlas.repository.graph.GraphBackedSearchIndexerMockTest
Running org.apache.atlas.repository.graph.GraphHelperMockTest
Running org.apache.atlas.repository.impexp.ImportTransformerTest
Running org.apache.atlas.discovery.GraphBackedDiscoveryServiceTest
Running org.apache.atlas.repository.impexp.ImportServiceTest
Running org.apache.atlas.repository.store.graph.v1.SoftDeleteHandlerV1Test
Running org.apache.atlas.repository.graph.GraphHelperTest
Running org.apache.atlas.repository.impexp.ZipSourceTest
Running org.apache.atlas.repository.graph.GraphBackedMetadataRepositoryTest
Running org.apache.atlas.repository.impexp.ImportTransformsTest
Running org.apache.atlas.BaseRepositoryTest
Running org.apache.atlas.repository.impexp.AtlasImportRequestTest
Running org.apache.atlas.repository.graph.ReverseReferenceUpdateHardDeleteTest
Running org.apache.atlas.repository.impexp.ImportTransformerJSONTest
Running org.apache.atlas.repository.graph.AbstractGremlinQueryOptimizerTest
Running org.apache.atlas.repository.graph.Gremlin2QueryOptimizerTest
Running org.apache.atlas.repository.graph.Gremlin3QueryOptimizerTest
Running org.apache.atlas.repository.typestore.StoreBackedTypeCacheTest
Running org.apache.atlas.repository.store.graph.AtlasTypeDefGraphStoreTest
Running org.apache.atlas.repository.graph.GraphRepoMapperScaleTest
Running org.apache.atlas.repository.store.graph.AtlasEntityDefStoreV1Test
Running org.apache.atlas.repository.graph.GraphBackedRepositorySoftDeleteTest
Running org.apache.atlas.service.DefaultMetadataServiceTest
Running org.apache.atlas.repository.impexp.ExportServiceTest
Running org.apache.atlas.repository.impexp.ZipSinkTest
Tests run: 0, Failures: 0, Errors: 0, Skipped: 0, Time elapsed: 32.473 sec - in org.apache.atlas.repository.graph.TestIntSequence
Running org.apache.atlas.repository.store.graph.v1.AtlasDeleteHandlerV1Test
Tests run: 4, Failures: 0, Errors: 0, Skipped: 0, Time elapsed: 33.725 sec - in org.apache.atlas.repository.impexp.AtlasImportRequestTest
Tests run: 5, Failures: 0, Errors: 0, Skipped: 0, Time elapsed: 33.639 sec - in org.apache.atlas.repository.impexp.ZipSinkTest
Tests run: 3, Failures: 0, Errors: 0, Skipped: 0, Time elapsed: 35.729 sec - in org.apache.atlas.repository.impexp.ImportTransformsTest
Tests run: 33, Failures: 0, Errors: 0, Skipped: 0, Time elapsed: 35.519 sec - in org.apache.atlas.repository.graph.Gremlin3QueryOptimizerTest
Running org.apache.atlas.repository.store.graph.v1.InverseReferenceUpdateHardDeleteV1Test
Running org.apache.atlas.repository.store.graph.v1.InverseReferenceUpdateSoftDeleteV1Test
Tests run: 1, Failures: 0, Errors: 0, Skipped: 0, Time elapsed: 36.279 sec - in org.apache.atlas.repository.impexp.ImportTransformerJSONTest
Tests run: 0, Failures: 0, Errors: 0, Skipped: 0, Time elapsed: 36.392 sec - in org.apache.atlas.repository.graph.AbstractGremlinQueryOptimizerTest
Tests run: 0, Failures: 0, Errors: 0, Skipped: 0, Time elapsed: 36.638 sec - in org.apache.atlas.BaseRepositoryTest
Tests run: 8, Failures: 0, Errors: 0, Skipped: 0, Time elapsed: 37.925 sec - in org.apache.atlas.repository.impexp.ImportTransformerTest
Running org.apache.atlas.repository.store.graph.v1.InverseReferenceUpdateV1Test
Running org.apache.atlas.repository.store.graph.v1.HardDeleteHandlerV1Test
Tests run: 3, Failures: 0, Errors: 0, Skipped: 0, Time elapsed: 38.338 sec - in org.apache.atlas.repository.graph.GraphBackedSearchIndexerMockTest
Running org.apache.atlas.repository.store.graph.v1.AtlasEntityStoreV1Test
Running org.apache.atlas.repository.BaseTest
Running org.apache.atlas.repository.audit.InMemoryAuditRepositoryTest
Tests run: 2, Failures: 0, Errors: 0, Skipped: 0, Time elapsed: 39.076 sec - in org.apache.atlas.repository.graph.GraphHelperMockTest
Running org.apache.atlas.repository.audit.HBaseBasedAuditRepositoryHATest
Running org.apache.atlas.lineage.EntityLineageServiceTest
Tests run: 4, Failures: 0, Errors: 0, Skipped: 0, Time elapsed: 40.36 sec - in org.apache.atlas.repository.impexp.ZipSourceTest
Running org.apache.atlas.repository.audit.HBaseBasedAuditRepositoryTest
Tests run: 33, Failures: 0, Errors: 0, Skipped: 0, Time elapsed: 39.909 sec - in org.apache.atlas.repository.graph.Gremlin2QueryOptimizerTest
Running org.apache.atlas.TestModules
Running org.apache.atlas.RepositoryServiceLoadingTest
Tests run: 0, Failures: 0, Errors: 0, Skipped: 0, Time elapsed: 44.805 sec - in org.apache.atlas.discovery.DataSetLineageServiceTest
Running org.apache.atlas.util.CompiledQueryCacheKeyTest
Tests run: 5, Failures: 0, Errors: 0, Skipped: 0, Time elapsed: 47.904 sec - in org.apache.atlas.repository.graph.GraphBackedSearchIndexerTest
Running org.apache.atlas.services.MetricsServiceTest
Tests run: 5, Failures: 0, Errors: 0, Skipped: 0, Time elapsed: 53.722 sec - in org.apache.atlas.repository.typestore.GraphBackedTypeStoreTest
Tests run: 1, Failures: 0, Errors: 0, Skipped: 0, Time elapsed: 52.473 sec - in org.apache.atlas.repository.store.graph.AtlasEntityDefStoreV1Test
Running org.apache.atlas.query.QueryProcessorTest
Running org.apache.atlas.services.EntityDiscoveryServiceTest
Tests run: 2, Failures: 0, Errors: 0, Skipped: 0, Time elapsed: 60.786 sec - in org.apache.atlas.repository.typestore.StoreBackedTypeCacheTest
Tests run: 5, Failures: 0, Errors: 0, Skipped: 0, Time elapsed: 62.383 sec - in org.apache.atlas.repository.graph.ReverseReferenceUpdateHardDeleteTest
Running org.apache.atlas.query.ExpressionTest
Tests run: 5, Failures: 0, Errors: 0, Skipped: 0, Time elapsed: 64.053 sec - in org.apache.atlas.repository.graph.ReverseReferenceUpdateSoftDeleteTest
Tests run: 0, Failures: 0, Errors: 0, Skipped: 0, Time elapsed: 30.474 sec - in org.apache.atlas.repository.store.graph.v1.AtlasDeleteHandlerV1Test
Running org.apache.atlas.query.BaseGremlinTest
Running org.apache.atlas.query.LexerTest
Running org.apache.atlas.query.LineageQueryTest
Tests run: 14, Failures: 0, Errors: 0, Skipped: 0, Time elapsed: 71.909 sec - in org.apache.atlas.repository.graph.GraphHelperTest
Tests run: 3, Failures: 0, Errors: 0, Skipped: 0, Time elapsed: 73.628 sec - in org.apache.atlas.service.StoreBackedTypeCacheMetadataServiceTest
Running org.apache.atlas.query.GremlinTest
Tests run: 3, Failures: 0, Errors: 0, Skipped: 0, Time elapsed: 36.252 sec - in org.apache.atlas.repository.audit.InMemoryAuditRepositoryTest
Running org.apache.atlas.query.ParserTest
Tests run: 0, Failures: 0, Errors: 0, Skipped: 0, Time elapsed: 36.646 sec - in org.apache.atlas.repository.BaseTest
Tests run: 0, Failures: 0, Errors: 0, Skipped: 0, Time elapsed: 38.401 sec - in org.apache.atlas.repository.store.graph.v1.InverseReferenceUpdateV1Test
Running org.apache.atlas.TestUtils
Tests run: 0, Failures: 0, Errors: 0, Skipped: 0, Time elapsed: 37.365 sec - in org.apache.atlas.TestModules
Tests run: 2, Failures: 0, Errors: 0, Skipped: 0, Time elapsed: 40.666 sec - in org.apache.atlas.repository.audit.HBaseBasedAuditRepositoryHATest
Tests run: 5, Failures: 0, Errors: 0, Skipped: 0, Time elapsed: 39.462 sec - in org.apache.atlas.util.CompiledQueryCacheKeyTest
Tests run: 6, Failures: 1, Errors: 0, Skipped: 0, Time elapsed: 34.055 sec <<< FAILURE!
- in org.apache.atlas.services.EntityDiscoveryServiceTest
getSubTypeForTypeWithSubTypes_ReturnsOrClause(org.apache.atlas.services.EntityDiscoveryServiceTest)
 Time elapsed: 0.013 sec  <<< FAILURE!
java.lang.AssertionError: expected:<true> but was:<false>
	at org.testng.Assert.fail(Assert.java:89)
	at org.testng.Assert.failNotEquals(Assert.java:489)
	at org.testng.Assert.assertTrue(Assert.java:37)
	at org.testng.Assert.assertTrue(Assert.java:47)
	at org.apache.atlas.services.EntityDiscoveryServiceTest.getSubTypeForTypeWithSubTypes_ReturnsOrClause(EntityDiscoveryServiceTest.java:100)

Tests run: 1, Failures: 0, Errors: 0, Skipped: 0, Time elapsed: 42.651 sec - in org.apache.atlas.services.MetricsServiceTest
Tests run: 1, Failures: 0, Errors: 0, Skipped: 0, Time elapsed: 50.176 sec - in org.apache.atlas.RepositoryServiceLoadingTest
Tests run: 5, Failures: 0, Errors: 0, Skipped: 0, Time elapsed: 40.325 sec - in org.apache.atlas.query.QueryProcessorTest
Tests run: 0, Failures: 0, Errors: 0, Skipped: 0, Time elapsed: 33.577 sec - in org.apache.atlas.query.BaseGremlinTest
Tests run: 19, Failures: 0, Errors: 0, Skipped: 0, Time elapsed: 36.721 sec - in org.apache.atlas.query.ExpressionTest
Tests run: 1, Failures: 0, Errors: 0, Skipped: 0, Time elapsed: 35.208 sec - in org.apache.atlas.query.LexerTest
Tests run: 12, Failures: 0, Errors: 0, Skipped: 0, Time elapsed: 100.694 sec - in org.apache.atlas.repository.store.graph.AtlasTypeDefGraphStoreTest
Tests run: 3, Failures: 0, Errors: 0, Skipped: 0, Time elapsed: 101.726 sec - in org.apache.atlas.repository.impexp.ImportServiceTest
Tests run: 11, Failures: 0, Errors: 0, Skipped: 0, Time elapsed: 102.34 sec - in org.apache.atlas.repository.store.graph.v1.SoftDeleteHandlerV1Test
Tests run: 30, Failures: 0, Errors: 0, Skipped: 0, Time elapsed: 103.517 sec - in org.apache.atlas.repository.graph.GraphBackedMetadataRepositoryTest
Tests run: 21, Failures: 0, Errors: 0, Skipped: 0, Time elapsed: 105.393 sec - in org.apache.atlas.repository.graph.GraphBackedRepositoryHardDeleteTest
Tests run: 0, Failures: 0, Errors: 0, Skipped: 0, Time elapsed: 27.996 sec - in org.apache.atlas.TestUtils
Tests run: 21, Failures: 0, Errors: 0, Skipped: 0, Time elapsed: 105.204 sec - in org.apache.atlas.repository.graph.GraphBackedRepositorySoftDeleteTest
Tests run: 14, Failures: 0, Errors: 0, Skipped: 0, Time elapsed: 31.815 sec - in org.apache.atlas.query.ParserTest
Tests run: 10, Failures: 0, Errors: 0, Skipped: 0, Time elapsed: 106.048 sec - in org.apache.atlas.repository.impexp.ExportServiceTest
Tests run: 5, Failures: 0, Errors: 0, Skipped: 0, Time elapsed: 73.016 sec - in org.apache.atlas.repository.store.graph.v1.InverseReferenceUpdateHardDeleteV1Test
Tests run: 5, Failures: 0, Errors: 0, Skipped: 0, Time elapsed: 72.971 sec - in org.apache.atlas.repository.store.graph.v1.InverseReferenceUpdateSoftDeleteV1Test
Tests run: 26, Failures: 0, Errors: 0, Skipped: 0, Time elapsed: 113.498 sec - in org.apache.atlas.service.DefaultMetadataServiceTest
Tests run: 13, Failures: 0, Errors: 0, Skipped: 0, Time elapsed: 76.452 sec - in org.apache.atlas.repository.store.graph.v1.AtlasEntityStoreV1Test
Tests run: 4, Failures: 0, Errors: 0, Skipped: 0, Time elapsed: 77.22 sec - in org.apache.atlas.repository.audit.HBaseBasedAuditRepositoryTest
Tests run: 11, Failures: 0, Errors: 0, Skipped: 0, Time elapsed: 81.326 sec - in org.apache.atlas.repository.store.graph.v1.HardDeleteHandlerV1Test
Tests run: 5, Failures: 0, Errors: 0, Skipped: 0, Time elapsed: 54.141 sec - in org.apache.atlas.query.LineageQueryTest
Tests run: 23, Failures: 0, Errors: 0, Skipped: 0, Time elapsed: 83.447 sec - in org.apache.atlas.lineage.EntityLineageServiceTest
Tests run: 21, Failures: 0, Errors: 0, Skipped: 0, Time elapsed: 55.904 sec - in org.apache.atlas.query.GremlinTest
Tests run: 2, Failures: 0, Errors: 0, Skipped: 0, Time elapsed: 259.002 sec - in org.apache.atlas.repository.graph.GraphRepoMapperScaleTest
Tests run: 333, Failures: 0, Errors: 0, Skipped: 0, Time elapsed: 267.073 sec - in org.apache.atlas.discovery.GraphBackedDiscoveryServiceTest

Results :

Failed tests: 
  EntityDiscoveryServiceTest.getSubTypeForTypeWithSubTypes_ReturnsOrClause:100 expected:<true>
but was:<false>

Tests run: 749, Failures: 1, Errors: 0, Skipped: 0

[INFO] ------------------------------------------------------------------------
[INFO] Reactor Summary:
[INFO] 
[INFO] Apache Atlas Server Build Tools .................... SUCCESS [  0.957 s]
[INFO] apache-atlas ....................................... SUCCESS [  6.683 s]
[INFO] Apache Atlas Integration ........................... SUCCESS [ 32.192 s]
[INFO] Apache Atlas Common ................................ SUCCESS [ 15.539 s]
[INFO] Apache Atlas Typesystem ............................ SUCCESS [01:10 min]
[INFO] Apache Atlas Client ................................ SUCCESS [ 21.163 s]
[INFO] Apache Atlas Server API ............................ SUCCESS [ 12.593 s]
[INFO] Apache Atlas Notification .......................... SUCCESS [ 25.098 s]
[INFO] Apache Atlas Graph Database Projects ............... SUCCESS [  0.582 s]
[INFO] Apache Atlas Graph Database API .................... SUCCESS [  7.235 s]
[INFO] Graph Database Common Code ......................... SUCCESS [  7.745 s]
[INFO] Apache Atlas Titan 1.0.0 GraphDB Impl .............. SUCCESS [ 30.429 s]
[INFO] Shaded version of Apache hbase client .............. SUCCESS [  8.998 s]
[INFO] Apache Atlas Titan 0.5.4 Graph DB Impl ............. SUCCESS [01:20 min]
[INFO] Apache Atlas Graph Database Implementation Dependencies SUCCESS [  0.717 s]
[INFO] Shaded version of Apache hbase server .............. SUCCESS [ 24.333 s]
[INFO] Apache Atlas Repository ............................ FAILURE [05:26 min]
[INFO] Apache Atlas Authorization ......................... SKIPPED
[INFO] Apache Atlas Business Catalog ...................... SKIPPED
[INFO] Apache Atlas UI .................................... SKIPPED
[INFO] Apache Atlas Web Application ....................... SKIPPED
[INFO] Apache Atlas Documentation ......................... SKIPPED
[INFO] Apache Atlas FileSystem Model ...................... SKIPPED
[INFO] Apache Atlas Plugin Classloader .................... SKIPPED
[INFO] Apache Atlas Hive Bridge Shim ...................... SKIPPED
[INFO] Apache Atlas Hive Bridge ........................... SKIPPED
[INFO] Apache Atlas Falcon Bridge Shim .................... SKIPPED
[INFO] Apache Atlas Falcon Bridge ......................... SKIPPED
[INFO] Apache Atlas Sqoop Bridge Shim ..................... SKIPPED
[INFO] Apache Atlas Sqoop Bridge .......................... SKIPPED
[INFO] Apache Atlas Storm Bridge Shim ..................... SKIPPED
[INFO] Apache Atlas Storm Bridge .......................... SKIPPED
[INFO] Apache Atlas Distribution .......................... SKIPPED
[INFO] ------------------------------------------------------------------------
[INFO] BUILD FAILURE
[INFO] ------------------------------------------------------------------------
[INFO] Total time: 11:13 min
[INFO] Finished at: 2017-06-02T18:31:29Z
[INFO] Final Memory: 155M/1736M
[INFO] ------------------------------------------------------------------------
[ERROR] Failed to execute goal org.apache.maven.plugins:maven-surefire-plugin:2.18.1:test
(default-test) on project atlas-repository: There are test failures.
[ERROR] 
[ERROR] Please refer to <https://builds.apache.org/job/apache-atlas-nightly/ws/repository/target/surefire-reports>
for the individual test results.
[ERROR] -> [Help 1]
[ERROR] 
[ERROR] To see the full stack trace of the errors, re-run Maven with the -e switch.
[ERROR] Re-run Maven using the -X switch to enable full debug logging.
[ERROR] 
[ERROR] For more information about the errors and possible solutions, please read the following
articles:
[ERROR] [Help 1] http://cwiki.apache.org/confluence/display/MAVEN/MojoFailureException
[ERROR] 
[ERROR] After correcting the problems, you can resume the build with the command
[ERROR]   mvn <goals> -rf :atlas-repository
Build step 'Execute shell' marked build as failure
[CHECKSTYLE] Collecting checkstyle analysis files...
[CHECKSTYLE] Searching for all files in <https://builds.apache.org/job/apache-atlas-nightly/ws/>
that match the pattern **/target/checkstyle-result.xml
[CHECKSTYLE] Parsing 18 files in <https://builds.apache.org/job/apache-atlas-nightly/ws/>
[CHECKSTYLE] Successfully parsed file <https://builds.apache.org/job/apache-atlas-nightly/ws/authorization/target/checkstyle-result.xml>
with 464 unique warnings and 0 duplicates.
[CHECKSTYLE] Successfully parsed file <https://builds.apache.org/job/apache-atlas-nightly/ws/catalog/target/checkstyle-result.xml>
with 2609 unique warnings and 0 duplicates.
[CHECKSTYLE] Successfully parsed file <https://builds.apache.org/job/apache-atlas-nightly/ws/client/target/checkstyle-result.xml>
with 4183 unique warnings and 0 duplicates.
[CHECKSTYLE] Successfully parsed file <https://builds.apache.org/job/apache-atlas-nightly/ws/common/target/checkstyle-result.xml>
with 5380 unique warnings and 0 duplicates.
[CHECKSTYLE] Successfully parsed file <https://builds.apache.org/job/apache-atlas-nightly/ws/dashboardv2/target/checkstyle-result.xml>
with 5380 unique warnings and 0 duplicates.
[CHECKSTYLE] Successfully parsed file <https://builds.apache.org/job/apache-atlas-nightly/ws/graphdb/api/target/checkstyle-result.xml>
with 5628 unique warnings and 0 duplicates.
[CHECKSTYLE] Successfully parsed file <https://builds.apache.org/job/apache-atlas-nightly/ws/graphdb/common/target/checkstyle-result.xml>
with 5794 unique warnings and 0 duplicates.
[CHECKSTYLE] Successfully parsed file <https://builds.apache.org/job/apache-atlas-nightly/ws/graphdb/graphdb-impls/target/checkstyle-result.xml>
with 5794 unique warnings and 0 duplicates.
[CHECKSTYLE] Successfully parsed file <https://builds.apache.org/job/apache-atlas-nightly/ws/graphdb/target/checkstyle-result.xml>
with 5794 unique warnings and 0 duplicates.
[CHECKSTYLE] Successfully parsed file <https://builds.apache.org/job/apache-atlas-nightly/ws/graphdb/titan0/target/checkstyle-result.xml>
with 8024 unique warnings and 0 duplicates.
[CHECKSTYLE] Successfully parsed file <https://builds.apache.org/job/apache-atlas-nightly/ws/graphdb/titan1/target/checkstyle-result.xml>
with 8937 unique warnings and 0 duplicates.
[CHECKSTYLE] Successfully parsed file <https://builds.apache.org/job/apache-atlas-nightly/ws/intg/target/checkstyle-result.xml>
with 14949 unique warnings and 0 duplicates.
[CHECKSTYLE] Successfully parsed file <https://builds.apache.org/job/apache-atlas-nightly/ws/notification/target/checkstyle-result.xml>
with 16130 unique warnings and 0 duplicates.
[CHECKSTYLE] Successfully parsed file <https://builds.apache.org/job/apache-atlas-nightly/ws/server-api/target/checkstyle-result.xml>
with 16509 unique warnings and 0 duplicates.
[CHECKSTYLE] Successfully parsed file <https://builds.apache.org/job/apache-atlas-nightly/ws/shaded/hbase-client-shaded/target/checkstyle-result.xml>
with 16509 unique warnings and 0 duplicates.
[CHECKSTYLE] Successfully parsed file <https://builds.apache.org/job/apache-atlas-nightly/ws/shaded/hbase-server-shaded/target/checkstyle-result.xml>
with 16509 unique warnings and 0 duplicates.
[CHECKSTYLE] Successfully parsed file <https://builds.apache.org/job/apache-atlas-nightly/ws/target/checkstyle-result.xml>
with 16509 unique warnings and 0 duplicates.
[CHECKSTYLE] Successfully parsed file <https://builds.apache.org/job/apache-atlas-nightly/ws/typesystem/target/checkstyle-result.xml>
with 20726 unique warnings and 0 duplicates.
[CHECKSTYLE] Computing warning deltas based on reference build #711
[FINDBUGS] Collecting findbugs analysis files...
[FINDBUGS] Searching for all files in <https://builds.apache.org/job/apache-atlas-nightly/ws/>
that match the pattern **/target/findbugs.xml
[FINDBUGS] Parsing 11 files in <https://builds.apache.org/job/apache-atlas-nightly/ws/>
[FINDBUGS] Successfully parsed file <https://builds.apache.org/job/apache-atlas-nightly/ws/authorization/target/findbugs.xml>
with 0 unique warnings and 0 duplicates.
[FINDBUGS] Successfully parsed file <https://builds.apache.org/job/apache-atlas-nightly/ws/catalog/target/findbugs.xml>
with 0 unique warnings and 0 duplicates.
[FINDBUGS] Successfully parsed file <https://builds.apache.org/job/apache-atlas-nightly/ws/client/target/findbugs.xml>
with 0 unique warnings and 0 duplicates.
[FINDBUGS] Successfully parsed file <https://builds.apache.org/job/apache-atlas-nightly/ws/common/target/findbugs.xml>
with 0 unique warnings and 0 duplicates.
[FINDBUGS] Successfully parsed file <https://builds.apache.org/job/apache-atlas-nightly/ws/graphdb/api/target/findbugs.xml>
with 0 unique warnings and 0 duplicates.
[FINDBUGS] Successfully parsed file <https://builds.apache.org/job/apache-atlas-nightly/ws/graphdb/common/target/findbugs.xml>
with 0 unique warnings and 0 duplicates.
[FINDBUGS] Successfully parsed file <https://builds.apache.org/job/apache-atlas-nightly/ws/graphdb/titan0/target/findbugs.xml>
with 0 unique warnings and 0 duplicates.
[FINDBUGS] Successfully parsed file <https://builds.apache.org/job/apache-atlas-nightly/ws/intg/target/findbugs.xml>
with 0 unique warnings and 0 duplicates.
[FINDBUGS] Successfully parsed file <https://builds.apache.org/job/apache-atlas-nightly/ws/notification/target/findbugs.xml>
with 0 unique warnings and 0 duplicates.
[FINDBUGS] Successfully parsed file <https://builds.apache.org/job/apache-atlas-nightly/ws/server-api/target/findbugs.xml>
with 0 unique warnings and 0 duplicates.
[FINDBUGS] Successfully parsed file <https://builds.apache.org/job/apache-atlas-nightly/ws/typesystem/target/findbugs.xml>
with 0 unique warnings and 0 duplicates.
[FINDBUGS] Computing warning deltas based on reference build #711
Archiving artifacts
TestNG Reports Processing: START
Looking for TestNG results report in workspace using pattern: **/target/surefire-reports/testng-results.xml,**/target/failsafe-reports/testng-results.xml
testng-results.xml was last modified before this build started. Ignoring it.
testng-results.xml was last modified before this build started. Ignoring it.
testng-results.xml was last modified before this build started. Ignoring it.
testng-results.xml was last modified before this build started. Ignoring it.
Saving reports...
Processing '/x1/jenkins/jenkins-home/jobs/apache-atlas-nightly/builds/763/testng/testng-results-1.xml'
Processing '/x1/jenkins/jenkins-home/jobs/apache-atlas-nightly/builds/763/testng/testng-results-2.xml'
Processing '/x1/jenkins/jenkins-home/jobs/apache-atlas-nightly/builds/763/testng/testng-results-3.xml'
Processing '/x1/jenkins/jenkins-home/jobs/apache-atlas-nightly/builds/763/testng/testng-results-4.xml'
Processing '/x1/jenkins/jenkins-home/jobs/apache-atlas-nightly/builds/763/testng/testng-results-5.xml'
Processing '/x1/jenkins/jenkins-home/jobs/apache-atlas-nightly/builds/763/testng/testng-results-6.xml'
Processing '/x1/jenkins/jenkins-home/jobs/apache-atlas-nightly/builds/763/testng/testng-results.xml'
TestNG Reports Processing: FINISH

Mime
View raw message