atlas-dev mailing list archives

Site index · List index
Message view « Date » · « Thread »
Top « Date » · « Thread »
From Apache Jenkins Server <jenk...@builds.apache.org>
Subject Build failed in Jenkins: apache-atlas-nightly #776
Date Fri, 16 Jun 2017 16:19:43 GMT
See <https://builds.apache.org/job/apache-atlas-nightly/776/display/redirect?page=changes>

Changes:

[madhan] ATLAS-1863: added support for default value for attributes

------------------------------------------
[...truncated 541.44 KB...]
127.0.0.1 - - [16/Jun/2017:16:17:40 +0000] "GET /api/atlas/entities/cf9edabd-bc2a-4859-b42d-6c121d508955/traitDefinitions
HTTP/1.1" 200 - "-" "Java/1.7.0_80"
127.0.0.1 - - [16/Jun/2017:16:17:40 +0000] "POST /api/atlas/entities HTTP/1.1" 201 - "-" "Java/1.7.0_80"
127.0.0.1 - - [16/Jun/2017:16:17:40 +0000] "POST /api/atlas/entities HTTP/1.1" 201 - "-" "Java/1.7.0_80"
127.0.0.1 - - [16/Jun/2017:16:17:40 +0000] "GET /api/atlas/entities/64eda807-d76c-4d53-8116-4a60cf060f27/traits
HTTP/1.1" 200 - "-" "Java/1.7.0_80"
127.0.0.1 - - [16/Jun/2017:16:17:40 +0000] "POST /api/atlas/entities HTTP/1.1" 201 - "-" "Java/1.7.0_80"
127.0.0.1 - - [16/Jun/2017:16:17:40 +0000] "POST /api/atlas/entities HTTP/1.1" 201 - "-" "Java/1.7.0_80"
127.0.0.1 - - [16/Jun/2017:16:17:40 +0000] "POST /api/atlas/entities/4ef7b1bf-18e5-4bbd-b7fa-a7b0017edc15
HTTP/1.1" 200 - "-" "Java/1.7.0_80"
127.0.0.1 - - [16/Jun/2017:16:17:40 +0000] "GET /api/atlas/entities/4ef7b1bf-18e5-4bbd-b7fa-a7b0017edc15
HTTP/1.1" 200 - "-" "Java/1.7.0_80"
127.0.0.1 - - [16/Jun/2017:16:17:40 +0000] "POST /api/atlas/entities/qualifiedName?type=hive_table&property=qualifiedName&value=tableaQNJWhN0H4
HTTP/1.1" 200 - "-" "Java/1.7.0_80"
127.0.0.1 - - [16/Jun/2017:16:17:40 +0000] "GET /api/atlas/entities/4ef7b1bf-18e5-4bbd-b7fa-a7b0017edc15
HTTP/1.1" 200 - "-" "Java/1.7.0_80"
127.0.0.1 - - [16/Jun/2017:16:17:40 +0000] "POST /api/atlas/entities HTTP/1.1" 201 - "-" "Java/1.7.0_80"
127.0.0.1 - - [16/Jun/2017:16:17:40 +0000] "GET /api/atlas/entities/1cbbb19b-fbdc-4d0b-8337-4a1d0e748554/audit?count=10
HTTP/1.1" 200 - "-" "Java/1.7.0_80"
127.0.0.1 - - [16/Jun/2017:16:17:41 +0000] "POST /api/atlas/entities HTTP/1.1" 201 - "-" "Java/1.7.0_80"
127.0.0.1 - - [16/Jun/2017:16:17:41 +0000] "POST /api/atlas/entities HTTP/1.1" 201 - "-" "Java/1.7.0_80"
127.0.0.1 - - [16/Jun/2017:16:17:41 +0000] "POST /api/atlas/entities HTTP/1.1" 201 - "-" "Java/1.7.0_80"
127.0.0.1 - - [16/Jun/2017:16:17:41 +0000] "POST /api/atlas/entities HTTP/1.1" 400 - "-" "Java/1.7.0_80"
127.0.0.1 - - [16/Jun/2017:16:17:41 +0000] "POST /api/atlas/entities HTTP/1.1" 201 - "-" "Java/1.7.0_80"
127.0.0.1 - - [16/Jun/2017:16:17:41 +0000] "GET /api/atlas/v2/types/typedef/name/co3f9ajNYr
HTTP/1.1" 404 - "-" "Java/1.7.0_80"
127.0.0.1 - - [16/Jun/2017:16:17:41 +0000] "POST /api/atlas/types HTTP/1.1" 201 - "-" "Java/1.7.0_80"
127.0.0.1 - - [16/Jun/2017:16:17:41 +0000] "POST /api/atlas/entities HTTP/1.1" 201 - "-" "Java/1.7.0_80"
127.0.0.1 - - [16/Jun/2017:16:17:41 +0000] "GET /api/atlas/entities/1de69535-d87a-4c9c-9023-32cc0e13a334
HTTP/1.1" 200 - "-" "Java/1.7.0_80"
127.0.0.1 - - [16/Jun/2017:16:17:41 +0000] "GET /api/atlas/v2/entity/guid/52fb60b8-80df-418a-8213-bcfeddd3290d
HTTP/1.1" 200 - "-" "Java/1.7.0_80"
127.0.0.1 - - [16/Jun/2017:16:17:41 +0000] "POST /api/atlas/v2/entity/ HTTP/1.1" 200 - "-"
"Java/1.7.0_80"
127.0.0.1 - - [16/Jun/2017:16:17:41 +0000] "POST /api/atlas/v2/entity/guid/random/classifications
HTTP/1.1" 404 - "-" "Java/1.7.0_80"
127.0.0.1 - - [16/Jun/2017:16:17:41 +0000] "POST /api/atlas/v2/entity/bulk/ HTTP/1.1" 200
- "-" "Java/1.7.0_80"
127.0.0.1 - - [16/Jun/2017:16:17:41 +0000] "POST /api/atlas/v2/entity/ HTTP/1.1" 200 - "-"
"Java/1.7.0_80"
127.0.0.1 - - [16/Jun/2017:16:17:41 +0000] "POST /api/atlas/v2/entity/ HTTP/1.1" 200 - "-"
"Java/1.7.0_80"
127.0.0.1 - - [16/Jun/2017:16:17:41 +0000] "DELETE /api/atlas/v2/entity/bulk/?guid=6e993732-8497-4879-8d34-e727c233bb18&guid=393f3a71-9621-4780-9be9-539f8a47a042
HTTP/1.1" 200 - "-" "Java/1.7.0_80"
127.0.0.1 - - [16/Jun/2017:16:17:41 +0000] "POST /api/atlas/v2/entity/ HTTP/1.1" 200 - "-"
"Java/1.7.0_80"
127.0.0.1 - - [16/Jun/2017:16:17:41 +0000] "DELETE /api/atlas/v2/entity/uniqueAttribute/type/hive_db_v2?attr:name=dbs5Cb4lk6zV%E7%92%A3%E2%B1%AF%E8%A8%A3%E6%9E%92%EB%90%B0%EC%9D%8A%E3%BB%A4%E5%AA%BB%E1%81%A8%E4%A5%B0
HTTP/1.1" 200 - "-" "Java/1.7.0_80"
127.0.0.1 - - [16/Jun/2017:16:17:41 +0000] "DELETE /api/atlas/v2/entity/guid/random/classification/blah_trait
HTTP/1.1" 400 - "-" "Java/1.7.0_80"
127.0.0.1 - - [16/Jun/2017:16:17:41 +0000] "GET /api/atlas/discovery/search/dsl?query=hive_db_v2+where+name%3D'dbs5Cb4lk6zV'&limit=10&offset=0
HTTP/1.1" 200 - "-" "Java/1.7.0_80"
127.0.0.1 - - [16/Jun/2017:16:18:42 +0000] "POST /api/atlas/v2/types/typedefs/ HTTP/1.1" 200
- "-" "Java/1.7.0_80"
127.0.0.1 - - [16/Jun/2017:16:18:42 +0000] "POST /api/atlas/v2/entity/ HTTP/1.1" 200 - "-"
"Java/1.7.0_80"
127.0.0.1 - - [16/Jun/2017:16:18:43 +0000] "PUT /api/atlas/v2/types/typedefs/ HTTP/1.1" 200
- "-" "Java/1.7.0_80"
127.0.0.1 - - [16/Jun/2017:16:18:43 +0000] "GET /api/atlas/v2/entity/guid/d2b62741-afa7-4ec2-891b-090c03c40e67
HTTP/1.1" 200 - "-" "Java/1.7.0_80"
127.0.0.1 - - [16/Jun/2017:16:18:43 +0000] "POST /api/atlas/v2/entity/ HTTP/1.1" 404 - "-"
"Java/1.7.0_80"
127.0.0.1 - - [16/Jun/2017:16:18:43 +0000] "POST /api/atlas/v2/entity/ HTTP/1.1" 200 - "-"
"Java/1.7.0_80"
127.0.0.1 - - [16/Jun/2017:16:18:43 +0000] "POST /api/atlas/v2/entity/ HTTP/1.1" 200 - "-"
"Java/1.7.0_80"
127.0.0.1 - - [16/Jun/2017:16:18:43 +0000] "GET /api/atlas/v2/entity/uniqueAttribute/type/hive_db_v2?attr:name=dbs5Cb4lk6zV
HTTP/1.1" 200 - "-" "Java/1.7.0_80"
127.0.0.1 - - [16/Jun/2017:16:18:43 +0000] "POST /api/atlas/v2/entity/ HTTP/1.1" 200 - "-"
"Java/1.7.0_80"
127.0.0.1 - - [16/Jun/2017:16:18:43 +0000] "POST /api/atlas/v2/entity/ HTTP/1.1" 200 - "-"
"Java/1.7.0_80"
127.0.0.1 - - [16/Jun/2017:16:18:43 +0000] "GET /api/atlas/v2/types/typedef/name/CpdfnGXxvO
HTTP/1.1" 404 - "-" "Java/1.7.0_80"
127.0.0.1 - - [16/Jun/2017:16:18:43 +0000] "POST /api/atlas/v2/types/typedefs/ HTTP/1.1" 200
- "-" "Java/1.7.0_80"
127.0.0.1 - - [16/Jun/2017:16:18:43 +0000] "POST /api/atlas/v2/entity/ HTTP/1.1" 200 - "-"
"Java/1.7.0_80"
127.0.0.1 - - [16/Jun/2017:16:18:43 +0000] "GET /api/atlas/v2/entity/guid/415d62db-69ee-4994-b972-c3e54dea2922
HTTP/1.1" 200 - "-" "Java/1.7.0_80"
127.0.0.1 - - [16/Jun/2017:16:18:43 +0000] "GET /api/atlas/v2/entity/guid/blah HTTP/1.1" 404
- "-" "Java/1.7.0_80"
127.0.0.1 - - [16/Jun/2017:16:18:43 +0000] "POST /api/atlas/v2/entity/ HTTP/1.1" 200 - "-"
"Java/1.7.0_80"
127.0.0.1 - - [16/Jun/2017:16:18:43 +0000] "GET /api/atlas/entities/c9d65e14-977c-4f8b-a8ee-ffe796e6b74f/audit?count=10
HTTP/1.1" 200 - "-" "Java/1.7.0_80"
127.0.0.1 - - [16/Jun/2017:16:18:43 +0000] "GET /api/atlas/discovery/search/dsl?query=from+hive_db_v1+name%3D%22dbfE8qEkz1FK%22
HTTP/1.1" 200 - "-" "Java/1.7.0_80"
127.0.0.1 - - [16/Jun/2017:16:18:44 +0000] "GET /api/atlas/discovery/search/dsl?query=from+blah
HTTP/1.1" 400 - "-" "Java/1.7.0_80"
127.0.0.1 - - [16/Jun/2017:16:18:44 +0000] "GET /api/atlas/discovery/search?query=* HTTP/1.1"
200 - "-" "Java/1.7.0_80"
127.0.0.1 - - [16/Jun/2017:16:18:44 +0000] "GET /api/atlas/discovery/search?query=from+hive_db_v1+name%3D%22dbfE8qEkz1FK%22
HTTP/1.1" 200 - "-" "Java/1.7.0_80"
127.0.0.1 - - [16/Jun/2017:16:18:45 +0000] "GET /api/atlas/discovery/search/gremlin?query=g.V.has('type',+'hive_table_v1').toList()
HTTP/1.1" 200 - "-" "Java/1.7.0_80"
127.0.0.1 - - [16/Jun/2017:16:18:46 +0000] "POST /api/atlas/v2/types/typedefs/ HTTP/1.1" 200
- "-" "Java/1.7.0_80"
127.0.0.1 - - [16/Jun/2017:16:18:46 +0000] "POST /api/atlas/v2/types/typedefs/ HTTP/1.1" 409
- "-" "Java/1.7.0_80"
127.0.0.1 - - [16/Jun/2017:16:18:46 +0000] "GET /api/atlas/v2/types/enumdef/name/blah HTTP/1.1"
404 - "-" "Java/1.7.0_80"
127.0.0.1 - - [16/Jun/2017:16:18:46 +0000] "GET /api/atlas/v2/types/enumdef/guid/blah HTTP/1.1"
404 - "-" "Java/1.7.0_80"
127.0.0.1 - - [16/Jun/2017:16:18:46 +0000] "GET /api/atlas/v2/types/structdef/name/blah HTTP/1.1"
404 - "-" "Java/1.7.0_80"
127.0.0.1 - - [16/Jun/2017:16:18:46 +0000] "GET /api/atlas/v2/types/structdef/guid/blah HTTP/1.1"
404 - "-" "Java/1.7.0_80"
127.0.0.1 - - [16/Jun/2017:16:18:46 +0000] "GET /api/atlas/v2/types/classificationdef/name/blah
HTTP/1.1" 404 - "-" "Java/1.7.0_80"
127.0.0.1 - - [16/Jun/2017:16:18:46 +0000] "GET /api/atlas/v2/types/classificationdef/guid/blah
HTTP/1.1" 404 - "-" "Java/1.7.0_80"
127.0.0.1 - - [16/Jun/2017:16:18:46 +0000] "GET /api/atlas/v2/types/entitydef/name/blah HTTP/1.1"
404 - "-" "Java/1.7.0_80"
127.0.0.1 - - [16/Jun/2017:16:18:46 +0000] "GET /api/atlas/v2/types/entitydef/guid/blah HTTP/1.1"
404 - "-" "Java/1.7.0_80"
127.0.0.1 - - [16/Jun/2017:16:18:46 +0000] "POST /api/atlas/v2/types/typedefs/ HTTP/1.1" 200
- "-" "Java/1.7.0_80"
127.0.0.1 - - [16/Jun/2017:16:18:46 +0000] "GET /api/atlas/v2/types/typedefs/?supertype=ASGxUfIDd8V&type=CLASS
HTTP/1.1" 200 - "-" "Java/1.7.0_80"
127.0.0.1 - - [16/Jun/2017:16:18:46 +0000] "GET /api/atlas/v2/types/typedefs/?notsupertype=Bx07bknhi8K&supertype=ASGxUfIDd8V&type=CLASS
HTTP/1.1" 200 - "-" "Java/1.7.0_80"
127.0.0.1 - - [16/Jun/2017:16:18:46 +0000] "POST /api/atlas/v2/types/typedefs/ HTTP/1.1" 200
- "-" "Java/1.7.0_80"
127.0.0.1 - - [16/Jun/2017:16:18:46 +0000] "PUT /api/atlas/v2/types/typedefs/ HTTP/1.1" 200
- "-" "Java/1.7.0_80"
127.0.0.1 - - [16/Jun/2017:16:18:46 +0000] "GET /api/atlas/v2/types/typedefs/?type=ENTITY
HTTP/1.1" 200 - "-" "Java/1.7.0_80"
127.0.0.1 - - [16/Jun/2017:16:18:46 +0000] "POST /api/atlas/types HTTP/1.1" 201 - "-" "Java/1.7.0_80"
127.0.0.1 - - [16/Jun/2017:16:18:47 +0000] "POST /api/atlas/types HTTP/1.1" 409 - "-" "Java/1.7.0_80"
127.0.0.1 - - [16/Jun/2017:16:18:47 +0000] "GET /api/atlas/types/blah HTTP/1.1" 404 - "-"
"Java/1.7.0_80"
127.0.0.1 - - [16/Jun/2017:16:18:47 +0000] "GET /api/atlas/v2/types/typedef/name/class_trait
HTTP/1.1" 404 - "-" "Java/1.7.0_80"
127.0.0.1 - - [16/Jun/2017:16:18:47 +0000] "POST /api/atlas/types HTTP/1.1" 201 - "-" "Java/1.7.0_80"
127.0.0.1 - - [16/Jun/2017:16:18:47 +0000] "GET /api/atlas/v2/types/typedef/name/secure_trait
HTTP/1.1" 404 - "-" "Java/1.7.0_80"
127.0.0.1 - - [16/Jun/2017:16:18:47 +0000] "POST /api/atlas/types HTTP/1.1" 201 - "-" "Java/1.7.0_80"
127.0.0.1 - - [16/Jun/2017:16:18:47 +0000] "GET /api/atlas/v2/types/typedef/name/pii_trait
HTTP/1.1" 404 - "-" "Java/1.7.0_80"
127.0.0.1 - - [16/Jun/2017:16:18:47 +0000] "POST /api/atlas/types HTTP/1.1" 201 - "-" "Java/1.7.0_80"
127.0.0.1 - - [16/Jun/2017:16:18:47 +0000] "GET /api/atlas/v2/types/typedef/name/ssn_trait
HTTP/1.1" 404 - "-" "Java/1.7.0_80"
127.0.0.1 - - [16/Jun/2017:16:18:47 +0000] "POST /api/atlas/types HTTP/1.1" 201 - "-" "Java/1.7.0_80"
127.0.0.1 - - [16/Jun/2017:16:18:47 +0000] "GET /api/atlas/v2/types/typedef/name/salary_trait
HTTP/1.1" 404 - "-" "Java/1.7.0_80"
127.0.0.1 - - [16/Jun/2017:16:18:47 +0000] "POST /api/atlas/types HTTP/1.1" 201 - "-" "Java/1.7.0_80"
127.0.0.1 - - [16/Jun/2017:16:18:47 +0000] "GET /api/atlas/v2/types/typedef/name/sox_trait
HTTP/1.1" 404 - "-" "Java/1.7.0_80"
127.0.0.1 - - [16/Jun/2017:16:18:47 +0000] "POST /api/atlas/types HTTP/1.1" 201 - "-" "Java/1.7.0_80"
127.0.0.1 - - [16/Jun/2017:16:18:47 +0000] "GET /api/atlas/types?type=TRAIT HTTP/1.1" 200
- "-" "Java/1.7.0_80"
127.0.0.1 - - [16/Jun/2017:16:18:47 +0000] "GET /api/atlas/v2/types/typedef/name/AUlJZkoEBs8
HTTP/1.1" 404 - "-" "Java/1.7.0_80"
127.0.0.1 - - [16/Jun/2017:16:18:47 +0000] "POST /api/atlas/types HTTP/1.1" 201 - "-" "Java/1.7.0_80"
127.0.0.1 - - [16/Jun/2017:16:18:47 +0000] "GET /api/atlas/v2/types/typedef/name/A1VtfOjp0kOX
HTTP/1.1" 404 - "-" "Java/1.7.0_80"
127.0.0.1 - - [16/Jun/2017:16:18:47 +0000] "POST /api/atlas/types HTTP/1.1" 201 - "-" "Java/1.7.0_80"
127.0.0.1 - - [16/Jun/2017:16:18:48 +0000] "GET /api/atlas/v2/types/typedef/name/BA6bcpjUcQ0
HTTP/1.1" 404 - "-" "Java/1.7.0_80"
127.0.0.1 - - [16/Jun/2017:16:18:48 +0000] "POST /api/atlas/types HTTP/1.1" 201 - "-" "Java/1.7.0_80"
127.0.0.1 - - [16/Jun/2017:16:18:48 +0000] "GET /api/atlas/v2/types/typedef/name/CStlPNs9wKr
HTTP/1.1" 404 - "-" "Java/1.7.0_80"
127.0.0.1 - - [16/Jun/2017:16:18:48 +0000] "POST /api/atlas/types HTTP/1.1" 201 - "-" "Java/1.7.0_80"
127.0.0.1 - - [16/Jun/2017:16:18:48 +0000] "GET /api/atlas/types?type=CLASS&supertype=AUlJZkoEBs8&notsupertype=BA6bcpjUcQ0
HTTP/1.1" 200 - "-" "Java/1.7.0_80"
127.0.0.1 - - [16/Jun/2017:16:18:48 +0000] "POST /api/atlas/types HTTP/1.1" 201 - "-" "Java/1.7.0_80"
127.0.0.1 - - [16/Jun/2017:16:18:48 +0000] "PUT /api/atlas/types HTTP/1.1" 200 - "-" "Java/1.7.0_80"
127.0.0.1 - - [16/Jun/2017:16:18:48 +0000] "GET /api/atlas/types/H1QBZirWWo HTTP/1.1" 200
- "-" "Java/1.7.0_80"
Tests run: 134, Failures: 2, Errors: 0, Skipped: 5, Time elapsed: 178.022 sec <<<
FAILURE! - in TestSuite
runQuickStart(org.apache.atlas.examples.QuickStartV2IT)  Time elapsed: 0.546 sec  <<<
FAILURE!
org.apache.atlas.AtlasServiceException: Metadata service API org.apache.atlas.AtlasBaseClient$APIInfo@3aba6006
failed with status 409 (Conflict) Response Body ({"errorCode":"ATLAS-409-00-001","errorMessage":"Given
type Dimension already exists"})
	at org.apache.atlas.examples.QuickStartV2IT.runQuickStart(QuickStartV2IT.java:49)

testEntityDeduping(org.apache.atlas.web.integration.EntityV2JerseyResourceIT)  Time elapsed:
60.94 sec  <<< FAILURE!
java.lang.Exception: Waiting timed out after 60000 msec
	at org.apache.atlas.web.integration.EntityV2JerseyResourceIT.testEntityDeduping(EntityV2JerseyResourceIT.java:170)


Results :

Failed tests: 
  QuickStartV2IT.runQuickStart:49 » AtlasService Metadata service API org.apache...
  EntityV2JerseyResourceIT.testEntityDeduping:170->BaseResourceIT.waitForNotification:633->BaseResourceIT.waitFor:625
» 

Tests run: 134, Failures: 2, Errors: 0, Skipped: 5

[INFO] 
[INFO] --- jetty-maven-plugin:9.2.12.v20150709:stop (stop-jetty) @ atlas-webapp ---
[INFO] Waiting 10 seconds for jetty to stop
[INFO] Stopped ServerConnector@2d7bddcd{HTTP/1.1}{0.0.0.0:31000}
[INFO] Closing Spring root WebApplicationContext
[INFO] Shutting down log4j
[INFO] Stopped o.e.j.m.p.JettyWebAppContext@1dc3c331{/,<https://builds.apache.org/job/apache-atlas-nightly/ws/webapp/target/atlas-webapp-0.9-incubating-SNAPSHOT/,UNAVAILABLE}{/home/jenkins/jenkins-slave/workspace/apache-atlas-nightly/webapp/target/atlas-webapp-0.9-incubating-SNAPSHOT.war}>
[INFO] Server reports itself as stopped
[INFO] 
[INFO] --- maven-source-plugin:2.4:jar-no-fork (attach-sources) @ atlas-webapp ---
[INFO] Building jar: <https://builds.apache.org/job/apache-atlas-nightly/ws/webapp/target/atlas-webapp-0.9-incubating-SNAPSHOT-sources.jar>
log4j:WARN No appenders could be found for logger (org.apache.zookeeper.ClientCnxn).
log4j:WARN Please initialize the log4j system properly.
log4j:WARN See http://logging.apache.org/log4j/1.2/faq.html#noconfig for more info.
[INFO] 
[INFO] --- maven-source-plugin:2.4:test-jar-no-fork (attach-sources) @ atlas-webapp ---
[INFO] Building jar: <https://builds.apache.org/job/apache-atlas-nightly/ws/webapp/target/atlas-webapp-0.9-incubating-SNAPSHOT-test-sources.jar>
[INFO] 
[INFO] --- maven-failsafe-plugin:2.19.1:verify (verify) @ atlas-webapp ---
[INFO] ------------------------------------------------------------------------
[INFO] Reactor Summary:
[INFO] 
[INFO] Apache Atlas Server Build Tools .................... SUCCESS [  1.007 s]
[INFO] apache-atlas ....................................... SUCCESS [ 13.566 s]
[INFO] Apache Atlas Integration ........................... SUCCESS [ 38.945 s]
[INFO] Apache Atlas Common ................................ SUCCESS [ 16.046 s]
[INFO] Apache Atlas Typesystem ............................ SUCCESS [01:16 min]
[INFO] Apache Atlas Client ................................ SUCCESS [ 19.893 s]
[INFO] Apache Atlas Server API ............................ SUCCESS [ 10.495 s]
[INFO] Apache Atlas Notification .......................... SUCCESS [ 23.014 s]
[INFO] Apache Atlas Graph Database Projects ............... SUCCESS [  0.691 s]
[INFO] Apache Atlas Graph Database API .................... SUCCESS [  8.537 s]
[INFO] Graph Database Common Code ......................... SUCCESS [  7.653 s]
[INFO] Apache Atlas Titan 1.0.0 GraphDB Impl .............. SUCCESS [ 35.015 s]
[INFO] Shaded version of Apache hbase client .............. SUCCESS [  9.596 s]
[INFO] Apache Atlas Titan 0.5.4 Graph DB Impl ............. SUCCESS [01:25 min]
[INFO] Apache Atlas Graph Database Implementation Dependencies SUCCESS [  0.951 s]
[INFO] Shaded version of Apache hbase server .............. SUCCESS [ 25.164 s]
[INFO] Apache Atlas Repository ............................ SUCCESS [06:48 min]
[INFO] Apache Atlas Authorization ......................... SUCCESS [ 14.242 s]
[INFO] Apache Atlas Business Catalog ...................... SUCCESS [ 20.785 s]
[INFO] Apache Atlas UI .................................... SUCCESS [01:00 min]
[INFO] Apache Atlas Web Application ....................... FAILURE [08:03 min]
[INFO] Apache Atlas Documentation ......................... SKIPPED
[INFO] Apache Atlas FileSystem Model ...................... SKIPPED
[INFO] Apache Atlas Plugin Classloader .................... SKIPPED
[INFO] Apache Atlas Hive Bridge Shim ...................... SKIPPED
[INFO] Apache Atlas Hive Bridge ........................... SKIPPED
[INFO] Apache Atlas Falcon Bridge Shim .................... SKIPPED
[INFO] Apache Atlas Falcon Bridge ......................... SKIPPED
[INFO] Apache Atlas Sqoop Bridge Shim ..................... SKIPPED
[INFO] Apache Atlas Sqoop Bridge .......................... SKIPPED
[INFO] Apache Atlas Storm Bridge Shim ..................... SKIPPED
[INFO] Apache Atlas Storm Bridge .......................... SKIPPED
[INFO] Apache Atlas Distribution .......................... SKIPPED
[INFO] ------------------------------------------------------------------------
[INFO] BUILD FAILURE
[INFO] ------------------------------------------------------------------------
[INFO] Total time: 22:42 min
[INFO] Finished at: 2017-06-16T16:18:56Z
[INFO] Final Memory: 368M/1969M
[INFO] ------------------------------------------------------------------------
[ERROR] Failed to execute goal org.apache.maven.plugins:maven-failsafe-plugin:2.19.1:verify
(verify) on project atlas-webapp: There are test failures.
[ERROR] 
[ERROR] Please refer to <https://builds.apache.org/job/apache-atlas-nightly/ws/webapp/target/failsafe-reports>
for the individual test results.
[ERROR] -> [Help 1]
[ERROR] 
[ERROR] To see the full stack trace of the errors, re-run Maven with the -e switch.
[ERROR] Re-run Maven using the -X switch to enable full debug logging.
[ERROR] 
[ERROR] For more information about the errors and possible solutions, please read the following
articles:
[ERROR] [Help 1] http://cwiki.apache.org/confluence/display/MAVEN/MojoFailureException
[ERROR] 
[ERROR] After correcting the problems, you can resume the build with the command
[ERROR]   mvn <goals> -rf :atlas-webapp
Build step 'Execute shell' marked build as failure
[CHECKSTYLE] Collecting checkstyle analysis files...
[CHECKSTYLE] Searching for all files in <https://builds.apache.org/job/apache-atlas-nightly/ws/>
that match the pattern **/target/checkstyle-result.xml
[CHECKSTYLE] Parsing 19 files in <https://builds.apache.org/job/apache-atlas-nightly/ws/>
[CHECKSTYLE] Successfully parsed file <https://builds.apache.org/job/apache-atlas-nightly/ws/authorization/target/checkstyle-result.xml>
with 465 unique warnings and 0 duplicates.
[CHECKSTYLE] Successfully parsed file <https://builds.apache.org/job/apache-atlas-nightly/ws/catalog/target/checkstyle-result.xml>
with 2610 unique warnings and 0 duplicates.
[CHECKSTYLE] Successfully parsed file <https://builds.apache.org/job/apache-atlas-nightly/ws/client/target/checkstyle-result.xml>
with 4184 unique warnings and 0 duplicates.
[CHECKSTYLE] Successfully parsed file <https://builds.apache.org/job/apache-atlas-nightly/ws/common/target/checkstyle-result.xml>
with 5387 unique warnings and 0 duplicates.
[CHECKSTYLE] Successfully parsed file <https://builds.apache.org/job/apache-atlas-nightly/ws/dashboardv2/target/checkstyle-result.xml>
with 5387 unique warnings and 0 duplicates.
[CHECKSTYLE] Successfully parsed file <https://builds.apache.org/job/apache-atlas-nightly/ws/graphdb/api/target/checkstyle-result.xml>
with 5635 unique warnings and 0 duplicates.
[CHECKSTYLE] Successfully parsed file <https://builds.apache.org/job/apache-atlas-nightly/ws/graphdb/common/target/checkstyle-result.xml>
with 5801 unique warnings and 0 duplicates.
[CHECKSTYLE] Successfully parsed file <https://builds.apache.org/job/apache-atlas-nightly/ws/graphdb/graphdb-impls/target/checkstyle-result.xml>
with 5801 unique warnings and 0 duplicates.
[CHECKSTYLE] Successfully parsed file <https://builds.apache.org/job/apache-atlas-nightly/ws/graphdb/target/checkstyle-result.xml>
with 5801 unique warnings and 0 duplicates.
[CHECKSTYLE] Successfully parsed file <https://builds.apache.org/job/apache-atlas-nightly/ws/graphdb/titan0/target/checkstyle-result.xml>
with 8031 unique warnings and 0 duplicates.
[CHECKSTYLE] Successfully parsed file <https://builds.apache.org/job/apache-atlas-nightly/ws/graphdb/titan1/target/checkstyle-result.xml>
with 8944 unique warnings and 0 duplicates.
[CHECKSTYLE] Successfully parsed file <https://builds.apache.org/job/apache-atlas-nightly/ws/intg/target/checkstyle-result.xml>
with 15429 unique warnings and 0 duplicates.
[CHECKSTYLE] Successfully parsed file <https://builds.apache.org/job/apache-atlas-nightly/ws/notification/target/checkstyle-result.xml>
with 16610 unique warnings and 0 duplicates.
[CHECKSTYLE] Successfully parsed file <https://builds.apache.org/job/apache-atlas-nightly/ws/repository/target/checkstyle-result.xml>
with 33299 unique warnings and 0 duplicates.
[CHECKSTYLE] Successfully parsed file <https://builds.apache.org/job/apache-atlas-nightly/ws/server-api/target/checkstyle-result.xml>
with 33678 unique warnings and 0 duplicates.
[CHECKSTYLE] Successfully parsed file <https://builds.apache.org/job/apache-atlas-nightly/ws/shaded/hbase-client-shaded/target/checkstyle-result.xml>
with 33678 unique warnings and 0 duplicates.
[CHECKSTYLE] Successfully parsed file <https://builds.apache.org/job/apache-atlas-nightly/ws/shaded/hbase-server-shaded/target/checkstyle-result.xml>
with 33678 unique warnings and 0 duplicates.
[CHECKSTYLE] Successfully parsed file <https://builds.apache.org/job/apache-atlas-nightly/ws/target/checkstyle-result.xml>
with 33678 unique warnings and 0 duplicates.
[CHECKSTYLE] Successfully parsed file <https://builds.apache.org/job/apache-atlas-nightly/ws/typesystem/target/checkstyle-result.xml>
with 37896 unique warnings and 0 duplicates.
[CHECKSTYLE] Computing warning deltas based on reference build #711
[FINDBUGS] Collecting findbugs analysis files...
[FINDBUGS] Searching for all files in <https://builds.apache.org/job/apache-atlas-nightly/ws/>
that match the pattern **/target/findbugs.xml
[FINDBUGS] Parsing 12 files in <https://builds.apache.org/job/apache-atlas-nightly/ws/>
[FINDBUGS] Successfully parsed file <https://builds.apache.org/job/apache-atlas-nightly/ws/authorization/target/findbugs.xml>
with 0 unique warnings and 0 duplicates.
[FINDBUGS] Successfully parsed file <https://builds.apache.org/job/apache-atlas-nightly/ws/catalog/target/findbugs.xml>
with 0 unique warnings and 0 duplicates.
[FINDBUGS] Successfully parsed file <https://builds.apache.org/job/apache-atlas-nightly/ws/client/target/findbugs.xml>
with 0 unique warnings and 0 duplicates.
[FINDBUGS] Successfully parsed file <https://builds.apache.org/job/apache-atlas-nightly/ws/common/target/findbugs.xml>
with 0 unique warnings and 0 duplicates.
[FINDBUGS] Successfully parsed file <https://builds.apache.org/job/apache-atlas-nightly/ws/graphdb/api/target/findbugs.xml>
with 0 unique warnings and 0 duplicates.
[FINDBUGS] Successfully parsed file <https://builds.apache.org/job/apache-atlas-nightly/ws/graphdb/common/target/findbugs.xml>
with 0 unique warnings and 0 duplicates.
[FINDBUGS] Successfully parsed file <https://builds.apache.org/job/apache-atlas-nightly/ws/graphdb/titan0/target/findbugs.xml>
with 0 unique warnings and 0 duplicates.
[FINDBUGS] Successfully parsed file <https://builds.apache.org/job/apache-atlas-nightly/ws/intg/target/findbugs.xml>
with 0 unique warnings and 0 duplicates.
[FINDBUGS] Successfully parsed file <https://builds.apache.org/job/apache-atlas-nightly/ws/notification/target/findbugs.xml>
with 0 unique warnings and 0 duplicates.
[FINDBUGS] Successfully parsed file <https://builds.apache.org/job/apache-atlas-nightly/ws/repository/target/findbugs.xml>
with 0 unique warnings and 0 duplicates.
[FINDBUGS] Successfully parsed file <https://builds.apache.org/job/apache-atlas-nightly/ws/server-api/target/findbugs.xml>
with 0 unique warnings and 0 duplicates.
[FINDBUGS] Successfully parsed file <https://builds.apache.org/job/apache-atlas-nightly/ws/typesystem/target/findbugs.xml>
with 0 unique warnings and 0 duplicates.
[FINDBUGS] Computing warning deltas based on reference build #711
Archiving artifacts
No artifacts from apache-atlas-nightly #711 to compare, so performing full copy of artifacts
TestNG Reports Processing: START
Looking for TestNG results report in workspace using pattern: **/target/surefire-reports/testng-results.xml,**/target/failsafe-reports/testng-results.xml
Saving reports...
Processing '/x1/jenkins/jenkins-home/jobs/apache-atlas-nightly/builds/776/testng/testng-results-1.xml'
Processing '/x1/jenkins/jenkins-home/jobs/apache-atlas-nightly/builds/776/testng/testng-results-10.xml'
Processing '/x1/jenkins/jenkins-home/jobs/apache-atlas-nightly/builds/776/testng/testng-results-2.xml'
Processing '/x1/jenkins/jenkins-home/jobs/apache-atlas-nightly/builds/776/testng/testng-results-3.xml'
Processing '/x1/jenkins/jenkins-home/jobs/apache-atlas-nightly/builds/776/testng/testng-results-4.xml'
Processing '/x1/jenkins/jenkins-home/jobs/apache-atlas-nightly/builds/776/testng/testng-results-5.xml'
Processing '/x1/jenkins/jenkins-home/jobs/apache-atlas-nightly/builds/776/testng/testng-results-6.xml'
Processing '/x1/jenkins/jenkins-home/jobs/apache-atlas-nightly/builds/776/testng/testng-results-7.xml'
Processing '/x1/jenkins/jenkins-home/jobs/apache-atlas-nightly/builds/776/testng/testng-results-8.xml'
Processing '/x1/jenkins/jenkins-home/jobs/apache-atlas-nightly/builds/776/testng/testng-results-9.xml'
Processing '/x1/jenkins/jenkins-home/jobs/apache-atlas-nightly/builds/776/testng/testng-results.xml'
0.188324% of tests failed, which exceeded threshold of 0%. Marking build as UNSTABLE
TestNG Reports Processing: FINISH

Mime
View raw message