atlas-dev mailing list archives

Site index · List index
Message view « Date » · « Thread »
Top « Date » · « Thread »
From Apache Jenkins Server <jenk...@builds.apache.org>
Subject Build failed in Jenkins: apache-atlas-nightly #771
Date Thu, 08 Jun 2017 20:19:50 GMT
See <https://builds.apache.org/job/apache-atlas-nightly/771/display/redirect?page=changes>

Changes:

[nixon] ATLAS-1804: Testcase fix for PAM authentication

------------------------------------------
[...truncated 538.96 KB...]
127.0.0.1 - - [08/Jun/2017:20:15:49 +0000] "GET /api/atlas/entities/3a1a7e45-0356-406e-89f0-3e9502e75751/traitDefinitions/PII_TraitUp2RcaDzJu
HTTP/1.1" 200 - "-" "Java/1.7.0_80"
127.0.0.1 - - [08/Jun/2017:20:15:49 +0000] "GET /api/atlas/entities/3a1a7e45-0356-406e-89f0-3e9502e75751/traitDefinitions
HTTP/1.1" 200 - "-" "Java/1.7.0_80"
127.0.0.1 - - [08/Jun/2017:20:15:49 +0000] "POST /api/atlas/entities HTTP/1.1" 201 - "-" "Java/1.7.0_80"
127.0.0.1 - - [08/Jun/2017:20:15:49 +0000] "POST /api/atlas/entities HTTP/1.1" 201 - "-" "Java/1.7.0_80"
127.0.0.1 - - [08/Jun/2017:20:15:49 +0000] "GET /api/atlas/entities/e5fd3978-107b-4f6f-b817-c2d1db12eee4/traits
HTTP/1.1" 200 - "-" "Java/1.7.0_80"
127.0.0.1 - - [08/Jun/2017:20:15:49 +0000] "POST /api/atlas/entities HTTP/1.1" 201 - "-" "Java/1.7.0_80"
127.0.0.1 - - [08/Jun/2017:20:15:49 +0000] "POST /api/atlas/entities HTTP/1.1" 201 - "-" "Java/1.7.0_80"
127.0.0.1 - - [08/Jun/2017:20:15:49 +0000] "POST /api/atlas/entities/b0d18128-09ec-4b42-ae97-a53f356c4ac4
HTTP/1.1" 200 - "-" "Java/1.7.0_80"
127.0.0.1 - - [08/Jun/2017:20:15:49 +0000] "GET /api/atlas/entities/b0d18128-09ec-4b42-ae97-a53f356c4ac4
HTTP/1.1" 200 - "-" "Java/1.7.0_80"
127.0.0.1 - - [08/Jun/2017:20:15:49 +0000] "POST /api/atlas/entities/qualifiedName?type=hive_table&property=qualifiedName&value=tableCTGP5AyvaO
HTTP/1.1" 200 - "-" "Java/1.7.0_80"
127.0.0.1 - - [08/Jun/2017:20:15:49 +0000] "GET /api/atlas/entities/b0d18128-09ec-4b42-ae97-a53f356c4ac4
HTTP/1.1" 200 - "-" "Java/1.7.0_80"
127.0.0.1 - - [08/Jun/2017:20:15:49 +0000] "POST /api/atlas/entities HTTP/1.1" 201 - "-" "Java/1.7.0_80"
127.0.0.1 - - [08/Jun/2017:20:15:49 +0000] "GET /api/atlas/entities/2543e6ef-6617-4833-9e89-fed9e3205258/audit?count=10
HTTP/1.1" 200 - "-" "Java/1.7.0_80"
127.0.0.1 - - [08/Jun/2017:20:15:49 +0000] "POST /api/atlas/entities HTTP/1.1" 201 - "-" "Java/1.7.0_80"
127.0.0.1 - - [08/Jun/2017:20:15:49 +0000] "POST /api/atlas/entities HTTP/1.1" 201 - "-" "Java/1.7.0_80"
127.0.0.1 - - [08/Jun/2017:20:15:49 +0000] "POST /api/atlas/entities HTTP/1.1" 201 - "-" "Java/1.7.0_80"
127.0.0.1 - - [08/Jun/2017:20:15:49 +0000] "POST /api/atlas/entities HTTP/1.1" 400 - "-" "Java/1.7.0_80"
127.0.0.1 - - [08/Jun/2017:20:15:49 +0000] "POST /api/atlas/entities HTTP/1.1" 201 - "-" "Java/1.7.0_80"
127.0.0.1 - - [08/Jun/2017:20:15:49 +0000] "GET /api/atlas/v2/types/typedef/name/dIemJCOv8B
HTTP/1.1" 404 - "-" "Java/1.7.0_80"
127.0.0.1 - - [08/Jun/2017:20:15:49 +0000] "POST /api/atlas/types HTTP/1.1" 201 - "-" "Java/1.7.0_80"
127.0.0.1 - - [08/Jun/2017:20:15:50 +0000] "POST /api/atlas/entities HTTP/1.1" 201 - "-" "Java/1.7.0_80"
127.0.0.1 - - [08/Jun/2017:20:15:50 +0000] "GET /api/atlas/entities/6dc4cefa-c5f2-4502-aca2-cd0f70ba059d
HTTP/1.1" 200 - "-" "Java/1.7.0_80"
127.0.0.1 - - [08/Jun/2017:20:15:50 +0000] "GET /api/atlas/v2/entity/guid/5bf366cd-ee24-4ac3-a893-374cfbf29d41
HTTP/1.1" 200 - "-" "Java/1.7.0_80"
127.0.0.1 - - [08/Jun/2017:20:15:50 +0000] "POST /api/atlas/v2/entity/ HTTP/1.1" 200 - "-"
"Java/1.7.0_80"
127.0.0.1 - - [08/Jun/2017:20:15:50 +0000] "POST /api/atlas/v2/entity/guid/random/classifications
HTTP/1.1" 404 - "-" "Java/1.7.0_80"
127.0.0.1 - - [08/Jun/2017:20:15:50 +0000] "POST /api/atlas/v2/entity/bulk/ HTTP/1.1" 200
- "-" "Java/1.7.0_80"
127.0.0.1 - - [08/Jun/2017:20:15:50 +0000] "POST /api/atlas/v2/entity/ HTTP/1.1" 200 - "-"
"Java/1.7.0_80"
127.0.0.1 - - [08/Jun/2017:20:15:50 +0000] "POST /api/atlas/v2/entity/ HTTP/1.1" 200 - "-"
"Java/1.7.0_80"
127.0.0.1 - - [08/Jun/2017:20:15:50 +0000] "DELETE /api/atlas/v2/entity/bulk/?guid=5e78a932-f147-4e6f-a13d-25ecd59ab3f3&guid=6baaef8a-8974-4401-8ad2-a5eb6ce10e44
HTTP/1.1" 200 - "-" "Java/1.7.0_80"
127.0.0.1 - - [08/Jun/2017:20:15:50 +0000] "POST /api/atlas/v2/entity/ HTTP/1.1" 200 - "-"
"Java/1.7.0_80"
127.0.0.1 - - [08/Jun/2017:20:15:50 +0000] "DELETE /api/atlas/v2/entity/uniqueAttribute/type/hive_db_v2?attr:name=dbsTBPojJkLI%EE%BB%98%E5%87%BC%E9%82%A7%ED%90%AC%E7%9D%B2%EB%96%81%F0%97%9F%B5%EB%A1%96%E2%96%A3
HTTP/1.1" 200 - "-" "Java/1.7.0_80"
127.0.0.1 - - [08/Jun/2017:20:15:50 +0000] "DELETE /api/atlas/v2/entity/guid/random/classification/blah_trait
HTTP/1.1" 400 - "-" "Java/1.7.0_80"
127.0.0.1 - - [08/Jun/2017:20:15:50 +0000] "GET /api/atlas/discovery/search/dsl?query=hive_db_v2+where+name%3D'dbsTBPojJkLI'&limit=10&offset=0
HTTP/1.1" 200 - "-" "Java/1.7.0_80"
127.0.0.1 - - [08/Jun/2017:20:16:51 +0000] "POST /api/atlas/v2/types/typedefs/ HTTP/1.1" 200
- "-" "Java/1.7.0_80"
127.0.0.1 - - [08/Jun/2017:20:16:51 +0000] "POST /api/atlas/v2/entity/ HTTP/1.1" 200 - "-"
"Java/1.7.0_80"
127.0.0.1 - - [08/Jun/2017:20:16:51 +0000] "PUT /api/atlas/v2/types/typedefs/ HTTP/1.1" 200
- "-" "Java/1.7.0_80"
127.0.0.1 - - [08/Jun/2017:20:16:51 +0000] "GET /api/atlas/v2/entity/guid/29e39e00-a7e5-44de-b4d5-4c007ecf926b
HTTP/1.1" 200 - "-" "Java/1.7.0_80"
127.0.0.1 - - [08/Jun/2017:20:16:51 +0000] "POST /api/atlas/v2/entity/ HTTP/1.1" 404 - "-"
"Java/1.7.0_80"
127.0.0.1 - - [08/Jun/2017:20:16:51 +0000] "POST /api/atlas/v2/entity/ HTTP/1.1" 200 - "-"
"Java/1.7.0_80"
127.0.0.1 - - [08/Jun/2017:20:16:51 +0000] "POST /api/atlas/v2/entity/ HTTP/1.1" 200 - "-"
"Java/1.7.0_80"
127.0.0.1 - - [08/Jun/2017:20:16:51 +0000] "GET /api/atlas/v2/entity/uniqueAttribute/type/hive_db_v2?attr:name=dbsTBPojJkLI
HTTP/1.1" 200 - "-" "Java/1.7.0_80"
127.0.0.1 - - [08/Jun/2017:20:16:51 +0000] "GET /api/atlas/v2/entity/guid/blah HTTP/1.1" 404
- "-" "Java/1.7.0_80"
127.0.0.1 - - [08/Jun/2017:20:16:51 +0000] "POST /api/atlas/v2/entity/ HTTP/1.1" 200 - "-"
"Java/1.7.0_80"
127.0.0.1 - - [08/Jun/2017:20:16:51 +0000] "GET /api/atlas/entities/58603554-c86f-448a-b263-2cff5df5d455/audit?count=10
HTTP/1.1" 200 - "-" "Java/1.7.0_80"
127.0.0.1 - - [08/Jun/2017:20:16:51 +0000] "POST /api/atlas/v2/entity/ HTTP/1.1" 200 - "-"
"Java/1.7.0_80"
127.0.0.1 - - [08/Jun/2017:20:16:51 +0000] "POST /api/atlas/v2/entity/ HTTP/1.1" 200 - "-"
"Java/1.7.0_80"
127.0.0.1 - - [08/Jun/2017:20:16:51 +0000] "GET /api/atlas/v2/types/typedef/name/wlUMnHMkC9
HTTP/1.1" 404 - "-" "Java/1.7.0_80"
127.0.0.1 - - [08/Jun/2017:20:16:52 +0000] "POST /api/atlas/v2/types/typedefs/ HTTP/1.1" 200
- "-" "Java/1.7.0_80"
127.0.0.1 - - [08/Jun/2017:20:16:52 +0000] "POST /api/atlas/v2/entity/ HTTP/1.1" 200 - "-"
"Java/1.7.0_80"
127.0.0.1 - - [08/Jun/2017:20:16:52 +0000] "GET /api/atlas/v2/entity/guid/f3dd4d5a-3dfe-484a-9bf0-37ab11468726
HTTP/1.1" 200 - "-" "Java/1.7.0_80"
127.0.0.1 - - [08/Jun/2017:20:16:52 +0000] "GET /api/atlas/discovery/search/dsl?query=from+hive_db_v1+name%3D%22dbOL3hRgHA4W%22
HTTP/1.1" 200 - "-" "Java/1.7.0_80"
127.0.0.1 - - [08/Jun/2017:20:16:52 +0000] "GET /api/atlas/discovery/search/dsl?query=from+blah
HTTP/1.1" 400 - "-" "Java/1.7.0_80"
127.0.0.1 - - [08/Jun/2017:20:16:52 +0000] "GET /api/atlas/discovery/search?query=* HTTP/1.1"
200 - "-" "Java/1.7.0_80"
127.0.0.1 - - [08/Jun/2017:20:16:53 +0000] "GET /api/atlas/discovery/search?query=from+hive_db_v1+name%3D%22dbOL3hRgHA4W%22
HTTP/1.1" 200 - "-" "Java/1.7.0_80"
127.0.0.1 - - [08/Jun/2017:20:16:53 +0000] "GET /api/atlas/discovery/search/gremlin?query=g.V.has('type',+'hive_table_v1').toList()
HTTP/1.1" 200 - "-" "Java/1.7.0_80"
127.0.0.1 - - [08/Jun/2017:20:16:54 +0000] "GET /api/atlas/v2/types/enumdef/name/blah HTTP/1.1"
404 - "-" "Java/1.7.0_80"
127.0.0.1 - - [08/Jun/2017:20:16:54 +0000] "GET /api/atlas/v2/types/enumdef/guid/blah HTTP/1.1"
404 - "-" "Java/1.7.0_80"
127.0.0.1 - - [08/Jun/2017:20:16:54 +0000] "GET /api/atlas/v2/types/structdef/name/blah HTTP/1.1"
404 - "-" "Java/1.7.0_80"
127.0.0.1 - - [08/Jun/2017:20:16:54 +0000] "GET /api/atlas/v2/types/structdef/guid/blah HTTP/1.1"
404 - "-" "Java/1.7.0_80"
127.0.0.1 - - [08/Jun/2017:20:16:54 +0000] "GET /api/atlas/v2/types/classificationdef/name/blah
HTTP/1.1" 404 - "-" "Java/1.7.0_80"
127.0.0.1 - - [08/Jun/2017:20:16:54 +0000] "GET /api/atlas/v2/types/classificationdef/guid/blah
HTTP/1.1" 404 - "-" "Java/1.7.0_80"
127.0.0.1 - - [08/Jun/2017:20:16:54 +0000] "GET /api/atlas/v2/types/entitydef/name/blah HTTP/1.1"
404 - "-" "Java/1.7.0_80"
127.0.0.1 - - [08/Jun/2017:20:16:54 +0000] "GET /api/atlas/v2/types/entitydef/guid/blah HTTP/1.1"
404 - "-" "Java/1.7.0_80"
127.0.0.1 - - [08/Jun/2017:20:16:54 +0000] "POST /api/atlas/v2/types/typedefs/ HTTP/1.1" 200
- "-" "Java/1.7.0_80"
127.0.0.1 - - [08/Jun/2017:20:16:54 +0000] "PUT /api/atlas/v2/types/typedefs/ HTTP/1.1" 200
- "-" "Java/1.7.0_80"
127.0.0.1 - - [08/Jun/2017:20:16:55 +0000] "GET /api/atlas/v2/types/typedefs/?type=ENTITY
HTTP/1.1" 200 - "-" "Java/1.7.0_80"
127.0.0.1 - - [08/Jun/2017:20:16:55 +0000] "POST /api/atlas/v2/types/typedefs/ HTTP/1.1" 200
- "-" "Java/1.7.0_80"
127.0.0.1 - - [08/Jun/2017:20:16:55 +0000] "GET /api/atlas/v2/types/typedefs/?supertype=AwrR2sdeBRt&type=CLASS
HTTP/1.1" 200 - "-" "Java/1.7.0_80"
127.0.0.1 - - [08/Jun/2017:20:16:55 +0000] "GET /api/atlas/v2/types/typedefs/?notsupertype=BSJeAMj6KQe&supertype=AwrR2sdeBRt&type=CLASS
HTTP/1.1" 200 - "-" "Java/1.7.0_80"
127.0.0.1 - - [08/Jun/2017:20:16:55 +0000] "POST /api/atlas/v2/types/typedefs/ HTTP/1.1" 200
- "-" "Java/1.7.0_80"
127.0.0.1 - - [08/Jun/2017:20:16:55 +0000] "POST /api/atlas/v2/types/typedefs/ HTTP/1.1" 409
- "-" "Java/1.7.0_80"
127.0.0.1 - - [08/Jun/2017:20:16:55 +0000] "POST /api/atlas/types HTTP/1.1" 201 - "-" "Java/1.7.0_80"
127.0.0.1 - - [08/Jun/2017:20:16:55 +0000] "POST /api/atlas/types HTTP/1.1" 409 - "-" "Java/1.7.0_80"
127.0.0.1 - - [08/Jun/2017:20:16:55 +0000] "GET /api/atlas/types/blah HTTP/1.1" 404 - "-"
"Java/1.7.0_80"
127.0.0.1 - - [08/Jun/2017:20:16:55 +0000] "GET /api/atlas/v2/types/typedef/name/class_trait
HTTP/1.1" 404 - "-" "Java/1.7.0_80"
127.0.0.1 - - [08/Jun/2017:20:16:55 +0000] "POST /api/atlas/types HTTP/1.1" 201 - "-" "Java/1.7.0_80"
127.0.0.1 - - [08/Jun/2017:20:16:55 +0000] "GET /api/atlas/v2/types/typedef/name/secure_trait
HTTP/1.1" 404 - "-" "Java/1.7.0_80"
127.0.0.1 - - [08/Jun/2017:20:16:55 +0000] "POST /api/atlas/types HTTP/1.1" 201 - "-" "Java/1.7.0_80"
127.0.0.1 - - [08/Jun/2017:20:16:55 +0000] "GET /api/atlas/v2/types/typedef/name/pii_trait
HTTP/1.1" 404 - "-" "Java/1.7.0_80"
127.0.0.1 - - [08/Jun/2017:20:16:55 +0000] "POST /api/atlas/types HTTP/1.1" 201 - "-" "Java/1.7.0_80"
127.0.0.1 - - [08/Jun/2017:20:16:55 +0000] "GET /api/atlas/v2/types/typedef/name/ssn_trait
HTTP/1.1" 404 - "-" "Java/1.7.0_80"
127.0.0.1 - - [08/Jun/2017:20:16:55 +0000] "POST /api/atlas/types HTTP/1.1" 201 - "-" "Java/1.7.0_80"
127.0.0.1 - - [08/Jun/2017:20:16:55 +0000] "GET /api/atlas/v2/types/typedef/name/salary_trait
HTTP/1.1" 404 - "-" "Java/1.7.0_80"
127.0.0.1 - - [08/Jun/2017:20:16:55 +0000] "POST /api/atlas/types HTTP/1.1" 201 - "-" "Java/1.7.0_80"
127.0.0.1 - - [08/Jun/2017:20:16:56 +0000] "GET /api/atlas/v2/types/typedef/name/sox_trait
HTTP/1.1" 404 - "-" "Java/1.7.0_80"
127.0.0.1 - - [08/Jun/2017:20:16:56 +0000] "POST /api/atlas/types HTTP/1.1" 201 - "-" "Java/1.7.0_80"
127.0.0.1 - - [08/Jun/2017:20:16:56 +0000] "GET /api/atlas/types?type=TRAIT HTTP/1.1" 200
- "-" "Java/1.7.0_80"
127.0.0.1 - - [08/Jun/2017:20:16:56 +0000] "GET /api/atlas/v2/types/typedef/name/AagGIov7FNP
HTTP/1.1" 404 - "-" "Java/1.7.0_80"
127.0.0.1 - - [08/Jun/2017:20:16:56 +0000] "POST /api/atlas/types HTTP/1.1" 201 - "-" "Java/1.7.0_80"
127.0.0.1 - - [08/Jun/2017:20:16:56 +0000] "GET /api/atlas/v2/types/typedef/name/A1lzraT9BsJM
HTTP/1.1" 404 - "-" "Java/1.7.0_80"
127.0.0.1 - - [08/Jun/2017:20:16:56 +0000] "POST /api/atlas/types HTTP/1.1" 201 - "-" "Java/1.7.0_80"
127.0.0.1 - - [08/Jun/2017:20:16:56 +0000] "GET /api/atlas/v2/types/typedef/name/BCMsm288G7v
HTTP/1.1" 404 - "-" "Java/1.7.0_80"
127.0.0.1 - - [08/Jun/2017:20:16:56 +0000] "POST /api/atlas/types HTTP/1.1" 201 - "-" "Java/1.7.0_80"
127.0.0.1 - - [08/Jun/2017:20:16:56 +0000] "GET /api/atlas/v2/types/typedef/name/CPXuSOOdnIT
HTTP/1.1" 404 - "-" "Java/1.7.0_80"
127.0.0.1 - - [08/Jun/2017:20:16:56 +0000] "POST /api/atlas/types HTTP/1.1" 201 - "-" "Java/1.7.0_80"
127.0.0.1 - - [08/Jun/2017:20:16:56 +0000] "GET /api/atlas/types?type=CLASS&supertype=AagGIov7FNP&notsupertype=BCMsm288G7v
HTTP/1.1" 200 - "-" "Java/1.7.0_80"
127.0.0.1 - - [08/Jun/2017:20:16:56 +0000] "POST /api/atlas/types HTTP/1.1" 201 - "-" "Java/1.7.0_80"
127.0.0.1 - - [08/Jun/2017:20:16:56 +0000] "PUT /api/atlas/types HTTP/1.1" 200 - "-" "Java/1.7.0_80"
127.0.0.1 - - [08/Jun/2017:20:16:56 +0000] "GET /api/atlas/types/iKl7HJ5DfD HTTP/1.1" 200
- "-" "Java/1.7.0_80"
Tests run: 134, Failures: 2, Errors: 0, Skipped: 5, Time elapsed: 173.59 sec <<<
FAILURE! - in TestSuite
runQuickStart(org.apache.atlas.examples.QuickStartV2IT)  Time elapsed: 0.518 sec  <<<
FAILURE!
org.apache.atlas.AtlasServiceException: Metadata service API org.apache.atlas.AtlasBaseClient$APIInfo@5217905e
failed with status 409 (Conflict) Response Body ({"errorCode":"ATLAS-409-00-001","errorMessage":"Given
type Dimension already exists"})
	at org.apache.atlas.examples.QuickStartV2IT.runQuickStart(QuickStartV2IT.java:49)

testEntityDeduping(org.apache.atlas.web.integration.EntityV2JerseyResourceIT)  Time elapsed:
60.901 sec  <<< FAILURE!
java.lang.Exception: Waiting timed out after 60000 msec
	at org.apache.atlas.web.integration.EntityV2JerseyResourceIT.testEntityDeduping(EntityV2JerseyResourceIT.java:170)


Results :

Failed tests: 
  QuickStartV2IT.runQuickStart:49 » AtlasService Metadata service API org.apache...
  EntityV2JerseyResourceIT.testEntityDeduping:170->BaseResourceIT.waitForNotification:633->BaseResourceIT.waitFor:625
» 

Tests run: 134, Failures: 2, Errors: 0, Skipped: 5

[INFO] 
[INFO] --- jetty-maven-plugin:9.2.12.v20150709:stop (stop-jetty) @ atlas-webapp ---
[INFO] Waiting 10 seconds for jetty to stop
[INFO] Stopped ServerConnector@693d5725{HTTP/1.1}{0.0.0.0:31000}
[INFO] Closing Spring root WebApplicationContext
[INFO] Shutting down log4j
[INFO] Stopped o.e.j.m.p.JettyWebAppContext@1834fff3{/,<https://builds.apache.org/job/apache-atlas-nightly/ws/webapp/target/atlas-webapp-0.9-incubating-SNAPSHOT/,UNAVAILABLE}{/home/jenkins/jenkins-slave/workspace/apache-atlas-nightly/webapp/target/atlas-webapp-0.9-incubating-SNAPSHOT.war}>
[INFO] Server reports itself as stopped
[INFO] 
[INFO] --- maven-source-plugin:2.4:jar-no-fork (attach-sources) @ atlas-webapp ---
[INFO] Building jar: <https://builds.apache.org/job/apache-atlas-nightly/ws/webapp/target/atlas-webapp-0.9-incubating-SNAPSHOT-sources.jar>
[INFO] 
[INFO] --- maven-source-plugin:2.4:test-jar-no-fork (attach-sources) @ atlas-webapp ---
[INFO] Building jar: <https://builds.apache.org/job/apache-atlas-nightly/ws/webapp/target/atlas-webapp-0.9-incubating-SNAPSHOT-test-sources.jar>
[INFO] 
[INFO] --- maven-failsafe-plugin:2.19.1:verify (verify) @ atlas-webapp ---
[INFO] ------------------------------------------------------------------------
[INFO] Reactor Summary:
[INFO] 
[INFO] Apache Atlas Server Build Tools .................... SUCCESS [  0.971 s]
[INFO] apache-atlas ....................................... SUCCESS [  9.618 s]
[INFO] Apache Atlas Integration ........................... SUCCESS [ 32.134 s]
[INFO] Apache Atlas Common ................................ SUCCESS [ 15.570 s]
[INFO] Apache Atlas Typesystem ............................ SUCCESS [01:08 min]
[INFO] Apache Atlas Client ................................ SUCCESS [ 19.672 s]
[INFO] Apache Atlas Server API ............................ SUCCESS [ 10.090 s]
[INFO] Apache Atlas Notification .......................... SUCCESS [ 20.985 s]
[INFO] Apache Atlas Graph Database Projects ............... SUCCESS [  0.612 s]
[INFO] Apache Atlas Graph Database API .................... SUCCESS [  7.101 s]
[INFO] Graph Database Common Code ......................... SUCCESS [  7.054 s]
[INFO] Apache Atlas Titan 1.0.0 GraphDB Impl .............. SUCCESS [ 32.253 s]
[INFO] Shaded version of Apache hbase client .............. SUCCESS [  8.385 s]
[INFO] Apache Atlas Titan 0.5.4 Graph DB Impl ............. SUCCESS [01:19 min]
[INFO] Apache Atlas Graph Database Implementation Dependencies SUCCESS [  0.842 s]
[INFO] Shaded version of Apache hbase server .............. SUCCESS [ 22.991 s]
[INFO] Apache Atlas Repository ............................ SUCCESS [06:00 min]
[INFO] Apache Atlas Authorization ......................... SUCCESS [ 12.508 s]
[INFO] Apache Atlas Business Catalog ...................... SUCCESS [ 18.627 s]
[INFO] Apache Atlas UI .................................... SUCCESS [ 53.409 s]
[INFO] Apache Atlas Web Application ....................... FAILURE [07:40 min]
[INFO] Apache Atlas Documentation ......................... SKIPPED
[INFO] Apache Atlas FileSystem Model ...................... SKIPPED
[INFO] Apache Atlas Plugin Classloader .................... SKIPPED
[INFO] Apache Atlas Hive Bridge Shim ...................... SKIPPED
[INFO] Apache Atlas Hive Bridge ........................... SKIPPED
[INFO] Apache Atlas Falcon Bridge Shim .................... SKIPPED
[INFO] Apache Atlas Falcon Bridge ......................... SKIPPED
[INFO] Apache Atlas Sqoop Bridge Shim ..................... SKIPPED
[INFO] Apache Atlas Sqoop Bridge .......................... SKIPPED
[INFO] Apache Atlas Storm Bridge Shim ..................... SKIPPED
[INFO] Apache Atlas Storm Bridge .......................... SKIPPED
[INFO] Apache Atlas Distribution .......................... SKIPPED
[INFO] ------------------------------------------------------------------------
[INFO] BUILD FAILURE
[INFO] ------------------------------------------------------------------------
[INFO] Total time: 20:44 min
[INFO] Finished at: 2017-06-08T20:17:03Z
[INFO] Final Memory: 366M/1742M
[INFO] ------------------------------------------------------------------------
log4j:WARN No appenders could be found for logger (org.apache.zookeeper.ClientCnxn).
log4j:WARN Please initialize the log4j system properly.
log4j:WARN See http://logging.apache.org/log4j/1.2/faq.html#noconfig for more info.
[ERROR] Failed to execute goal org.apache.maven.plugins:maven-failsafe-plugin:2.19.1:verify
(verify) on project atlas-webapp: There are test failures.
[ERROR] 
[ERROR] Please refer to <https://builds.apache.org/job/apache-atlas-nightly/ws/webapp/target/failsafe-reports>
for the individual test results.
[ERROR] -> [Help 1]
[ERROR] 
[ERROR] To see the full stack trace of the errors, re-run Maven with the -e switch.
[ERROR] Re-run Maven using the -X switch to enable full debug logging.
[ERROR] 
[ERROR] For more information about the errors and possible solutions, please read the following
articles:
[ERROR] [Help 1] http://cwiki.apache.org/confluence/display/MAVEN/MojoFailureException
[ERROR] 
[ERROR] After correcting the problems, you can resume the build with the command
[ERROR]   mvn <goals> -rf :atlas-webapp
Build step 'Execute shell' marked build as failure
[CHECKSTYLE] Collecting checkstyle analysis files...
[CHECKSTYLE] Searching for all files in <https://builds.apache.org/job/apache-atlas-nightly/ws/>
that match the pattern **/target/checkstyle-result.xml
[CHECKSTYLE] Parsing 19 files in <https://builds.apache.org/job/apache-atlas-nightly/ws/>
[CHECKSTYLE] Successfully parsed file <https://builds.apache.org/job/apache-atlas-nightly/ws/authorization/target/checkstyle-result.xml>
with 465 unique warnings and 0 duplicates.
[CHECKSTYLE] Successfully parsed file <https://builds.apache.org/job/apache-atlas-nightly/ws/catalog/target/checkstyle-result.xml>
with 2610 unique warnings and 0 duplicates.
[CHECKSTYLE] Successfully parsed file <https://builds.apache.org/job/apache-atlas-nightly/ws/client/target/checkstyle-result.xml>
with 4184 unique warnings and 0 duplicates.
[CHECKSTYLE] Successfully parsed file <https://builds.apache.org/job/apache-atlas-nightly/ws/common/target/checkstyle-result.xml>
with 5381 unique warnings and 0 duplicates.
[CHECKSTYLE] Successfully parsed file <https://builds.apache.org/job/apache-atlas-nightly/ws/dashboardv2/target/checkstyle-result.xml>
with 5381 unique warnings and 0 duplicates.
[CHECKSTYLE] Successfully parsed file <https://builds.apache.org/job/apache-atlas-nightly/ws/graphdb/api/target/checkstyle-result.xml>
with 5629 unique warnings and 0 duplicates.
[CHECKSTYLE] Successfully parsed file <https://builds.apache.org/job/apache-atlas-nightly/ws/graphdb/common/target/checkstyle-result.xml>
with 5795 unique warnings and 0 duplicates.
[CHECKSTYLE] Successfully parsed file <https://builds.apache.org/job/apache-atlas-nightly/ws/graphdb/graphdb-impls/target/checkstyle-result.xml>
with 5795 unique warnings and 0 duplicates.
[CHECKSTYLE] Successfully parsed file <https://builds.apache.org/job/apache-atlas-nightly/ws/graphdb/target/checkstyle-result.xml>
with 5795 unique warnings and 0 duplicates.
[CHECKSTYLE] Successfully parsed file <https://builds.apache.org/job/apache-atlas-nightly/ws/graphdb/titan0/target/checkstyle-result.xml>
with 8025 unique warnings and 0 duplicates.
[CHECKSTYLE] Successfully parsed file <https://builds.apache.org/job/apache-atlas-nightly/ws/graphdb/titan1/target/checkstyle-result.xml>
with 8938 unique warnings and 0 duplicates.
[CHECKSTYLE] Successfully parsed file <https://builds.apache.org/job/apache-atlas-nightly/ws/intg/target/checkstyle-result.xml>
with 14957 unique warnings and 0 duplicates.
[CHECKSTYLE] Successfully parsed file <https://builds.apache.org/job/apache-atlas-nightly/ws/notification/target/checkstyle-result.xml>
with 16138 unique warnings and 0 duplicates.
[CHECKSTYLE] Successfully parsed file <https://builds.apache.org/job/apache-atlas-nightly/ws/repository/target/checkstyle-result.xml>
with 32621 unique warnings and 0 duplicates.
[CHECKSTYLE] Successfully parsed file <https://builds.apache.org/job/apache-atlas-nightly/ws/server-api/target/checkstyle-result.xml>
with 33000 unique warnings and 0 duplicates.
[CHECKSTYLE] Successfully parsed file <https://builds.apache.org/job/apache-atlas-nightly/ws/shaded/hbase-client-shaded/target/checkstyle-result.xml>
with 33000 unique warnings and 0 duplicates.
[CHECKSTYLE] Successfully parsed file <https://builds.apache.org/job/apache-atlas-nightly/ws/shaded/hbase-server-shaded/target/checkstyle-result.xml>
with 33000 unique warnings and 0 duplicates.
[CHECKSTYLE] Successfully parsed file <https://builds.apache.org/job/apache-atlas-nightly/ws/target/checkstyle-result.xml>
with 33000 unique warnings and 0 duplicates.
[CHECKSTYLE] Successfully parsed file <https://builds.apache.org/job/apache-atlas-nightly/ws/typesystem/target/checkstyle-result.xml>
with 37217 unique warnings and 0 duplicates.
[CHECKSTYLE] Computing warning deltas based on reference build #711
[FINDBUGS] Collecting findbugs analysis files...
[FINDBUGS] Searching for all files in <https://builds.apache.org/job/apache-atlas-nightly/ws/>
that match the pattern **/target/findbugs.xml
[FINDBUGS] Parsing 12 files in <https://builds.apache.org/job/apache-atlas-nightly/ws/>
[FINDBUGS] Successfully parsed file <https://builds.apache.org/job/apache-atlas-nightly/ws/authorization/target/findbugs.xml>
with 0 unique warnings and 0 duplicates.
[FINDBUGS] Successfully parsed file <https://builds.apache.org/job/apache-atlas-nightly/ws/catalog/target/findbugs.xml>
with 0 unique warnings and 0 duplicates.
[FINDBUGS] Successfully parsed file <https://builds.apache.org/job/apache-atlas-nightly/ws/client/target/findbugs.xml>
with 0 unique warnings and 0 duplicates.
[FINDBUGS] Successfully parsed file <https://builds.apache.org/job/apache-atlas-nightly/ws/common/target/findbugs.xml>
with 0 unique warnings and 0 duplicates.
[FINDBUGS] Successfully parsed file <https://builds.apache.org/job/apache-atlas-nightly/ws/graphdb/api/target/findbugs.xml>
with 0 unique warnings and 0 duplicates.
[FINDBUGS] Successfully parsed file <https://builds.apache.org/job/apache-atlas-nightly/ws/graphdb/common/target/findbugs.xml>
with 0 unique warnings and 0 duplicates.
[FINDBUGS] Successfully parsed file <https://builds.apache.org/job/apache-atlas-nightly/ws/graphdb/titan0/target/findbugs.xml>
with 0 unique warnings and 0 duplicates.
[FINDBUGS] Successfully parsed file <https://builds.apache.org/job/apache-atlas-nightly/ws/intg/target/findbugs.xml>
with 0 unique warnings and 0 duplicates.
[FINDBUGS] Successfully parsed file <https://builds.apache.org/job/apache-atlas-nightly/ws/notification/target/findbugs.xml>
with 0 unique warnings and 0 duplicates.
[FINDBUGS] Successfully parsed file <https://builds.apache.org/job/apache-atlas-nightly/ws/repository/target/findbugs.xml>
with 0 unique warnings and 0 duplicates.
[FINDBUGS] Successfully parsed file <https://builds.apache.org/job/apache-atlas-nightly/ws/server-api/target/findbugs.xml>
with 0 unique warnings and 0 duplicates.
[FINDBUGS] Successfully parsed file <https://builds.apache.org/job/apache-atlas-nightly/ws/typesystem/target/findbugs.xml>
with 0 unique warnings and 0 duplicates.
[FINDBUGS] Computing warning deltas based on reference build #711
Archiving artifacts
TestNG Reports Processing: START
Looking for TestNG results report in workspace using pattern: **/target/surefire-reports/testng-results.xml,**/target/failsafe-reports/testng-results.xml
Saving reports...
Processing '/x1/jenkins/jenkins-home/jobs/apache-atlas-nightly/builds/771/testng/testng-results-1.xml'
Processing '/x1/jenkins/jenkins-home/jobs/apache-atlas-nightly/builds/771/testng/testng-results-10.xml'
Processing '/x1/jenkins/jenkins-home/jobs/apache-atlas-nightly/builds/771/testng/testng-results-2.xml'
Processing '/x1/jenkins/jenkins-home/jobs/apache-atlas-nightly/builds/771/testng/testng-results-3.xml'
Processing '/x1/jenkins/jenkins-home/jobs/apache-atlas-nightly/builds/771/testng/testng-results-4.xml'
Processing '/x1/jenkins/jenkins-home/jobs/apache-atlas-nightly/builds/771/testng/testng-results-5.xml'
Processing '/x1/jenkins/jenkins-home/jobs/apache-atlas-nightly/builds/771/testng/testng-results-6.xml'
Processing '/x1/jenkins/jenkins-home/jobs/apache-atlas-nightly/builds/771/testng/testng-results-7.xml'
Processing '/x1/jenkins/jenkins-home/jobs/apache-atlas-nightly/builds/771/testng/testng-results-8.xml'
Processing '/x1/jenkins/jenkins-home/jobs/apache-atlas-nightly/builds/771/testng/testng-results-9.xml'
Processing '/x1/jenkins/jenkins-home/jobs/apache-atlas-nightly/builds/771/testng/testng-results.xml'
0.188324% of tests failed, which exceeded threshold of 0%. Marking build as UNSTABLE
TestNG Reports Processing: FINISH

Mime
View raw message