atlas-dev mailing list archives

Site index · List index
Message view « Date » · « Thread »
Top « Date » · « Thread »
From Apache Jenkins Server <jenk...@builds.apache.org>
Subject Build failed in Jenkins: apache-atlas-nightly #780
Date Tue, 20 Jun 2017 04:19:23 GMT
See <https://builds.apache.org/job/apache-atlas-nightly/780/display/redirect?page=changes>

Changes:

[madhan] ATLAS-1856: AtlasRelationship instance implementation Java/REST

------------------------------------------
[...truncated 542.54 KB...]
127.0.0.1 - - [20/Jun/2017:04:17:37 +0000] "GET /api/atlas/entities/f50a18be-cba8-402c-bccf-e1ea5b067d77/traitDefinitions
HTTP/1.1" 200 - "-" "Java/1.7.0_80"
127.0.0.1 - - [20/Jun/2017:04:17:37 +0000] "POST /api/atlas/entities HTTP/1.1" 201 - "-" "Java/1.7.0_80"
127.0.0.1 - - [20/Jun/2017:04:17:37 +0000] "POST /api/atlas/entities HTTP/1.1" 201 - "-" "Java/1.7.0_80"
127.0.0.1 - - [20/Jun/2017:04:17:37 +0000] "GET /api/atlas/entities/1b19589d-8ee0-46aa-97b7-f58214682a02/traits
HTTP/1.1" 200 - "-" "Java/1.7.0_80"
127.0.0.1 - - [20/Jun/2017:04:17:37 +0000] "POST /api/atlas/entities HTTP/1.1" 201 - "-" "Java/1.7.0_80"
127.0.0.1 - - [20/Jun/2017:04:17:37 +0000] "POST /api/atlas/entities HTTP/1.1" 201 - "-" "Java/1.7.0_80"
127.0.0.1 - - [20/Jun/2017:04:17:37 +0000] "POST /api/atlas/entities/03ec3127-3588-4404-a573-56efab8007d6
HTTP/1.1" 200 - "-" "Java/1.7.0_80"
127.0.0.1 - - [20/Jun/2017:04:17:37 +0000] "GET /api/atlas/entities/03ec3127-3588-4404-a573-56efab8007d6
HTTP/1.1" 200 - "-" "Java/1.7.0_80"
127.0.0.1 - - [20/Jun/2017:04:17:37 +0000] "POST /api/atlas/entities/qualifiedName?type=hive_table&property=qualifiedName&value=tableY6gv0GgiYj
HTTP/1.1" 200 - "-" "Java/1.7.0_80"
127.0.0.1 - - [20/Jun/2017:04:17:37 +0000] "GET /api/atlas/entities/03ec3127-3588-4404-a573-56efab8007d6
HTTP/1.1" 200 - "-" "Java/1.7.0_80"
127.0.0.1 - - [20/Jun/2017:04:17:38 +0000] "POST /api/atlas/entities HTTP/1.1" 201 - "-" "Java/1.7.0_80"
127.0.0.1 - - [20/Jun/2017:04:17:38 +0000] "GET /api/atlas/entities/b17c8d50-5371-458d-bbb8-55d016b119e1/audit?count=10
HTTP/1.1" 200 - "-" "Java/1.7.0_80"
127.0.0.1 - - [20/Jun/2017:04:17:38 +0000] "POST /api/atlas/entities HTTP/1.1" 201 - "-" "Java/1.7.0_80"
127.0.0.1 - - [20/Jun/2017:04:17:38 +0000] "POST /api/atlas/entities HTTP/1.1" 201 - "-" "Java/1.7.0_80"
127.0.0.1 - - [20/Jun/2017:04:17:38 +0000] "POST /api/atlas/entities HTTP/1.1" 201 - "-" "Java/1.7.0_80"
127.0.0.1 - - [20/Jun/2017:04:17:38 +0000] "POST /api/atlas/entities HTTP/1.1" 400 - "-" "Java/1.7.0_80"
127.0.0.1 - - [20/Jun/2017:04:17:38 +0000] "POST /api/atlas/entities HTTP/1.1" 201 - "-" "Java/1.7.0_80"
127.0.0.1 - - [20/Jun/2017:04:17:38 +0000] "GET /api/atlas/v2/types/typedef/name/KYyiumAaHi
HTTP/1.1" 404 - "-" "Java/1.7.0_80"
127.0.0.1 - - [20/Jun/2017:04:17:38 +0000] "POST /api/atlas/types HTTP/1.1" 201 - "-" "Java/1.7.0_80"
127.0.0.1 - - [20/Jun/2017:04:17:38 +0000] "POST /api/atlas/entities HTTP/1.1" 201 - "-" "Java/1.7.0_80"
127.0.0.1 - - [20/Jun/2017:04:17:38 +0000] "GET /api/atlas/entities/0442a6b8-c04b-458c-8c0a-595454b4e264
HTTP/1.1" 200 - "-" "Java/1.7.0_80"
127.0.0.1 - - [20/Jun/2017:04:17:38 +0000] "GET /api/atlas/v2/entity/guid/fed95acf-03b5-48d0-8f0a-7a01d0224af3
HTTP/1.1" 200 - "-" "Java/1.7.0_80"
127.0.0.1 - - [20/Jun/2017:04:17:38 +0000] "POST /api/atlas/v2/entity/ HTTP/1.1" 200 - "-"
"Java/1.7.0_80"
127.0.0.1 - - [20/Jun/2017:04:17:38 +0000] "POST /api/atlas/v2/entity/guid/random/classifications
HTTP/1.1" 404 - "-" "Java/1.7.0_80"
127.0.0.1 - - [20/Jun/2017:04:17:38 +0000] "POST /api/atlas/v2/entity/bulk/ HTTP/1.1" 200
- "-" "Java/1.7.0_80"
127.0.0.1 - - [20/Jun/2017:04:17:38 +0000] "POST /api/atlas/v2/entity/ HTTP/1.1" 200 - "-"
"Java/1.7.0_80"
127.0.0.1 - - [20/Jun/2017:04:17:38 +0000] "POST /api/atlas/v2/entity/ HTTP/1.1" 200 - "-"
"Java/1.7.0_80"
127.0.0.1 - - [20/Jun/2017:04:17:38 +0000] "DELETE /api/atlas/v2/entity/bulk/?guid=a5ffb17a-fd87-411a-a06d-8bd1a52b48e9&guid=077480ae-9f57-40bd-be04-aeb43e1aab43
HTTP/1.1" 200 - "-" "Java/1.7.0_80"
127.0.0.1 - - [20/Jun/2017:04:17:38 +0000] "POST /api/atlas/v2/entity/ HTTP/1.1" 200 - "-"
"Java/1.7.0_80"
127.0.0.1 - - [20/Jun/2017:04:17:38 +0000] "DELETE /api/atlas/v2/entity/uniqueAttribute/type/hive_db_v2?attr:name=dbuV4cY5HvaX%E7%B9%99%EC%B7%81%C5%92%E6%B6%A8%E7%8F%93%E8%A1%A4%E9%B7%A9%E6%85%B6%E9%B5%90%EC%96%8E
HTTP/1.1" 200 - "-" "Java/1.7.0_80"
127.0.0.1 - - [20/Jun/2017:04:17:38 +0000] "DELETE /api/atlas/v2/entity/guid/random/classification/blah_trait
HTTP/1.1" 400 - "-" "Java/1.7.0_80"
127.0.0.1 - - [20/Jun/2017:04:17:38 +0000] "GET /api/atlas/discovery/search/dsl?query=hive_db_v2+where+name%3D'dbuV4cY5HvaX'&limit=10&offset=0
HTTP/1.1" 200 - "-" "Java/1.7.0_80"
127.0.0.1 - - [20/Jun/2017:04:18:39 +0000] "POST /api/atlas/v2/types/typedefs/ HTTP/1.1" 200
- "-" "Java/1.7.0_80"
127.0.0.1 - - [20/Jun/2017:04:18:39 +0000] "POST /api/atlas/v2/entity/ HTTP/1.1" 200 - "-"
"Java/1.7.0_80"
127.0.0.1 - - [20/Jun/2017:04:18:39 +0000] "PUT /api/atlas/v2/types/typedefs/ HTTP/1.1" 200
- "-" "Java/1.7.0_80"
127.0.0.1 - - [20/Jun/2017:04:18:39 +0000] "GET /api/atlas/v2/entity/guid/b1e8c34e-abc7-4935-9f57-6ffddf5cd1ac
HTTP/1.1" 200 - "-" "Java/1.7.0_80"
127.0.0.1 - - [20/Jun/2017:04:18:39 +0000] "POST /api/atlas/v2/entity/ HTTP/1.1" 404 - "-"
"Java/1.7.0_80"
127.0.0.1 - - [20/Jun/2017:04:18:39 +0000] "POST /api/atlas/v2/entity/ HTTP/1.1" 200 - "-"
"Java/1.7.0_80"
127.0.0.1 - - [20/Jun/2017:04:18:39 +0000] "POST /api/atlas/v2/entity/ HTTP/1.1" 200 - "-"
"Java/1.7.0_80"
127.0.0.1 - - [20/Jun/2017:04:18:39 +0000] "GET /api/atlas/v2/entity/uniqueAttribute/type/hive_db_v2?attr:name=dbuV4cY5HvaX
HTTP/1.1" 200 - "-" "Java/1.7.0_80"
127.0.0.1 - - [20/Jun/2017:04:18:39 +0000] "POST /api/atlas/v2/entity/ HTTP/1.1" 200 - "-"
"Java/1.7.0_80"
127.0.0.1 - - [20/Jun/2017:04:18:39 +0000] "POST /api/atlas/v2/entity/ HTTP/1.1" 200 - "-"
"Java/1.7.0_80"
127.0.0.1 - - [20/Jun/2017:04:18:40 +0000] "GET /api/atlas/v2/types/typedef/name/aEwE1R0ElK
HTTP/1.1" 404 - "-" "Java/1.7.0_80"
127.0.0.1 - - [20/Jun/2017:04:18:40 +0000] "POST /api/atlas/v2/types/typedefs/ HTTP/1.1" 200
- "-" "Java/1.7.0_80"
127.0.0.1 - - [20/Jun/2017:04:18:40 +0000] "POST /api/atlas/v2/entity/ HTTP/1.1" 200 - "-"
"Java/1.7.0_80"
127.0.0.1 - - [20/Jun/2017:04:18:40 +0000] "GET /api/atlas/v2/entity/guid/b2a912bd-910b-4273-a8be-767c5eda3815
HTTP/1.1" 200 - "-" "Java/1.7.0_80"
127.0.0.1 - - [20/Jun/2017:04:18:40 +0000] "GET /api/atlas/v2/entity/guid/blah HTTP/1.1" 404
- "-" "Java/1.7.0_80"
127.0.0.1 - - [20/Jun/2017:04:18:40 +0000] "POST /api/atlas/v2/entity/ HTTP/1.1" 200 - "-"
"Java/1.7.0_80"
127.0.0.1 - - [20/Jun/2017:04:18:40 +0000] "GET /api/atlas/entities/47c1fe39-d143-4305-866f-e875df57dd15/audit?count=10
HTTP/1.1" 200 - "-" "Java/1.7.0_80"
127.0.0.1 - - [20/Jun/2017:04:18:40 +0000] "GET /api/atlas/discovery/search/dsl?query=from+hive_db_v1+name%3D%22dbTJBmTc71w3%22
HTTP/1.1" 200 - "-" "Java/1.7.0_80"
127.0.0.1 - - [20/Jun/2017:04:18:41 +0000] "GET /api/atlas/discovery/search/dsl?query=from+blah
HTTP/1.1" 400 - "-" "Java/1.7.0_80"
127.0.0.1 - - [20/Jun/2017:04:18:41 +0000] "GET /api/atlas/discovery/search?query=* HTTP/1.1"
200 - "-" "Java/1.7.0_80"
127.0.0.1 - - [20/Jun/2017:04:18:41 +0000] "GET /api/atlas/discovery/search?query=from+hive_db_v1+name%3D%22dbTJBmTc71w3%22
HTTP/1.1" 200 - "-" "Java/1.7.0_80"
127.0.0.1 - - [20/Jun/2017:04:18:41 +0000] "GET /api/atlas/discovery/search/gremlin?query=g.V.has('type',+'hive_table_v1').toList()
HTTP/1.1" 200 - "-" "Java/1.7.0_80"
127.0.0.1 - - [20/Jun/2017:04:18:42 +0000] "POST /api/atlas/v2/types/typedefs/ HTTP/1.1" 200
- "-" "Java/1.7.0_80"
127.0.0.1 - - [20/Jun/2017:04:18:43 +0000] "POST /api/atlas/v2/types/typedefs/ HTTP/1.1" 409
- "-" "Java/1.7.0_80"
127.0.0.1 - - [20/Jun/2017:04:18:43 +0000] "GET /api/atlas/v2/types/enumdef/name/blah HTTP/1.1"
404 - "-" "Java/1.7.0_80"
127.0.0.1 - - [20/Jun/2017:04:18:43 +0000] "GET /api/atlas/v2/types/enumdef/guid/blah HTTP/1.1"
404 - "-" "Java/1.7.0_80"
127.0.0.1 - - [20/Jun/2017:04:18:43 +0000] "GET /api/atlas/v2/types/structdef/name/blah HTTP/1.1"
404 - "-" "Java/1.7.0_80"
127.0.0.1 - - [20/Jun/2017:04:18:43 +0000] "GET /api/atlas/v2/types/structdef/guid/blah HTTP/1.1"
404 - "-" "Java/1.7.0_80"
127.0.0.1 - - [20/Jun/2017:04:18:43 +0000] "GET /api/atlas/v2/types/classificationdef/name/blah
HTTP/1.1" 404 - "-" "Java/1.7.0_80"
127.0.0.1 - - [20/Jun/2017:04:18:43 +0000] "GET /api/atlas/v2/types/classificationdef/guid/blah
HTTP/1.1" 404 - "-" "Java/1.7.0_80"
127.0.0.1 - - [20/Jun/2017:04:18:43 +0000] "GET /api/atlas/v2/types/entitydef/name/blah HTTP/1.1"
404 - "-" "Java/1.7.0_80"
127.0.0.1 - - [20/Jun/2017:04:18:43 +0000] "GET /api/atlas/v2/types/entitydef/guid/blah HTTP/1.1"
404 - "-" "Java/1.7.0_80"
127.0.0.1 - - [20/Jun/2017:04:18:43 +0000] "POST /api/atlas/v2/types/typedefs/ HTTP/1.1" 200
- "-" "Java/1.7.0_80"
127.0.0.1 - - [20/Jun/2017:04:18:43 +0000] "GET /api/atlas/v2/types/typedefs/?supertype=AehIhZLK11m&type=CLASS
HTTP/1.1" 200 - "-" "Java/1.7.0_80"
127.0.0.1 - - [20/Jun/2017:04:18:43 +0000] "GET /api/atlas/v2/types/typedefs/?notsupertype=BRrRJfxNGsL&supertype=AehIhZLK11m&type=CLASS
HTTP/1.1" 200 - "-" "Java/1.7.0_80"
127.0.0.1 - - [20/Jun/2017:04:18:43 +0000] "POST /api/atlas/v2/types/typedefs/ HTTP/1.1" 200
- "-" "Java/1.7.0_80"
127.0.0.1 - - [20/Jun/2017:04:18:43 +0000] "PUT /api/atlas/v2/types/typedefs/ HTTP/1.1" 200
- "-" "Java/1.7.0_80"
127.0.0.1 - - [20/Jun/2017:04:18:43 +0000] "GET /api/atlas/v2/types/typedefs/?type=ENTITY
HTTP/1.1" 200 - "-" "Java/1.7.0_80"
127.0.0.1 - - [20/Jun/2017:04:18:43 +0000] "POST /api/atlas/types HTTP/1.1" 201 - "-" "Java/1.7.0_80"
127.0.0.1 - - [20/Jun/2017:04:18:43 +0000] "POST /api/atlas/types HTTP/1.1" 409 - "-" "Java/1.7.0_80"
127.0.0.1 - - [20/Jun/2017:04:18:43 +0000] "GET /api/atlas/types/blah HTTP/1.1" 404 - "-"
"Java/1.7.0_80"
127.0.0.1 - - [20/Jun/2017:04:18:43 +0000] "GET /api/atlas/v2/types/typedef/name/class_trait
HTTP/1.1" 404 - "-" "Java/1.7.0_80"
127.0.0.1 - - [20/Jun/2017:04:18:43 +0000] "POST /api/atlas/types HTTP/1.1" 201 - "-" "Java/1.7.0_80"
127.0.0.1 - - [20/Jun/2017:04:18:43 +0000] "GET /api/atlas/v2/types/typedef/name/secure_trait
HTTP/1.1" 404 - "-" "Java/1.7.0_80"
127.0.0.1 - - [20/Jun/2017:04:18:43 +0000] "POST /api/atlas/types HTTP/1.1" 201 - "-" "Java/1.7.0_80"
127.0.0.1 - - [20/Jun/2017:04:18:43 +0000] "GET /api/atlas/v2/types/typedef/name/pii_trait
HTTP/1.1" 404 - "-" "Java/1.7.0_80"
127.0.0.1 - - [20/Jun/2017:04:18:43 +0000] "POST /api/atlas/types HTTP/1.1" 201 - "-" "Java/1.7.0_80"
127.0.0.1 - - [20/Jun/2017:04:18:44 +0000] "GET /api/atlas/v2/types/typedef/name/ssn_trait
HTTP/1.1" 404 - "-" "Java/1.7.0_80"
127.0.0.1 - - [20/Jun/2017:04:18:44 +0000] "POST /api/atlas/types HTTP/1.1" 201 - "-" "Java/1.7.0_80"
127.0.0.1 - - [20/Jun/2017:04:18:44 +0000] "GET /api/atlas/v2/types/typedef/name/salary_trait
HTTP/1.1" 404 - "-" "Java/1.7.0_80"
127.0.0.1 - - [20/Jun/2017:04:18:44 +0000] "POST /api/atlas/types HTTP/1.1" 201 - "-" "Java/1.7.0_80"
127.0.0.1 - - [20/Jun/2017:04:18:44 +0000] "GET /api/atlas/v2/types/typedef/name/sox_trait
HTTP/1.1" 404 - "-" "Java/1.7.0_80"
127.0.0.1 - - [20/Jun/2017:04:18:44 +0000] "POST /api/atlas/types HTTP/1.1" 201 - "-" "Java/1.7.0_80"
127.0.0.1 - - [20/Jun/2017:04:18:44 +0000] "GET /api/atlas/types?type=TRAIT HTTP/1.1" 200
- "-" "Java/1.7.0_80"
127.0.0.1 - - [20/Jun/2017:04:18:44 +0000] "GET /api/atlas/v2/types/typedef/name/Aby12A0U83r
HTTP/1.1" 404 - "-" "Java/1.7.0_80"
127.0.0.1 - - [20/Jun/2017:04:18:44 +0000] "POST /api/atlas/types HTTP/1.1" 201 - "-" "Java/1.7.0_80"
127.0.0.1 - - [20/Jun/2017:04:18:44 +0000] "GET /api/atlas/v2/types/typedef/name/A1BjlHzpXhN9
HTTP/1.1" 404 - "-" "Java/1.7.0_80"
127.0.0.1 - - [20/Jun/2017:04:18:44 +0000] "POST /api/atlas/types HTTP/1.1" 201 - "-" "Java/1.7.0_80"
127.0.0.1 - - [20/Jun/2017:04:18:44 +0000] "GET /api/atlas/v2/types/typedef/name/BJauwSUlD3q
HTTP/1.1" 404 - "-" "Java/1.7.0_80"
127.0.0.1 - - [20/Jun/2017:04:18:44 +0000] "POST /api/atlas/types HTTP/1.1" 201 - "-" "Java/1.7.0_80"
127.0.0.1 - - [20/Jun/2017:04:18:44 +0000] "GET /api/atlas/v2/types/typedef/name/CSQPLNobpIg
HTTP/1.1" 404 - "-" "Java/1.7.0_80"
127.0.0.1 - - [20/Jun/2017:04:18:44 +0000] "POST /api/atlas/types HTTP/1.1" 201 - "-" "Java/1.7.0_80"
127.0.0.1 - - [20/Jun/2017:04:18:44 +0000] "GET /api/atlas/types?type=CLASS&supertype=Aby12A0U83r&notsupertype=BJauwSUlD3q
HTTP/1.1" 200 - "-" "Java/1.7.0_80"
127.0.0.1 - - [20/Jun/2017:04:18:44 +0000] "POST /api/atlas/types HTTP/1.1" 201 - "-" "Java/1.7.0_80"
127.0.0.1 - - [20/Jun/2017:04:18:44 +0000] "PUT /api/atlas/types HTTP/1.1" 200 - "-" "Java/1.7.0_80"
127.0.0.1 - - [20/Jun/2017:04:18:45 +0000] "GET /api/atlas/types/fo9PDmMlSj HTTP/1.1" 200
- "-" "Java/1.7.0_80"
Tests run: 134, Failures: 2, Errors: 0, Skipped: 5, Time elapsed: 184.977 sec <<<
FAILURE! - in TestSuite
runQuickStart(org.apache.atlas.examples.QuickStartV2IT)  Time elapsed: 0.561 sec  <<<
FAILURE!
org.apache.atlas.AtlasServiceException: Metadata service API org.apache.atlas.AtlasBaseClient$APIInfo@95e5727
failed with status 409 (Conflict) Response Body ({"errorCode":"ATLAS-409-00-001","errorMessage":"Given
type Dimension already exists"})
	at org.apache.atlas.examples.QuickStartV2IT.runQuickStart(QuickStartV2IT.java:49)

testEntityDeduping(org.apache.atlas.web.integration.EntityV2JerseyResourceIT)  Time elapsed:
60.771 sec  <<< FAILURE!
java.lang.Exception: Waiting timed out after 60000 msec
	at org.apache.atlas.web.integration.EntityV2JerseyResourceIT.testEntityDeduping(EntityV2JerseyResourceIT.java:170)


Results :

Failed tests: 
  QuickStartV2IT.runQuickStart:49 » AtlasService Metadata service API org.apache...
  EntityV2JerseyResourceIT.testEntityDeduping:170->BaseResourceIT.waitForNotification:633->BaseResourceIT.waitFor:625
» 

Tests run: 134, Failures: 2, Errors: 0, Skipped: 5

[INFO] 
[INFO] --- jetty-maven-plugin:9.2.12.v20150709:stop (stop-jetty) @ atlas-webapp ---
[INFO] Waiting 10 seconds for jetty to stop
[INFO] Stopped ServerConnector@494627fc{HTTP/1.1}{0.0.0.0:31000}
[INFO] Closing Spring root WebApplicationContext
[INFO] Shutting down log4j
[INFO] Stopped o.e.j.m.p.JettyWebAppContext@2da1e25a{/,<https://builds.apache.org/job/apache-atlas-nightly/ws/webapp/target/atlas-webapp-0.9-incubating-SNAPSHOT/,UNAVAILABLE}{/home/jenkins/jenkins-slave/workspace/apache-atlas-nightly/webapp/target/atlas-webapp-0.9-incubating-SNAPSHOT.war}>
[INFO] Server reports itself as stopped
[INFO] 
[INFO] --- maven-source-plugin:2.4:jar-no-fork (attach-sources) @ atlas-webapp ---
[INFO] Building jar: <https://builds.apache.org/job/apache-atlas-nightly/ws/webapp/target/atlas-webapp-0.9-incubating-SNAPSHOT-sources.jar>
log4j:WARN No appenders could be found for logger (org.apache.zookeeper.ClientCnxn).
log4j:WARN Please initialize the log4j system properly.
log4j:WARN See http://logging.apache.org/log4j/1.2/faq.html#noconfig for more info.
[INFO] 
[INFO] --- maven-source-plugin:2.4:test-jar-no-fork (attach-sources) @ atlas-webapp ---
[INFO] Building jar: <https://builds.apache.org/job/apache-atlas-nightly/ws/webapp/target/atlas-webapp-0.9-incubating-SNAPSHOT-test-sources.jar>
[INFO] 
[INFO] --- maven-failsafe-plugin:2.19.1:verify (verify) @ atlas-webapp ---
[INFO] ------------------------------------------------------------------------
[INFO] Reactor Summary:
[INFO] 
[INFO] Apache Atlas Server Build Tools .................... SUCCESS [  1.182 s]
[INFO] apache-atlas ....................................... SUCCESS [ 12.565 s]
[INFO] Apache Atlas Integration ........................... SUCCESS [ 36.868 s]
[INFO] Apache Atlas Common ................................ SUCCESS [ 17.979 s]
[INFO] Apache Atlas Typesystem ............................ SUCCESS [01:18 min]
[INFO] Apache Atlas Client ................................ SUCCESS [ 21.888 s]
[INFO] Apache Atlas Server API ............................ SUCCESS [ 12.101 s]
[INFO] Apache Atlas Notification .......................... SUCCESS [ 23.149 s]
[INFO] Apache Atlas Graph Database Projects ............... SUCCESS [  0.624 s]
[INFO] Apache Atlas Graph Database API .................... SUCCESS [  8.161 s]
[INFO] Graph Database Common Code ......................... SUCCESS [  7.810 s]
[INFO] Apache Atlas Titan 1.0.0 GraphDB Impl .............. SUCCESS [ 33.728 s]
[INFO] Shaded version of Apache hbase client .............. SUCCESS [  8.576 s]
[INFO] Apache Atlas Titan 0.5.4 Graph DB Impl ............. SUCCESS [01:23 min]
[INFO] Apache Atlas Graph Database Implementation Dependencies SUCCESS [  0.701 s]
[INFO] Shaded version of Apache hbase server .............. SUCCESS [ 23.685 s]
[INFO] Apache Atlas Repository ............................ SUCCESS [06:24 min]
[INFO] Apache Atlas Authorization ......................... SUCCESS [ 12.811 s]
[INFO] Apache Atlas Business Catalog ...................... SUCCESS [ 18.984 s]
[INFO] Apache Atlas UI .................................... SUCCESS [01:00 min]
[INFO] Apache Atlas Web Application ....................... FAILURE [08:23 min]
[INFO] Apache Atlas Documentation ......................... SKIPPED
[INFO] Apache Atlas FileSystem Model ...................... SKIPPED
[INFO] Apache Atlas Plugin Classloader .................... SKIPPED
[INFO] Apache Atlas Hive Bridge Shim ...................... SKIPPED
[INFO] Apache Atlas Hive Bridge ........................... SKIPPED
[INFO] Apache Atlas Falcon Bridge Shim .................... SKIPPED
[INFO] Apache Atlas Falcon Bridge ......................... SKIPPED
[INFO] Apache Atlas Sqoop Bridge Shim ..................... SKIPPED
[INFO] Apache Atlas Sqoop Bridge .......................... SKIPPED
[INFO] Apache Atlas Storm Bridge Shim ..................... SKIPPED
[INFO] Apache Atlas Storm Bridge .......................... SKIPPED
[INFO] Apache Atlas Distribution .......................... SKIPPED
[INFO] ------------------------------------------------------------------------
[INFO] BUILD FAILURE
[INFO] ------------------------------------------------------------------------
[INFO] Total time: 22:33 min
[INFO] Finished at: 2017-06-20T04:18:53Z
[INFO] Final Memory: 366M/2105M
[INFO] ------------------------------------------------------------------------
[ERROR] Failed to execute goal org.apache.maven.plugins:maven-failsafe-plugin:2.19.1:verify
(verify) on project atlas-webapp: There are test failures.
[ERROR] 
[ERROR] Please refer to <https://builds.apache.org/job/apache-atlas-nightly/ws/webapp/target/failsafe-reports>
for the individual test results.
[ERROR] -> [Help 1]
[ERROR] 
[ERROR] To see the full stack trace of the errors, re-run Maven with the -e switch.
[ERROR] Re-run Maven using the -X switch to enable full debug logging.
[ERROR] 
[ERROR] For more information about the errors and possible solutions, please read the following
articles:
[ERROR] [Help 1] http://cwiki.apache.org/confluence/display/MAVEN/MojoFailureException
[ERROR] 
[ERROR] After correcting the problems, you can resume the build with the command
[ERROR]   mvn <goals> -rf :atlas-webapp
Build step 'Execute shell' marked build as failure
[CHECKSTYLE] Collecting checkstyle analysis files...
[CHECKSTYLE] Searching for all files in <https://builds.apache.org/job/apache-atlas-nightly/ws/>
that match the pattern **/target/checkstyle-result.xml
[CHECKSTYLE] Parsing 19 files in <https://builds.apache.org/job/apache-atlas-nightly/ws/>
[CHECKSTYLE] Successfully parsed file <https://builds.apache.org/job/apache-atlas-nightly/ws/authorization/target/checkstyle-result.xml>
with 468 unique warnings and 0 duplicates.
[CHECKSTYLE] Successfully parsed file <https://builds.apache.org/job/apache-atlas-nightly/ws/catalog/target/checkstyle-result.xml>
with 2613 unique warnings and 0 duplicates.
[CHECKSTYLE] Successfully parsed file <https://builds.apache.org/job/apache-atlas-nightly/ws/client/target/checkstyle-result.xml>
with 4187 unique warnings and 0 duplicates.
[CHECKSTYLE] Successfully parsed file <https://builds.apache.org/job/apache-atlas-nightly/ws/common/target/checkstyle-result.xml>
with 5390 unique warnings and 0 duplicates.
[CHECKSTYLE] Successfully parsed file <https://builds.apache.org/job/apache-atlas-nightly/ws/dashboardv2/target/checkstyle-result.xml>
with 5390 unique warnings and 0 duplicates.
[CHECKSTYLE] Successfully parsed file <https://builds.apache.org/job/apache-atlas-nightly/ws/graphdb/api/target/checkstyle-result.xml>
with 5639 unique warnings and 0 duplicates.
[CHECKSTYLE] Successfully parsed file <https://builds.apache.org/job/apache-atlas-nightly/ws/graphdb/common/target/checkstyle-result.xml>
with 5810 unique warnings and 0 duplicates.
[CHECKSTYLE] Successfully parsed file <https://builds.apache.org/job/apache-atlas-nightly/ws/graphdb/graphdb-impls/target/checkstyle-result.xml>
with 5810 unique warnings and 0 duplicates.
[CHECKSTYLE] Successfully parsed file <https://builds.apache.org/job/apache-atlas-nightly/ws/graphdb/target/checkstyle-result.xml>
with 5810 unique warnings and 0 duplicates.
[CHECKSTYLE] Successfully parsed file <https://builds.apache.org/job/apache-atlas-nightly/ws/graphdb/titan0/target/checkstyle-result.xml>
with 8041 unique warnings and 0 duplicates.
[CHECKSTYLE] Successfully parsed file <https://builds.apache.org/job/apache-atlas-nightly/ws/graphdb/titan1/target/checkstyle-result.xml>
with 8955 unique warnings and 0 duplicates.
[CHECKSTYLE] Successfully parsed file <https://builds.apache.org/job/apache-atlas-nightly/ws/intg/target/checkstyle-result.xml>
with 15645 unique warnings and 0 duplicates.
[CHECKSTYLE] Successfully parsed file <https://builds.apache.org/job/apache-atlas-nightly/ws/notification/target/checkstyle-result.xml>
with 16826 unique warnings and 0 duplicates.
[CHECKSTYLE] Successfully parsed file <https://builds.apache.org/job/apache-atlas-nightly/ws/repository/target/checkstyle-result.xml>
with 33676 unique warnings and 0 duplicates.
[CHECKSTYLE] Successfully parsed file <https://builds.apache.org/job/apache-atlas-nightly/ws/server-api/target/checkstyle-result.xml>
with 34055 unique warnings and 0 duplicates.
[CHECKSTYLE] Successfully parsed file <https://builds.apache.org/job/apache-atlas-nightly/ws/shaded/hbase-client-shaded/target/checkstyle-result.xml>
with 34055 unique warnings and 0 duplicates.
[CHECKSTYLE] Successfully parsed file <https://builds.apache.org/job/apache-atlas-nightly/ws/shaded/hbase-server-shaded/target/checkstyle-result.xml>
with 34055 unique warnings and 0 duplicates.
[CHECKSTYLE] Successfully parsed file <https://builds.apache.org/job/apache-atlas-nightly/ws/target/checkstyle-result.xml>
with 34055 unique warnings and 0 duplicates.
[CHECKSTYLE] Successfully parsed file <https://builds.apache.org/job/apache-atlas-nightly/ws/typesystem/target/checkstyle-result.xml>
with 38273 unique warnings and 0 duplicates.
[CHECKSTYLE] Computing warning deltas based on reference build #711
[FINDBUGS] Collecting findbugs analysis files...
[FINDBUGS] Searching for all files in <https://builds.apache.org/job/apache-atlas-nightly/ws/>
that match the pattern **/target/findbugs.xml
[FINDBUGS] Parsing 12 files in <https://builds.apache.org/job/apache-atlas-nightly/ws/>
[FINDBUGS] Successfully parsed file <https://builds.apache.org/job/apache-atlas-nightly/ws/authorization/target/findbugs.xml>
with 0 unique warnings and 0 duplicates.
[FINDBUGS] Successfully parsed file <https://builds.apache.org/job/apache-atlas-nightly/ws/catalog/target/findbugs.xml>
with 0 unique warnings and 0 duplicates.
[FINDBUGS] Successfully parsed file <https://builds.apache.org/job/apache-atlas-nightly/ws/client/target/findbugs.xml>
with 0 unique warnings and 0 duplicates.
[FINDBUGS] Successfully parsed file <https://builds.apache.org/job/apache-atlas-nightly/ws/common/target/findbugs.xml>
with 0 unique warnings and 0 duplicates.
[FINDBUGS] Successfully parsed file <https://builds.apache.org/job/apache-atlas-nightly/ws/graphdb/api/target/findbugs.xml>
with 0 unique warnings and 0 duplicates.
[FINDBUGS] Successfully parsed file <https://builds.apache.org/job/apache-atlas-nightly/ws/graphdb/common/target/findbugs.xml>
with 0 unique warnings and 0 duplicates.
[FINDBUGS] Successfully parsed file <https://builds.apache.org/job/apache-atlas-nightly/ws/graphdb/titan0/target/findbugs.xml>
with 0 unique warnings and 0 duplicates.
[FINDBUGS] Successfully parsed file <https://builds.apache.org/job/apache-atlas-nightly/ws/intg/target/findbugs.xml>
with 0 unique warnings and 0 duplicates.
[FINDBUGS] Successfully parsed file <https://builds.apache.org/job/apache-atlas-nightly/ws/notification/target/findbugs.xml>
with 0 unique warnings and 0 duplicates.
[FINDBUGS] Successfully parsed file <https://builds.apache.org/job/apache-atlas-nightly/ws/repository/target/findbugs.xml>
with 0 unique warnings and 0 duplicates.
[FINDBUGS] Successfully parsed file <https://builds.apache.org/job/apache-atlas-nightly/ws/server-api/target/findbugs.xml>
with 0 unique warnings and 0 duplicates.
[FINDBUGS] Successfully parsed file <https://builds.apache.org/job/apache-atlas-nightly/ws/typesystem/target/findbugs.xml>
with 0 unique warnings and 0 duplicates.
[FINDBUGS] Computing warning deltas based on reference build #711
Archiving artifacts
No artifacts from apache-atlas-nightly #711 to compare, so performing full copy of artifacts
TestNG Reports Processing: START
Looking for TestNG results report in workspace using pattern: **/target/surefire-reports/testng-results.xml,**/target/failsafe-reports/testng-results.xml
Saving reports...
Processing '/x1/jenkins/jenkins-home/jobs/apache-atlas-nightly/builds/780/testng/testng-results-1.xml'
Processing '/x1/jenkins/jenkins-home/jobs/apache-atlas-nightly/builds/780/testng/testng-results-10.xml'
Processing '/x1/jenkins/jenkins-home/jobs/apache-atlas-nightly/builds/780/testng/testng-results-2.xml'
Processing '/x1/jenkins/jenkins-home/jobs/apache-atlas-nightly/builds/780/testng/testng-results-3.xml'
Processing '/x1/jenkins/jenkins-home/jobs/apache-atlas-nightly/builds/780/testng/testng-results-4.xml'
Processing '/x1/jenkins/jenkins-home/jobs/apache-atlas-nightly/builds/780/testng/testng-results-5.xml'
Processing '/x1/jenkins/jenkins-home/jobs/apache-atlas-nightly/builds/780/testng/testng-results-6.xml'
Processing '/x1/jenkins/jenkins-home/jobs/apache-atlas-nightly/builds/780/testng/testng-results-7.xml'
Processing '/x1/jenkins/jenkins-home/jobs/apache-atlas-nightly/builds/780/testng/testng-results-8.xml'
Processing '/x1/jenkins/jenkins-home/jobs/apache-atlas-nightly/builds/780/testng/testng-results-9.xml'
Processing '/x1/jenkins/jenkins-home/jobs/apache-atlas-nightly/builds/780/testng/testng-results.xml'
0.188324% of tests failed, which exceeded threshold of 0%. Marking build as UNSTABLE
TestNG Reports Processing: FINISH

Mime
View raw message