atlas-dev mailing list archives

Site index · List index
Message view « Date » · « Thread »
Top « Date » · « Thread »
From Apache Jenkins Server <jenk...@builds.apache.org>
Subject Build failed in Jenkins: apache-atlas-nightly #747
Date Fri, 19 May 2017 17:59:10 GMT
See <https://builds.apache.org/job/apache-atlas-nightly/747/display/redirect?page=changes>

Changes:

[madhan] ATLAS-1816: button to navigate to next page in search-result is disabled

[madhan] ATLAS-1812: On browser refresh if, tag is doesn't exist, then URL should

------------------------------------------
[...truncated 529.15 KB...]
127.0.0.1 - - [19/May/2017:17:53:59 +0000] "GET /api/atlas/v2/types/classificationdef/name/blah
HTTP/1.1" 404 - "-" "Java/1.7.0_80"
127.0.0.1 - - [19/May/2017:17:53:59 +0000] "GET /api/atlas/v2/types/classificationdef/guid/blah
HTTP/1.1" 404 - "-" "Java/1.7.0_80"
127.0.0.1 - - [19/May/2017:17:53:59 +0000] "GET /api/atlas/v2/types/entitydef/name/blah HTTP/1.1"
404 - "-" "Java/1.7.0_80"
127.0.0.1 - - [19/May/2017:17:53:59 +0000] "GET /api/atlas/v2/types/entitydef/guid/blah HTTP/1.1"
404 - "-" "Java/1.7.0_80"
127.0.0.1 - - [19/May/2017:17:53:59 +0000] "POST /api/atlas/v2/types/typedefs/ HTTP/1.1" 200
- "-" "Java/1.7.0_80"
127.0.0.1 - - [19/May/2017:17:53:59 +0000] "GET /api/atlas/v2/types/typedefs/?supertype=AxkCByks8kH&type=CLASS
HTTP/1.1" 200 - "-" "Java/1.7.0_80"
127.0.0.1 - - [19/May/2017:17:53:59 +0000] "GET /api/atlas/v2/types/typedefs/?notsupertype=Bxa5bxNm3Sr&supertype=AxkCByks8kH&type=CLASS
HTTP/1.1" 200 - "-" "Java/1.7.0_80"
127.0.0.1 - - [19/May/2017:17:53:59 +0000] "POST /api/atlas/v2/types/typedefs/ HTTP/1.1" 200
- "-" "Java/1.7.0_80"
127.0.0.1 - - [19/May/2017:17:53:59 +0000] "PUT /api/atlas/v2/types/typedefs/ HTTP/1.1" 200
- "-" "Java/1.7.0_80"
127.0.0.1 - - [19/May/2017:17:53:59 +0000] "GET /api/atlas/v2/types/typedefs/?type=ENTITY
HTTP/1.1" 200 - "-" "Java/1.7.0_80"
127.0.0.1 - - [19/May/2017:17:53:59 +0000] "POST /api/atlas/types HTTP/1.1" 201 - "-" "Java/1.7.0_80"
127.0.0.1 - - [19/May/2017:17:53:59 +0000] "POST /api/atlas/types HTTP/1.1" 409 - "-" "Java/1.7.0_80"
127.0.0.1 - - [19/May/2017:17:53:59 +0000] "GET /api/atlas/types/blah HTTP/1.1" 404 - "-"
"Java/1.7.0_80"
127.0.0.1 - - [19/May/2017:17:53:59 +0000] "POST /api/atlas/types HTTP/1.1" 201 - "-" "Java/1.7.0_80"
127.0.0.1 - - [19/May/2017:17:53:59 +0000] "POST /api/atlas/types HTTP/1.1" 201 - "-" "Java/1.7.0_80"
127.0.0.1 - - [19/May/2017:17:53:59 +0000] "POST /api/atlas/types HTTP/1.1" 201 - "-" "Java/1.7.0_80"
127.0.0.1 - - [19/May/2017:17:54:00 +0000] "POST /api/atlas/types HTTP/1.1" 201 - "-" "Java/1.7.0_80"
127.0.0.1 - - [19/May/2017:17:54:00 +0000] "POST /api/atlas/types HTTP/1.1" 201 - "-" "Java/1.7.0_80"
127.0.0.1 - - [19/May/2017:17:54:00 +0000] "POST /api/atlas/types HTTP/1.1" 201 - "-" "Java/1.7.0_80"
127.0.0.1 - - [19/May/2017:17:54:00 +0000] "GET /api/atlas/types?type=TRAIT HTTP/1.1" 200
- "-" "Java/1.7.0_80"
127.0.0.1 - - [19/May/2017:17:54:00 +0000] "POST /api/atlas/types HTTP/1.1" 201 - "-" "Java/1.7.0_80"
127.0.0.1 - - [19/May/2017:17:54:00 +0000] "POST /api/atlas/types HTTP/1.1" 201 - "-" "Java/1.7.0_80"
127.0.0.1 - - [19/May/2017:17:54:00 +0000] "POST /api/atlas/types HTTP/1.1" 201 - "-" "Java/1.7.0_80"
127.0.0.1 - - [19/May/2017:17:54:00 +0000] "POST /api/atlas/types HTTP/1.1" 201 - "-" "Java/1.7.0_80"
127.0.0.1 - - [19/May/2017:17:54:00 +0000] "GET /api/atlas/types?type=CLASS&supertype=AFOyKxcykuo&notsupertype=BiJEtPCVf5H
HTTP/1.1" 200 - "-" "Java/1.7.0_80"
127.0.0.1 - - [19/May/2017:17:54:00 +0000] "POST /api/atlas/types HTTP/1.1" 201 - "-" "Java/1.7.0_80"
127.0.0.1 - - [19/May/2017:17:54:00 +0000] "PUT /api/atlas/types HTTP/1.1" 200 - "-" "Java/1.7.0_80"
127.0.0.1 - - [19/May/2017:17:54:01 +0000] "GET /api/atlas/types/bGeiHIWPRb HTTP/1.1" 200
- "-" "Java/1.7.0_80"
127.0.0.1 - - [19/May/2017:17:54:01 +0000] "POST /api/atlas/types HTTP/1.1" 201 - "-" "Java/1.7.0_80"
127.0.0.1 - - [19/May/2017:17:54:02 +0000] "GET /api/atlas/types HTTP/1.1" 200 - "-" "Java/1.7.0_80"
127.0.0.1 - - [19/May/2017:17:54:02 +0000] "POST /api/atlas/entities HTTP/1.1" 201 - "-" "Java/1.7.0_80"
127.0.0.1 - - [19/May/2017:17:54:02 +0000] "POST /api/atlas/entities HTTP/1.1" 201 - "-" "Java/1.7.0_80"
127.0.0.1 - - [19/May/2017:17:54:02 +0000] "POST /api/atlas/entities HTTP/1.1" 201 - "-" "Java/1.7.0_80"
127.0.0.1 - - [19/May/2017:17:54:02 +0000] "POST /api/atlas/entities HTTP/1.1" 201 - "-" "Java/1.7.0_80"
127.0.0.1 - - [19/May/2017:17:54:02 +0000] "POST /api/atlas/entities HTTP/1.1" 201 - "-" "Java/1.7.0_80"
127.0.0.1 - - [19/May/2017:17:54:02 +0000] "POST /api/atlas/entities HTTP/1.1" 201 - "-" "Java/1.7.0_80"
127.0.0.1 - - [19/May/2017:17:54:02 +0000] "POST /api/atlas/entities HTTP/1.1" 201 - "-" "Java/1.7.0_80"
127.0.0.1 - - [19/May/2017:17:54:02 +0000] "POST /api/atlas/entities HTTP/1.1" 201 - "-" "Java/1.7.0_80"
127.0.0.1 - - [19/May/2017:17:54:02 +0000] "POST /api/atlas/entities HTTP/1.1" 201 - "-" "Java/1.7.0_80"
127.0.0.1 - - [19/May/2017:17:54:03 +0000] "POST /api/atlas/entities HTTP/1.1" 201 - "-" "Java/1.7.0_80"
127.0.0.1 - - [19/May/2017:17:54:03 +0000] "POST /api/atlas/entities HTTP/1.1" 201 - "-" "Java/1.7.0_80"
127.0.0.1 - - [19/May/2017:17:54:03 +0000] "POST /api/atlas/entities HTTP/1.1" 201 - "-" "Java/1.7.0_80"
127.0.0.1 - - [19/May/2017:17:54:03 +0000] "POST /api/atlas/entities HTTP/1.1" 201 - "-" "Java/1.7.0_80"
127.0.0.1 - - [19/May/2017:17:54:03 +0000] "POST /api/atlas/entities HTTP/1.1" 201 - "-" "Java/1.7.0_80"
127.0.0.1 - - [19/May/2017:17:54:03 +0000] "POST /api/atlas/entities HTTP/1.1" 201 - "-" "Java/1.7.0_80"
127.0.0.1 - - [19/May/2017:17:54:03 +0000] "POST /api/atlas/entities HTTP/1.1" 201 - "-" "Java/1.7.0_80"
127.0.0.1 - - [19/May/2017:17:54:03 +0000] "GET /api/atlas/discovery/search?query=from+DB_v1&limit=10&offset=0
HTTP/1.1" 200 - "-" "Java/1.7.0_80"
127.0.0.1 - - [19/May/2017:17:54:04 +0000] "GET /api/atlas/discovery/search?query=DB_v1&limit=10&offset=0
HTTP/1.1" 200 - "-" "Java/1.7.0_80"
127.0.0.1 - - [19/May/2017:17:54:04 +0000] "GET /api/atlas/discovery/search?query=DB_v1+where+name%3D%22Reporting%22&limit=10&offset=0
HTTP/1.1" 200 - "-" "Java/1.7.0_80"
127.0.0.1 - - [19/May/2017:17:54:05 +0000] "GET /api/atlas/discovery/search?query=DB_v1+where+DB_v1.name%3D%22Reporting%22&limit=10&offset=0
HTTP/1.1" 200 - "-" "Java/1.7.0_80"
127.0.0.1 - - [19/May/2017:17:54:06 +0000] "GET /api/atlas/discovery/search?query=DB_v1+name+%3D+%22Reporting%22&limit=10&offset=0
HTTP/1.1" 200 - "-" "Java/1.7.0_80"
127.0.0.1 - - [19/May/2017:17:54:07 +0000] "GET /api/atlas/discovery/search?query=DB_v1+DB_v1.name+%3D+%22Reporting%22&limit=10&offset=0
HTTP/1.1" 200 - "-" "Java/1.7.0_80"
127.0.0.1 - - [19/May/2017:17:54:07 +0000] "GET /api/atlas/discovery/search?query=DB_v1+where+name%3D%22Reporting%22+select+name,+owner&limit=10&offset=0
HTTP/1.1" 200 - "-" "Java/1.7.0_80"
127.0.0.1 - - [19/May/2017:17:54:09 +0000] "GET /api/atlas/discovery/search?query=DB_v1+where+DB_v1.name%3D%22Reporting%22+select+name,+owner&limit=10&offset=0
HTTP/1.1" 200 - "-" "Java/1.7.0_80"
127.0.0.1 - - [19/May/2017:17:54:10 +0000] "GET /api/atlas/discovery/search?query=DB_v1+has+name&limit=10&offset=0
HTTP/1.1" 200 - "-" "Java/1.7.0_80"
127.0.0.1 - - [19/May/2017:17:54:11 +0000] "GET /api/atlas/discovery/search?query=DB_v1+where+DB_v1+has+name&limit=10&offset=0
HTTP/1.1" 200 - "-" "Java/1.7.0_80"
127.0.0.1 - - [19/May/2017:17:54:12 +0000] "GET /api/atlas/discovery/search?query=DB_v1,+Table_v1&limit=10&offset=0
HTTP/1.1" 200 - "-" "Java/1.7.0_80"
127.0.0.1 - - [19/May/2017:17:54:12 +0000] "GET /api/atlas/discovery/search?query=DB_v1+is+JdbcAccess&limit=10&offset=0
HTTP/1.1" 200 - "-" "Java/1.7.0_80"
127.0.0.1 - - [19/May/2017:17:54:13 +0000] "GET /api/atlas/discovery/search?query=from+Table_v1&limit=10&offset=0
HTTP/1.1" 200 - "-" "Java/1.7.0_80"
127.0.0.1 - - [19/May/2017:17:54:14 +0000] "GET /api/atlas/discovery/search?query=Table_v1&limit=10&offset=0
HTTP/1.1" 200 - "-" "Java/1.7.0_80"
127.0.0.1 - - [19/May/2017:17:54:15 +0000] "GET /api/atlas/discovery/search?query=Table_v1+is+Dimension_v1&limit=10&offset=0
HTTP/1.1" 200 - "-" "Java/1.7.0_80"
127.0.0.1 - - [19/May/2017:17:54:15 +0000] "GET /api/atlas/discovery/search?query=Column_v1+where+Column_v1+isa+PII_v1&limit=10&offset=0
HTTP/1.1" 200 - "-" "Java/1.7.0_80"
127.0.0.1 - - [19/May/2017:17:54:16 +0000] "GET /api/atlas/discovery/search?query=View_v1+is+Dimension_v1&limit=10&offset=0
HTTP/1.1" 200 - "-" "Java/1.7.0_80"
127.0.0.1 - - [19/May/2017:17:54:17 +0000] "GET /api/atlas/discovery/search?query=Column_v1+select+Column_v1.name&limit=10&offset=0
HTTP/1.1" 200 - "-" "Java/1.7.0_80"
127.0.0.1 - - [19/May/2017:17:54:18 +0000] "GET /api/atlas/discovery/search?query=Column_v1+select+name&limit=10&offset=0
HTTP/1.1" 200 - "-" "Java/1.7.0_80"
127.0.0.1 - - [19/May/2017:17:54:19 +0000] "GET /api/atlas/discovery/search?query=Column_v1+where+Column_v1.name%3D%22customer_id%22&limit=10&offset=0
HTTP/1.1" 200 - "-" "Java/1.7.0_80"
127.0.0.1 - - [19/May/2017:17:54:20 +0000] "GET /api/atlas/discovery/search?query=from+Table_v1+select+Table_v1.name&limit=10&offset=0
HTTP/1.1" 200 - "-" "Java/1.7.0_80"
127.0.0.1 - - [19/May/2017:17:54:21 +0000] "GET /api/atlas/discovery/search?query=DB_v1+where+(name+%3D+%22Reporting%22)&limit=10&offset=0
HTTP/1.1" 200 - "-" "Java/1.7.0_80"
127.0.0.1 - - [19/May/2017:17:54:22 +0000] "GET /api/atlas/discovery/search?query=DB_v1+where+(name+%3D+%22Reporting%22)+select+name+as+_col_0,+owner+as+_col_1&limit=10&offset=0
HTTP/1.1" 200 - "-" "Java/1.7.0_80"
127.0.0.1 - - [19/May/2017:17:54:23 +0000] "GET /api/atlas/discovery/search?query=DB_v1+where+DB_v1+is+JdbcAccess_v1&limit=10&offset=0
HTTP/1.1" 200 - "-" "Java/1.7.0_80"
127.0.0.1 - - [19/May/2017:17:54:24 +0000] "GET /api/atlas/discovery/search?query=DB_v1+where+DB_v1+has+name&limit=10&offset=0
HTTP/1.1" 200 - "-" "Java/1.7.0_80"
127.0.0.1 - - [19/May/2017:17:54:25 +0000] "GET /api/atlas/discovery/search?query=DB_v1+Table_v1&limit=10&offset=0
HTTP/1.1" 200 - "-" "Java/1.7.0_80"
127.0.0.1 - - [19/May/2017:17:54:25 +0000] "GET /api/atlas/discovery/search?query=DB_v1+where+DB_v1+has+name&limit=10&offset=0
HTTP/1.1" 200 - "-" "Java/1.7.0_80"
127.0.0.1 - - [19/May/2017:17:54:26 +0000] "GET /api/atlas/discovery/search?query=DB_v1+as+db1+Table+where+(db1.name+%3D+%22Reporting%22)&limit=10&offset=0
HTTP/1.1" 200 - "-" "Java/1.7.0_80"
127.0.0.1 - - [19/May/2017:17:54:26 +0000] "GET /api/atlas/discovery/search?query=DB_v1+where+(name+%3D+%22Reporting%22)+select+name+as+_col_0,+(createTime+%2B+1)+as+_col_1+&limit=10&offset=0
HTTP/1.1" 200 - "-" "Java/1.7.0_80"
127.0.0.1 - - [19/May/2017:17:54:27 +0000] "GET /api/atlas/discovery/search?query=Dimension_v1&limit=10&offset=0
HTTP/1.1" 200 - "-" "Java/1.7.0_80"
127.0.0.1 - - [19/May/2017:17:54:28 +0000] "GET /api/atlas/discovery/search?query=JdbcAccess_v1&limit=10&offset=0
HTTP/1.1" 200 - "-" "Java/1.7.0_80"
127.0.0.1 - - [19/May/2017:17:54:29 +0000] "GET /api/atlas/discovery/search?query=ETL_v1&limit=10&offset=0
HTTP/1.1" 200 - "-" "Java/1.7.0_80"
127.0.0.1 - - [19/May/2017:17:54:30 +0000] "GET /api/atlas/discovery/search?query=Metric_v1&limit=10&offset=0
HTTP/1.1" 200 - "-" "Java/1.7.0_80"
127.0.0.1 - - [19/May/2017:17:54:31 +0000] "GET /api/atlas/discovery/search?query=PII_v1&limit=10&offset=0
HTTP/1.1" 200 - "-" "Java/1.7.0_80"
127.0.0.1 - - [19/May/2017:17:54:31 +0000] "GET /api/atlas/discovery/search?query=%60Log+Data_v1%60&limit=10&offset=0
HTTP/1.1" 200 - "-" "Java/1.7.0_80"
127.0.0.1 - - [19/May/2017:17:54:32 +0000] "GET /api/atlas/discovery/search?query=Table_v1+where+name%3D%22sales_fact%22,+columns&limit=10&offset=0
HTTP/1.1" 200 - "-" "Java/1.7.0_80"
127.0.0.1 - - [19/May/2017:17:54:33 +0000] "GET /api/atlas/discovery/search?query=Table_v1+where+name%3D%22sales_fact%22,+columns+as+column+select+column.name,+column.dataType,+column.comment&limit=10&offset=0
HTTP/1.1" 200 - "-" "Java/1.7.0_80"
127.0.0.1 - - [19/May/2017:17:54:35 +0000] "GET /api/atlas/discovery/search?query=from+DataSet&limit=10&offset=0
HTTP/1.1" 200 - "-" "Java/1.7.0_80"
127.0.0.1 - - [19/May/2017:17:54:35 +0000] "GET /api/atlas/discovery/search?query=from+Process&limit=10&offset=0
HTTP/1.1" 200 - "-" "Java/1.7.0_80"
127.0.0.1 - - [19/May/2017:17:54:36 +0000] "GET /api/atlas/entities?type=View_v1&property=qualifiedName&value=product_dim_view
HTTP/1.1" 200 - "-" "Java/1.7.0_80"
127.0.0.1 - - [19/May/2017:17:54:36 +0000] "GET /api/atlas/entities?type=Table_v1&property=qualifiedName&value=product_dim
HTTP/1.1" 200 - "-" "Java/1.7.0_80"
127.0.0.1 - - [19/May/2017:17:54:36 +0000] "GET /api/atlas/entities?type=LoadProcess_v1&property=qualifiedName&value=loadSalesDaily
HTTP/1.1" 200 - "-" "Java/1.7.0_80"
127.0.0.1 - - [19/May/2017:17:54:36 +0000] "GET /api/atlas/entities?type=Table_v1&property=qualifiedName&value=sales_fact
HTTP/1.1" 200 - "-" "Java/1.7.0_80"
127.0.0.1 - - [19/May/2017:17:54:36 +0000] "GET /api/atlas/entities?type=Table_v1&property=qualifiedName&value=time_dim
HTTP/1.1" 200 - "-" "Java/1.7.0_80"
127.0.0.1 - - [19/May/2017:17:54:36 +0000] "GET /api/atlas/entities?type=Table_v1&property=qualifiedName&value=sales_fact_daily_mv
HTTP/1.1" 200 - "-" "Java/1.7.0_80"
127.0.0.1 - - [19/May/2017:17:54:36 +0000] "GET /api/atlas/entities?type=Table_v1&property=qualifiedName&value=sales_fact
HTTP/1.1" 200 - "-" "Java/1.7.0_80"
127.0.0.1 - - [19/May/2017:17:54:36 +0000] "GET /api/atlas/entities?type=Table_v1&property=qualifiedName&value=time_dim
HTTP/1.1" 200 - "-" "Java/1.7.0_80"
127.0.0.1 - - [19/May/2017:17:54:36 +0000] "GET /api/atlas/entities?type=Table_v1&property=qualifiedName&value=sales_fact_daily_mv
HTTP/1.1" 200 - "-" "Java/1.7.0_80"
127.0.0.1 - - [19/May/2017:17:54:36 +0000] "GET /api/atlas/lineage/hive/table/sales_fact_daily_mv/inputs/graph
HTTP/1.1" 200 - "-" "Java/1.7.0_80"
127.0.0.1 - - [19/May/2017:17:54:38 +0000] "GET /api/atlas/entities?type=DB_v1&property=name&value=Sales
HTTP/1.1" 200 - "-" "Java/1.7.0_80"
127.0.0.1 - - [19/May/2017:17:54:38 +0000] "GET /api/atlas/entities?type=Table_v1&property=qualifiedName&value=sales_fact
HTTP/1.1" 200 - "-" "Java/1.7.0_80"
127.0.0.1 - - [19/May/2017:17:54:38 +0000] "GET /api/atlas/entities?type=DB_v1&property=name&value=Sales
HTTP/1.1" 200 - "-" "Java/1.7.0_80"
127.0.0.1 - - [19/May/2017:17:54:39 +0000] "GET /api/atlas/admin/version HTTP/1.1" 200 - "-"
"Java/1.7.0_80"
Tests run: 134, Failures: 2, Errors: 0, Skipped: 0, Time elapsed: 268.024 sec <<<
FAILURE! - in TestSuite
testEntityDeduping(org.apache.atlas.web.resources.EntityJerseyResourceIT)  Time elapsed: 61.445
sec  <<< FAILURE!
java.lang.Exception: Waiting timed out after 60000 msec
	at org.apache.atlas.web.resources.EntityJerseyResourceIT.testEntityDeduping(EntityJerseyResourceIT.java:253)

testEntityDeduping(org.apache.atlas.web.resources.EntityV2JerseyResourceIT)  Time elapsed:
62.206 sec  <<< FAILURE!
java.lang.Exception: Waiting timed out after 60000 msec
	at org.apache.atlas.web.resources.EntityV2JerseyResourceIT.testEntityDeduping(EntityV2JerseyResourceIT.java:180)


Results :

Failed tests: 
  EntityJerseyResourceIT.testEntityDeduping:253->BaseResourceIT.waitForNotification:654->BaseResourceIT.waitFor:646
» 
  EntityV2JerseyResourceIT.testEntityDeduping:180->BaseResourceIT.waitForNotification:654->BaseResourceIT.waitFor:646
» 

Tests run: 134, Failures: 2, Errors: 0, Skipped: 0

[INFO] 
[INFO] --- jetty-maven-plugin:9.2.12.v20150709:stop (stop-jetty) @ atlas-webapp ---
[INFO] Waiting 10 seconds for jetty to stop
[INFO] Stopped ServerConnector@ae64c6c{HTTP/1.1}{0.0.0.0:31000}
[INFO] Closing Spring root WebApplicationContext
[INFO] Shutting down log4j
[INFO] Stopped o.e.j.m.p.JettyWebAppContext@5919a8fc{/,<https://builds.apache.org/job/apache-atlas-nightly/ws/webapp/target/atlas-webapp-0.9-incubating-SNAPSHOT/,UNAVAILABLE}{/home/jenkins/jenkins-slave/workspace/apache-atlas-nightly/webapp/target/atlas-webapp-0.9-incubating-SNAPSHOT.war}>
[INFO] Server reports itself as stopped
[INFO] 
[INFO] --- maven-source-plugin:2.4:jar-no-fork (attach-sources) @ atlas-webapp ---
[INFO] Building jar: <https://builds.apache.org/job/apache-atlas-nightly/ws/webapp/target/atlas-webapp-0.9-incubating-SNAPSHOT-sources.jar>
log4j:WARN No appenders could be found for logger (org.apache.zookeeper.ClientCnxn).
log4j:WARN Please initialize the log4j system properly.
log4j:WARN See http://logging.apache.org/log4j/1.2/faq.html#noconfig for more info.
[INFO] 
[INFO] --- maven-source-plugin:2.4:test-jar-no-fork (attach-sources) @ atlas-webapp ---
[INFO] Building jar: <https://builds.apache.org/job/apache-atlas-nightly/ws/webapp/target/atlas-webapp-0.9-incubating-SNAPSHOT-test-sources.jar>
[INFO] 
[INFO] --- maven-failsafe-plugin:2.19.1:verify (verify) @ atlas-webapp ---
[INFO] ------------------------------------------------------------------------
[INFO] Reactor Summary:
[INFO] 
[INFO] Apache Atlas Server Build Tools .................... SUCCESS [  0.948 s]
[INFO] apache-atlas ....................................... SUCCESS [ 13.001 s]
[INFO] Apache Atlas Integration ........................... SUCCESS [ 33.833 s]
[INFO] Apache Atlas Common ................................ SUCCESS [ 16.258 s]
[INFO] Apache Atlas Typesystem ............................ SUCCESS [01:10 min]
[INFO] Apache Atlas Client ................................ SUCCESS [ 20.295 s]
[INFO] Apache Atlas Server API ............................ SUCCESS [ 11.223 s]
[INFO] Apache Atlas Notification .......................... SUCCESS [ 23.294 s]
[INFO] Apache Atlas Graph Database Projects ............... SUCCESS [  0.721 s]
[INFO] Apache Atlas Graph Database API .................... SUCCESS [  7.477 s]
[INFO] Graph Database Common Code ......................... SUCCESS [  7.290 s]
[INFO] Apache Atlas Titan 1.0.0 GraphDB Impl .............. SUCCESS [ 35.162 s]
[INFO] Shaded version of Apache hbase client .............. SUCCESS [  8.825 s]
[INFO] Apache Atlas Titan 0.5.4 Graph DB Impl ............. SUCCESS [01:22 min]
[INFO] Apache Atlas Graph Database Implementation Dependencies SUCCESS [  0.856 s]
[INFO] Shaded version of Apache hbase server .............. SUCCESS [ 23.621 s]
[INFO] Apache Atlas Repository ............................ SUCCESS [06:09 min]
[INFO] Apache Atlas Authorization ......................... SUCCESS [ 12.690 s]
[INFO] Apache Atlas Business Catalog ...................... SUCCESS [ 19.158 s]
[INFO] Apache Atlas UI .................................... SUCCESS [01:00 min]
[INFO] Apache Atlas Web Application ....................... FAILURE [09:46 min]
[INFO] Apache Atlas Documentation ......................... SKIPPED
[INFO] Apache Atlas FileSystem Model ...................... SKIPPED
[INFO] Apache Atlas Plugin Classloader .................... SKIPPED
[INFO] Apache Atlas Hive Bridge Shim ...................... SKIPPED
[INFO] Apache Atlas Hive Bridge ........................... SKIPPED
[INFO] Apache Atlas Falcon Bridge Shim .................... SKIPPED
[INFO] Apache Atlas Falcon Bridge ......................... SKIPPED
[INFO] Apache Atlas Sqoop Bridge Shim ..................... SKIPPED
[INFO] Apache Atlas Sqoop Bridge .......................... SKIPPED
[INFO] Apache Atlas Storm Bridge Shim ..................... SKIPPED
[INFO] Apache Atlas Storm Bridge .......................... SKIPPED
[INFO] Apache Atlas Distribution .......................... SKIPPED
[INFO] ------------------------------------------------------------------------
[INFO] BUILD FAILURE
[INFO] ------------------------------------------------------------------------
[INFO] Total time: 23:27 min
[INFO] Finished at: 2017-05-19T17:54:46+00:00
[INFO] Final Memory: 368M/1463M
[INFO] ------------------------------------------------------------------------
[ERROR] Failed to execute goal org.apache.maven.plugins:maven-failsafe-plugin:2.19.1:verify
(verify) on project atlas-webapp: There are test failures.
[ERROR] 
[ERROR] Please refer to <https://builds.apache.org/job/apache-atlas-nightly/ws/webapp/target/failsafe-reports>
for the individual test results.
[ERROR] -> [Help 1]
[ERROR] 
[ERROR] To see the full stack trace of the errors, re-run Maven with the -e switch.
[ERROR] Re-run Maven using the -X switch to enable full debug logging.
[ERROR] 
[ERROR] For more information about the errors and possible solutions, please read the following
articles:
[ERROR] [Help 1] http://cwiki.apache.org/confluence/display/MAVEN/MojoFailureException
[ERROR] 
[ERROR] After correcting the problems, you can resume the build with the command
[ERROR]   mvn <goals> -rf :atlas-webapp
Build step 'Execute shell' marked build as failure
[CHECKSTYLE] Collecting checkstyle analysis files...
[CHECKSTYLE] Searching for all files in <https://builds.apache.org/job/apache-atlas-nightly/ws/>
that match the pattern **/target/checkstyle-result.xml
[CHECKSTYLE] Parsing 19 files in <https://builds.apache.org/job/apache-atlas-nightly/ws/>
[CHECKSTYLE] Successfully parsed file <https://builds.apache.org/job/apache-atlas-nightly/ws/authorization/target/checkstyle-result.xml>
with 464 unique warnings and 0 duplicates.
[CHECKSTYLE] Successfully parsed file <https://builds.apache.org/job/apache-atlas-nightly/ws/catalog/target/checkstyle-result.xml>
with 2609 unique warnings and 0 duplicates.
[CHECKSTYLE] Successfully parsed file <https://builds.apache.org/job/apache-atlas-nightly/ws/client/target/checkstyle-result.xml>
with 4223 unique warnings and 0 duplicates.
[CHECKSTYLE] Successfully parsed file <https://builds.apache.org/job/apache-atlas-nightly/ws/common/target/checkstyle-result.xml>
with 5390 unique warnings and 0 duplicates.
[CHECKSTYLE] Successfully parsed file <https://builds.apache.org/job/apache-atlas-nightly/ws/dashboardv2/target/checkstyle-result.xml>
with 5390 unique warnings and 0 duplicates.
[CHECKSTYLE] Successfully parsed file <https://builds.apache.org/job/apache-atlas-nightly/ws/graphdb/api/target/checkstyle-result.xml>
with 5634 unique warnings and 0 duplicates.
[CHECKSTYLE] Successfully parsed file <https://builds.apache.org/job/apache-atlas-nightly/ws/graphdb/common/target/checkstyle-result.xml>
with 5798 unique warnings and 0 duplicates.
[CHECKSTYLE] Successfully parsed file <https://builds.apache.org/job/apache-atlas-nightly/ws/graphdb/graphdb-impls/target/checkstyle-result.xml>
with 5798 unique warnings and 0 duplicates.
[CHECKSTYLE] Successfully parsed file <https://builds.apache.org/job/apache-atlas-nightly/ws/graphdb/target/checkstyle-result.xml>
with 5798 unique warnings and 0 duplicates.
[CHECKSTYLE] Successfully parsed file <https://builds.apache.org/job/apache-atlas-nightly/ws/graphdb/titan0/target/checkstyle-result.xml>
with 8023 unique warnings and 0 duplicates.
[CHECKSTYLE] Successfully parsed file <https://builds.apache.org/job/apache-atlas-nightly/ws/graphdb/titan1/target/checkstyle-result.xml>
with 8931 unique warnings and 0 duplicates.
[CHECKSTYLE] Successfully parsed file <https://builds.apache.org/job/apache-atlas-nightly/ws/intg/target/checkstyle-result.xml>
with 14898 unique warnings and 0 duplicates.
[CHECKSTYLE] Successfully parsed file <https://builds.apache.org/job/apache-atlas-nightly/ws/notification/target/checkstyle-result.xml>
with 16078 unique warnings and 0 duplicates.
[CHECKSTYLE] Successfully parsed file <https://builds.apache.org/job/apache-atlas-nightly/ws/repository/target/checkstyle-result.xml>
with 32044 unique warnings and 0 duplicates.
[CHECKSTYLE] Successfully parsed file <https://builds.apache.org/job/apache-atlas-nightly/ws/server-api/target/checkstyle-result.xml>
with 32444 unique warnings and 0 duplicates.
[CHECKSTYLE] Successfully parsed file <https://builds.apache.org/job/apache-atlas-nightly/ws/shaded/hbase-client-shaded/target/checkstyle-result.xml>
with 32444 unique warnings and 0 duplicates.
[CHECKSTYLE] Successfully parsed file <https://builds.apache.org/job/apache-atlas-nightly/ws/shaded/hbase-server-shaded/target/checkstyle-result.xml>
with 32444 unique warnings and 0 duplicates.
[CHECKSTYLE] Successfully parsed file <https://builds.apache.org/job/apache-atlas-nightly/ws/target/checkstyle-result.xml>
with 32444 unique warnings and 0 duplicates.
[CHECKSTYLE] Successfully parsed file <https://builds.apache.org/job/apache-atlas-nightly/ws/typesystem/target/checkstyle-result.xml>
with 36663 unique warnings and 0 duplicates.
[CHECKSTYLE] Computing warning deltas based on reference build #711
[FINDBUGS] Collecting findbugs analysis files...
[FINDBUGS] Searching for all files in <https://builds.apache.org/job/apache-atlas-nightly/ws/>
that match the pattern **/target/findbugs.xml
[FINDBUGS] Parsing 12 files in <https://builds.apache.org/job/apache-atlas-nightly/ws/>
[FINDBUGS] Successfully parsed file <https://builds.apache.org/job/apache-atlas-nightly/ws/authorization/target/findbugs.xml>
with 0 unique warnings and 0 duplicates.
[FINDBUGS] Successfully parsed file <https://builds.apache.org/job/apache-atlas-nightly/ws/catalog/target/findbugs.xml>
with 0 unique warnings and 0 duplicates.
[FINDBUGS] Successfully parsed file <https://builds.apache.org/job/apache-atlas-nightly/ws/client/target/findbugs.xml>
with 0 unique warnings and 0 duplicates.
[FINDBUGS] Successfully parsed file <https://builds.apache.org/job/apache-atlas-nightly/ws/common/target/findbugs.xml>
with 0 unique warnings and 0 duplicates.
[FINDBUGS] Successfully parsed file <https://builds.apache.org/job/apache-atlas-nightly/ws/graphdb/api/target/findbugs.xml>
with 0 unique warnings and 0 duplicates.
[FINDBUGS] Successfully parsed file <https://builds.apache.org/job/apache-atlas-nightly/ws/graphdb/common/target/findbugs.xml>
with 0 unique warnings and 0 duplicates.
[FINDBUGS] Successfully parsed file <https://builds.apache.org/job/apache-atlas-nightly/ws/graphdb/titan0/target/findbugs.xml>
with 0 unique warnings and 0 duplicates.
[FINDBUGS] Successfully parsed file <https://builds.apache.org/job/apache-atlas-nightly/ws/intg/target/findbugs.xml>
with 0 unique warnings and 0 duplicates.
[FINDBUGS] Successfully parsed file <https://builds.apache.org/job/apache-atlas-nightly/ws/notification/target/findbugs.xml>
with 0 unique warnings and 0 duplicates.
[FINDBUGS] Successfully parsed file <https://builds.apache.org/job/apache-atlas-nightly/ws/repository/target/findbugs.xml>
with 0 unique warnings and 0 duplicates.
[FINDBUGS] Successfully parsed file <https://builds.apache.org/job/apache-atlas-nightly/ws/server-api/target/findbugs.xml>
with 0 unique warnings and 0 duplicates.
[FINDBUGS] Successfully parsed file <https://builds.apache.org/job/apache-atlas-nightly/ws/typesystem/target/findbugs.xml>
with 0 unique warnings and 0 duplicates.
[FINDBUGS] Computing warning deltas based on reference build #711
Archiving artifacts
TestNG Reports Processing: START
Looking for TestNG results report in workspace using pattern: **/target/surefire-reports/testng-results.xml,**/target/failsafe-reports/testng-results.xml
Saving reports...
Processing '/x1/jenkins/jenkins-home/jobs/apache-atlas-nightly/builds/747/testng/testng-results-1.xml'
Processing '/x1/jenkins/jenkins-home/jobs/apache-atlas-nightly/builds/747/testng/testng-results-10.xml'
Processing '/x1/jenkins/jenkins-home/jobs/apache-atlas-nightly/builds/747/testng/testng-results-2.xml'
Processing '/x1/jenkins/jenkins-home/jobs/apache-atlas-nightly/builds/747/testng/testng-results-3.xml'
Processing '/x1/jenkins/jenkins-home/jobs/apache-atlas-nightly/builds/747/testng/testng-results-4.xml'
Processing '/x1/jenkins/jenkins-home/jobs/apache-atlas-nightly/builds/747/testng/testng-results-5.xml'
Processing '/x1/jenkins/jenkins-home/jobs/apache-atlas-nightly/builds/747/testng/testng-results-6.xml'
Processing '/x1/jenkins/jenkins-home/jobs/apache-atlas-nightly/builds/747/testng/testng-results-7.xml'
Processing '/x1/jenkins/jenkins-home/jobs/apache-atlas-nightly/builds/747/testng/testng-results-8.xml'
Processing '/x1/jenkins/jenkins-home/jobs/apache-atlas-nightly/builds/747/testng/testng-results-9.xml'
Processing '/x1/jenkins/jenkins-home/jobs/apache-atlas-nightly/builds/747/testng/testng-results.xml'
0.378788% of tests failed, which exceeded threshold of 0%. Marking build as UNSTABLE
TestNG Reports Processing: FINISH

Mime
View raw message