atlas-dev mailing list archives

Site index · List index
Message view « Date » · « Thread »
Top « Date » · « Thread »
From Apache Jenkins Server <jenk...@builds.apache.org>
Subject Build failed in Jenkins: apache-atlas-nightly #761
Date Tue, 30 May 2017 19:45:04 GMT
See <https://builds.apache.org/job/apache-atlas-nightly/761/display/redirect?page=changes>

Changes:

[apoorvnaik] UT fixes

[madhan] ATLAS-1848: update UI to remove json2.js dependency

------------------------------------------
[...truncated 273.87 KB...]
[INFO] 
[INFO] --- maven-compiler-plugin:3.1:testCompile (default-testCompile) @ atlas-repository
---
[INFO] Changes detected - recompiling the module!
[INFO] Compiling 54 source files to <https://builds.apache.org/job/apache-atlas-nightly/ws/repository/target/test-classes>
[WARNING] <https://builds.apache.org/job/apache-atlas-nightly/ws/repository/src/test/java/org/apache/atlas/repository/typestore/StoreBackedTypeCacheTest.java>:
Some input files use or override a deprecated API.
[WARNING] <https://builds.apache.org/job/apache-atlas-nightly/ws/repository/src/test/java/org/apache/atlas/repository/typestore/StoreBackedTypeCacheTest.java>:
Recompile with -Xlint:deprecation for details.
[WARNING] <https://builds.apache.org/job/apache-atlas-nightly/ws/repository/src/test/java/org/apache/atlas/repository/typestore/StoreBackedTypeCacheTest.java>:
Some input files use unchecked or unsafe operations.
[WARNING] <https://builds.apache.org/job/apache-atlas-nightly/ws/repository/src/test/java/org/apache/atlas/repository/typestore/StoreBackedTypeCacheTest.java>:
Recompile with -Xlint:unchecked for details.
[INFO] 
[INFO] --- maven-surefire-plugin:2.18.1:test (default-test) @ atlas-repository ---
[INFO] Surefire report directory: <https://builds.apache.org/job/apache-atlas-nightly/ws/repository/target/surefire-reports>
[INFO] Using configured provider org.apache.maven.surefire.testng.TestNGProvider
[WARNING] file.encoding cannot be set as system property, use <argLine>-Dfile.encoding=...<argLine>
instead

-------------------------------------------------------
 T E S T S
-------------------------------------------------------
Running org.apache.atlas.repository.audit.HBaseBasedAuditRepositoryTest
Running org.apache.atlas.repository.audit.InMemoryAuditRepositoryTest
Running org.apache.atlas.repository.store.graph.AtlasEntityDefStoreV1Test
Running org.apache.atlas.repository.store.graph.v1.InverseReferenceUpdateHardDeleteV1Test
Running org.apache.atlas.util.CompiledQueryCacheKeyTest
Running org.apache.atlas.repository.store.graph.v1.HardDeleteHandlerV1Test
Running org.apache.atlas.repository.graph.TestIntSequence
Running org.apache.atlas.repository.store.graph.v1.SoftDeleteHandlerV1Test
Running org.apache.atlas.repository.impexp.ImportServiceTest
Running org.apache.atlas.repository.graph.GraphHelperMockTest
Running org.apache.atlas.repository.impexp.ImportServiceReportingTest
Running org.apache.atlas.repository.graph.GraphBackedRepositoryHardDeleteTest
Running org.apache.atlas.repository.store.graph.v1.InverseReferenceUpdateV1Test
Running org.apache.atlas.repository.impexp.ZipSourceTest
Running org.apache.atlas.repository.audit.HBaseBasedAuditRepositoryHATest
Running org.apache.atlas.repository.graph.GraphBackedSearchIndexerTest
Running org.apache.atlas.repository.store.graph.v1.InverseReferenceUpdateSoftDeleteV1Test
Running org.apache.atlas.repository.graph.AbstractGremlinQueryOptimizerTest
Running org.apache.atlas.repository.BaseTest
Running org.apache.atlas.repository.graph.GraphBackedRepositorySoftDeleteTest
Running org.apache.atlas.repository.graph.GraphBackedSearchIndexerMockTest
Running org.apache.atlas.repository.store.graph.v1.AtlasDeleteHandlerV1Test
Running org.apache.atlas.repository.typestore.StoreBackedTypeCacheTest
Running org.apache.atlas.repository.impexp.ExportServiceTest
Running org.apache.atlas.repository.graph.GraphRepoMapperScaleTest
Running org.apache.atlas.repository.graph.Gremlin2QueryOptimizerTest
Running org.apache.atlas.repository.graph.ReverseReferenceUpdateHardDeleteTest
Running org.apache.atlas.repository.typestore.GraphBackedTypeStoreTest
Running org.apache.atlas.repository.impexp.ZipSinkTest
Running org.apache.atlas.repository.store.graph.v1.AtlasEntityStoreV1Test
Running org.apache.atlas.repository.graph.ReverseReferenceUpdateSoftDeleteTest
Running org.apache.atlas.repository.store.graph.AtlasTypeDefGraphStoreTest
Tests run: 0, Failures: 0, Errors: 0, Skipped: 0, Time elapsed: 23.307 sec - in org.apache.atlas.repository.impexp.ImportServiceReportingTest
Running org.apache.atlas.repository.graph.GraphHelperTest
Tests run: 3, Failures: 0, Errors: 0, Skipped: 0, Time elapsed: 28.751 sec - in org.apache.atlas.repository.audit.InMemoryAuditRepositoryTest
Running org.apache.atlas.repository.graph.Gremlin3QueryOptimizerTest
Tests run: 0, Failures: 0, Errors: 0, Skipped: 0, Time elapsed: 30.447 sec - in org.apache.atlas.repository.store.graph.v1.AtlasDeleteHandlerV1Test
Running org.apache.atlas.repository.graph.GraphBackedMetadataRepositoryTest
Tests run: 2, Failures: 0, Errors: 0, Skipped: 0, Time elapsed: 31.995 sec - in org.apache.atlas.repository.audit.HBaseBasedAuditRepositoryHATest
Tests run: 3, Failures: 0, Errors: 0, Skipped: 0, Time elapsed: 32.809 sec - in org.apache.atlas.repository.graph.GraphBackedSearchIndexerMockTest
Running org.apache.atlas.BaseRepositoryTest
Running org.apache.atlas.services.MetricsServiceTest
Tests run: 3, Failures: 0, Errors: 0, Skipped: 0, Time elapsed: 35.938 sec - in org.apache.atlas.repository.impexp.ZipSourceTest
Tests run: 0, Failures: 0, Errors: 0, Skipped: 0, Time elapsed: 36.429 sec - in org.apache.atlas.repository.BaseTest
Running org.apache.atlas.services.EntityDiscoveryServiceTest
Running org.apache.atlas.query.GremlinTest
Tests run: 33, Failures: 0, Errors: 0, Skipped: 0, Time elapsed: 37.582 sec - in org.apache.atlas.repository.graph.Gremlin2QueryOptimizerTest
Tests run: 5, Failures: 0, Errors: 0, Skipped: 0, Time elapsed: 38.059 sec - in org.apache.atlas.repository.impexp.ZipSinkTest
Running org.apache.atlas.query.QueryProcessorTest
Tests run: 5, Failures: 0, Errors: 0, Skipped: 0, Time elapsed: 39.918 sec - in org.apache.atlas.repository.graph.GraphBackedSearchIndexerTest
Tests run: 0, Failures: 0, Errors: 0, Skipped: 0, Time elapsed: 40.123 sec - in org.apache.atlas.repository.store.graph.v1.InverseReferenceUpdateV1Test
Tests run: 5, Failures: 0, Errors: 0, Skipped: 0, Time elapsed: 40.561 sec - in org.apache.atlas.util.CompiledQueryCacheKeyTest
Running org.apache.atlas.query.LineageQueryTest
Tests run: 2, Failures: 0, Errors: 0, Skipped: 0, Time elapsed: 40.28 sec - in org.apache.atlas.repository.graph.GraphHelperMockTest
Tests run: 0, Failures: 0, Errors: 0, Skipped: 0, Time elapsed: 40.592 sec - in org.apache.atlas.repository.graph.AbstractGremlinQueryOptimizerTest
Tests run: 0, Failures: 0, Errors: 0, Skipped: 0, Time elapsed: 40.856 sec - in org.apache.atlas.repository.graph.TestIntSequence
Running org.apache.atlas.query.ExpressionTest
Running org.apache.atlas.query.BaseGremlinTest
Running org.apache.atlas.query.ParserTest
Running org.apache.atlas.query.LexerTest
Running org.apache.atlas.TestModules
Running org.apache.atlas.lineage.EntityLineageServiceTest
Tests run: 1, Failures: 0, Errors: 0, Skipped: 0, Time elapsed: 51.377 sec - in org.apache.atlas.repository.store.graph.AtlasEntityDefStoreV1Test
Running org.apache.atlas.TestUtils
Tests run: 2, Failures: 0, Errors: 0, Skipped: 0, Time elapsed: 55.273 sec - in org.apache.atlas.repository.typestore.StoreBackedTypeCacheTest
Running org.apache.atlas.discovery.DataSetLineageServiceTest
Tests run: 33, Failures: 0, Errors: 0, Skipped: 0, Time elapsed: 30.808 sec - in org.apache.atlas.repository.graph.Gremlin3QueryOptimizerTest
Tests run: 5, Failures: 0, Errors: 0, Skipped: 0, Time elapsed: 60.562 sec - in org.apache.atlas.repository.typestore.GraphBackedTypeStoreTest
Running org.apache.atlas.discovery.GraphBackedDiscoveryServiceTest
Running org.apache.atlas.RepositoryServiceLoadingTest
Tests run: 5, Failures: 0, Errors: 0, Skipped: 0, Time elapsed: 64.02 sec - in org.apache.atlas.repository.graph.ReverseReferenceUpdateHardDeleteTest
Running org.apache.atlas.service.StoreBackedTypeCacheMetadataServiceTest
Tests run: 0, Failures: 0, Errors: 0, Skipped: 0, Time elapsed: 35.097 sec - in org.apache.atlas.BaseRepositoryTest
Tests run: 6, Failures: 1, Errors: 0, Skipped: 0, Time elapsed: 31.662 sec <<< FAILURE!
- in org.apache.atlas.services.EntityDiscoveryServiceTest
getSubTypeForTypeWithSubTypes_ReturnsOrClause(org.apache.atlas.services.EntityDiscoveryServiceTest)
 Time elapsed: 0.066 sec  <<< FAILURE!
java.lang.AssertionError: expected:<true> but was:<false>
	at org.testng.Assert.fail(Assert.java:89)
	at org.testng.Assert.failNotEquals(Assert.java:489)
	at org.testng.Assert.assertTrue(Assert.java:37)
	at org.testng.Assert.assertTrue(Assert.java:47)
	at org.apache.atlas.services.EntityDiscoveryServiceTest.getSubTypeForTypeWithSubTypes_ReturnsOrClause(EntityDiscoveryServiceTest.java:100)

Tests run: 5, Failures: 0, Errors: 0, Skipped: 0, Time elapsed: 67.34 sec - in org.apache.atlas.repository.graph.ReverseReferenceUpdateSoftDeleteTest
Running org.apache.atlas.service.DefaultMetadataServiceTest
Tests run: 1, Failures: 0, Errors: 0, Skipped: 0, Time elapsed: 40.57 sec - in org.apache.atlas.services.MetricsServiceTest
Tests run: 4, Failures: 0, Errors: 0, Skipped: 0, Time elapsed: 78.039 sec - in org.apache.atlas.repository.audit.HBaseBasedAuditRepositoryTest
Tests run: 0, Failures: 0, Errors: 0, Skipped: 0, Time elapsed: 36.531 sec - in org.apache.atlas.query.BaseGremlinTest
Tests run: 0, Failures: 0, Errors: 0, Skipped: 0, Time elapsed: 35.786 sec - in org.apache.atlas.TestModules
Tests run: 5, Failures: 0, Errors: 0, Skipped: 0, Time elapsed: 41.69 sec - in org.apache.atlas.query.QueryProcessorTest
Tests run: 14, Failures: 0, Errors: 0, Skipped: 0, Time elapsed: 39.343 sec - in org.apache.atlas.query.ParserTest
Tests run: 1, Failures: 0, Errors: 0, Skipped: 0, Time elapsed: 41.036 sec - in org.apache.atlas.query.LexerTest
Tests run: 0, Failures: 0, Errors: 0, Skipped: 0, Time elapsed: 35.983 sec - in org.apache.atlas.TestUtils
Tests run: 5, Failures: 0, Errors: 0, Skipped: 0, Time elapsed: 89.602 sec - in org.apache.atlas.repository.store.graph.v1.InverseReferenceUpdateHardDeleteV1Test
Tests run: 19, Failures: 0, Errors: 0, Skipped: 0, Time elapsed: 47.671 sec - in org.apache.atlas.query.ExpressionTest
Tests run: 5, Failures: 0, Errors: 0, Skipped: 0, Time elapsed: 90.125 sec - in org.apache.atlas.repository.store.graph.v1.InverseReferenceUpdateSoftDeleteV1Test
Tests run: 14, Failures: 0, Errors: 0, Skipped: 0, Time elapsed: 73.447 sec - in org.apache.atlas.repository.graph.GraphHelperTest
Tests run: 13, Failures: 0, Errors: 0, Skipped: 0, Time elapsed: 97.976 sec - in org.apache.atlas.repository.store.graph.v1.AtlasEntityStoreV1Test
Tests run: 10, Failures: 0, Errors: 0, Skipped: 0, Time elapsed: 99.229 sec - in org.apache.atlas.repository.impexp.ExportServiceTest
Tests run: 0, Failures: 0, Errors: 0, Skipped: 0, Time elapsed: 43.517 sec - in org.apache.atlas.discovery.DataSetLineageServiceTest
Tests run: 1, Failures: 0, Errors: 0, Skipped: 0, Time elapsed: 38.315 sec - in org.apache.atlas.RepositoryServiceLoadingTest
Tests run: 12, Failures: 0, Errors: 0, Skipped: 0, Time elapsed: 101.79 sec - in org.apache.atlas.repository.store.graph.AtlasTypeDefGraphStoreTest
Tests run: 21, Failures: 0, Errors: 0, Skipped: 0, Time elapsed: 103.832 sec - in org.apache.atlas.repository.graph.GraphBackedRepositorySoftDeleteTest
Tests run: 3, Failures: 0, Errors: 0, Skipped: 0, Time elapsed: 104.155 sec - in org.apache.atlas.repository.impexp.ImportServiceTest
Tests run: 21, Failures: 0, Errors: 0, Skipped: 0, Time elapsed: 105.645 sec - in org.apache.atlas.repository.graph.GraphBackedRepositoryHardDeleteTest
Tests run: 30, Failures: 0, Errors: 0, Skipped: 0, Time elapsed: 76.675 sec - in org.apache.atlas.repository.graph.GraphBackedMetadataRepositoryTest
Tests run: 11, Failures: 0, Errors: 0, Skipped: 0, Time elapsed: 108.557 sec - in org.apache.atlas.repository.store.graph.v1.HardDeleteHandlerV1Test
Tests run: 11, Failures: 0, Errors: 0, Skipped: 0, Time elapsed: 110.528 sec - in org.apache.atlas.repository.store.graph.v1.SoftDeleteHandlerV1Test
Tests run: 5, Failures: 0, Errors: 0, Skipped: 0, Time elapsed: 75.451 sec - in org.apache.atlas.query.LineageQueryTest
Tests run: 21, Failures: 0, Errors: 0, Skipped: 0, Time elapsed: 79.841 sec - in org.apache.atlas.query.GremlinTest
Tests run: 3, Failures: 0, Errors: 0, Skipped: 0, Time elapsed: 54.648 sec - in org.apache.atlas.service.StoreBackedTypeCacheMetadataServiceTest
Tests run: 23, Failures: 0, Errors: 0, Skipped: 0, Time elapsed: 82.889 sec - in org.apache.atlas.lineage.EntityLineageServiceTest
Tests run: 26, Failures: 0, Errors: 0, Skipped: 0, Time elapsed: 68.435 sec - in org.apache.atlas.service.DefaultMetadataServiceTest
Tests run: 333, Failures: 0, Errors: 0, Skipped: 0, Time elapsed: 219.634 sec - in org.apache.atlas.discovery.GraphBackedDiscoveryServiceTest
Tests run: 2, Failures: 0, Errors: 0, Skipped: 0, Time elapsed: 302.321 sec - in org.apache.atlas.repository.graph.GraphRepoMapperScaleTest

Results :

Failed tests: 
  EntityDiscoveryServiceTest.getSubTypeForTypeWithSubTypes_ReturnsOrClause:100 expected:<true>
but was:<false>

Tests run: 732, Failures: 1, Errors: 0, Skipped: 0

[INFO] ------------------------------------------------------------------------
[INFO] Reactor Summary:
[INFO] 
[INFO] Apache Atlas Server Build Tools .................... SUCCESS [  2.112 s]
[INFO] apache-atlas ....................................... SUCCESS [ 20.168 s]
[INFO] Apache Atlas Integration ........................... SUCCESS [ 55.718 s]
[INFO] Apache Atlas Common ................................ SUCCESS [ 31.920 s]
[INFO] Apache Atlas Typesystem ............................ SUCCESS [01:26 min]
[INFO] Apache Atlas Client ................................ SUCCESS [ 19.980 s]
[INFO] Apache Atlas Server API ............................ SUCCESS [ 10.142 s]
[INFO] Apache Atlas Notification .......................... SUCCESS [ 25.326 s]
[INFO] Apache Atlas Graph Database Projects ............... SUCCESS [  0.676 s]
[INFO] Apache Atlas Graph Database API .................... SUCCESS [  8.097 s]
[INFO] Graph Database Common Code ......................... SUCCESS [  8.025 s]
[INFO] Apache Atlas Titan 1.0.0 GraphDB Impl .............. SUCCESS [ 36.196 s]
[INFO] Shaded version of Apache hbase client .............. SUCCESS [  8.866 s]
[INFO] Apache Atlas Titan 0.5.4 Graph DB Impl ............. SUCCESS [01:35 min]
[INFO] Apache Atlas Graph Database Implementation Dependencies SUCCESS [  0.878 s]
[INFO] Shaded version of Apache hbase server .............. SUCCESS [ 26.149 s]
[INFO] Apache Atlas Repository ............................ FAILURE [06:08 min]
[INFO] Apache Atlas Authorization ......................... SKIPPED
[INFO] Apache Atlas Business Catalog ...................... SKIPPED
[INFO] Apache Atlas UI .................................... SKIPPED
[INFO] Apache Atlas Web Application ....................... SKIPPED
[INFO] Apache Atlas Documentation ......................... SKIPPED
[INFO] Apache Atlas FileSystem Model ...................... SKIPPED
[INFO] Apache Atlas Plugin Classloader .................... SKIPPED
[INFO] Apache Atlas Hive Bridge Shim ...................... SKIPPED
[INFO] Apache Atlas Hive Bridge ........................... SKIPPED
[INFO] Apache Atlas Falcon Bridge Shim .................... SKIPPED
[INFO] Apache Atlas Falcon Bridge ......................... SKIPPED
[INFO] Apache Atlas Sqoop Bridge Shim ..................... SKIPPED
[INFO] Apache Atlas Sqoop Bridge .......................... SKIPPED
[INFO] Apache Atlas Storm Bridge Shim ..................... SKIPPED
[INFO] Apache Atlas Storm Bridge .......................... SKIPPED
[INFO] Apache Atlas Distribution .......................... SKIPPED
[INFO] ------------------------------------------------------------------------
[INFO] BUILD FAILURE
[INFO] ------------------------------------------------------------------------
[INFO] Total time: 13:29 min
[INFO] Finished at: 2017-05-30T19:39:39+00:00
[INFO] Final Memory: 160M/1717M
[INFO] ------------------------------------------------------------------------
[ERROR] Failed to execute goal org.apache.maven.plugins:maven-surefire-plugin:2.18.1:test
(default-test) on project atlas-repository: There are test failures.
[ERROR] 
[ERROR] Please refer to <https://builds.apache.org/job/apache-atlas-nightly/ws/repository/target/surefire-reports>
for the individual test results.
[ERROR] -> [Help 1]
[ERROR] 
[ERROR] To see the full stack trace of the errors, re-run Maven with the -e switch.
[ERROR] Re-run Maven using the -X switch to enable full debug logging.
[ERROR] 
[ERROR] For more information about the errors and possible solutions, please read the following
articles:
[ERROR] [Help 1] http://cwiki.apache.org/confluence/display/MAVEN/MojoFailureException
[ERROR] 
[ERROR] After correcting the problems, you can resume the build with the command
[ERROR]   mvn <goals> -rf :atlas-repository
Build step 'Execute shell' marked build as failure
[CHECKSTYLE] Collecting checkstyle analysis files...
[CHECKSTYLE] Searching for all files in <https://builds.apache.org/job/apache-atlas-nightly/ws/>
that match the pattern **/target/checkstyle-result.xml
[CHECKSTYLE] Parsing 18 files in <https://builds.apache.org/job/apache-atlas-nightly/ws/>
[CHECKSTYLE] Successfully parsed file <https://builds.apache.org/job/apache-atlas-nightly/ws/authorization/target/checkstyle-result.xml>
with 464 unique warnings and 0 duplicates.
[CHECKSTYLE] Successfully parsed file <https://builds.apache.org/job/apache-atlas-nightly/ws/catalog/target/checkstyle-result.xml>
with 2609 unique warnings and 0 duplicates.
[CHECKSTYLE] Successfully parsed file <https://builds.apache.org/job/apache-atlas-nightly/ws/client/target/checkstyle-result.xml>
with 4183 unique warnings and 0 duplicates.
[CHECKSTYLE] Successfully parsed file <https://builds.apache.org/job/apache-atlas-nightly/ws/common/target/checkstyle-result.xml>
with 5380 unique warnings and 0 duplicates.
[CHECKSTYLE] Successfully parsed file <https://builds.apache.org/job/apache-atlas-nightly/ws/dashboardv2/target/checkstyle-result.xml>
with 5380 unique warnings and 0 duplicates.
[CHECKSTYLE] Successfully parsed file <https://builds.apache.org/job/apache-atlas-nightly/ws/graphdb/api/target/checkstyle-result.xml>
with 5628 unique warnings and 0 duplicates.
[CHECKSTYLE] Successfully parsed file <https://builds.apache.org/job/apache-atlas-nightly/ws/graphdb/common/target/checkstyle-result.xml>
with 5794 unique warnings and 0 duplicates.
[CHECKSTYLE] Successfully parsed file <https://builds.apache.org/job/apache-atlas-nightly/ws/graphdb/graphdb-impls/target/checkstyle-result.xml>
with 5794 unique warnings and 0 duplicates.
[CHECKSTYLE] Successfully parsed file <https://builds.apache.org/job/apache-atlas-nightly/ws/graphdb/target/checkstyle-result.xml>
with 5794 unique warnings and 0 duplicates.
[CHECKSTYLE] Successfully parsed file <https://builds.apache.org/job/apache-atlas-nightly/ws/graphdb/titan0/target/checkstyle-result.xml>
with 8024 unique warnings and 0 duplicates.
[CHECKSTYLE] Successfully parsed file <https://builds.apache.org/job/apache-atlas-nightly/ws/graphdb/titan1/target/checkstyle-result.xml>
with 8937 unique warnings and 0 duplicates.
[CHECKSTYLE] Successfully parsed file <https://builds.apache.org/job/apache-atlas-nightly/ws/intg/target/checkstyle-result.xml>
with 14951 unique warnings and 0 duplicates.
[CHECKSTYLE] Successfully parsed file <https://builds.apache.org/job/apache-atlas-nightly/ws/notification/target/checkstyle-result.xml>
with 16132 unique warnings and 0 duplicates.
[CHECKSTYLE] Successfully parsed file <https://builds.apache.org/job/apache-atlas-nightly/ws/server-api/target/checkstyle-result.xml>
with 16511 unique warnings and 0 duplicates.
[CHECKSTYLE] Successfully parsed file <https://builds.apache.org/job/apache-atlas-nightly/ws/shaded/hbase-client-shaded/target/checkstyle-result.xml>
with 16511 unique warnings and 0 duplicates.
[CHECKSTYLE] Successfully parsed file <https://builds.apache.org/job/apache-atlas-nightly/ws/shaded/hbase-server-shaded/target/checkstyle-result.xml>
with 16511 unique warnings and 0 duplicates.
[CHECKSTYLE] Successfully parsed file <https://builds.apache.org/job/apache-atlas-nightly/ws/target/checkstyle-result.xml>
with 16511 unique warnings and 0 duplicates.
[CHECKSTYLE] Successfully parsed file <https://builds.apache.org/job/apache-atlas-nightly/ws/typesystem/target/checkstyle-result.xml>
with 20728 unique warnings and 0 duplicates.
[CHECKSTYLE] Computing warning deltas based on reference build #711
[FINDBUGS] Collecting findbugs analysis files...
[FINDBUGS] Searching for all files in <https://builds.apache.org/job/apache-atlas-nightly/ws/>
that match the pattern **/target/findbugs.xml
[FINDBUGS] Parsing 11 files in <https://builds.apache.org/job/apache-atlas-nightly/ws/>
[FINDBUGS] Successfully parsed file <https://builds.apache.org/job/apache-atlas-nightly/ws/authorization/target/findbugs.xml>
with 0 unique warnings and 0 duplicates.
[FINDBUGS] Successfully parsed file <https://builds.apache.org/job/apache-atlas-nightly/ws/catalog/target/findbugs.xml>
with 0 unique warnings and 0 duplicates.
[FINDBUGS] Successfully parsed file <https://builds.apache.org/job/apache-atlas-nightly/ws/client/target/findbugs.xml>
with 0 unique warnings and 0 duplicates.
[FINDBUGS] Successfully parsed file <https://builds.apache.org/job/apache-atlas-nightly/ws/common/target/findbugs.xml>
with 0 unique warnings and 0 duplicates.
[FINDBUGS] Successfully parsed file <https://builds.apache.org/job/apache-atlas-nightly/ws/graphdb/api/target/findbugs.xml>
with 0 unique warnings and 0 duplicates.
[FINDBUGS] Successfully parsed file <https://builds.apache.org/job/apache-atlas-nightly/ws/graphdb/common/target/findbugs.xml>
with 0 unique warnings and 0 duplicates.
[FINDBUGS] Successfully parsed file <https://builds.apache.org/job/apache-atlas-nightly/ws/graphdb/titan0/target/findbugs.xml>
with 0 unique warnings and 0 duplicates.
[FINDBUGS] Successfully parsed file <https://builds.apache.org/job/apache-atlas-nightly/ws/intg/target/findbugs.xml>
with 0 unique warnings and 0 duplicates.
[FINDBUGS] Successfully parsed file <https://builds.apache.org/job/apache-atlas-nightly/ws/notification/target/findbugs.xml>
with 0 unique warnings and 0 duplicates.
[FINDBUGS] Successfully parsed file <https://builds.apache.org/job/apache-atlas-nightly/ws/server-api/target/findbugs.xml>
with 0 unique warnings and 0 duplicates.
[FINDBUGS] Successfully parsed file <https://builds.apache.org/job/apache-atlas-nightly/ws/typesystem/target/findbugs.xml>
with 0 unique warnings and 0 duplicates.
[FINDBUGS] Computing warning deltas based on reference build #711
Archiving artifacts
TestNG Reports Processing: START
Looking for TestNG results report in workspace using pattern: **/target/surefire-reports/testng-results.xml,**/target/failsafe-reports/testng-results.xml
testng-results.xml was last modified before this build started. Ignoring it.
testng-results.xml was last modified before this build started. Ignoring it.
testng-results.xml was last modified before this build started. Ignoring it.
testng-results.xml was last modified before this build started. Ignoring it.
Saving reports...
Processing '/x1/jenkins/jenkins-home/jobs/apache-atlas-nightly/builds/761/testng/testng-results-1.xml'
Processing '/x1/jenkins/jenkins-home/jobs/apache-atlas-nightly/builds/761/testng/testng-results-2.xml'
Processing '/x1/jenkins/jenkins-home/jobs/apache-atlas-nightly/builds/761/testng/testng-results-3.xml'
Processing '/x1/jenkins/jenkins-home/jobs/apache-atlas-nightly/builds/761/testng/testng-results-4.xml'
Processing '/x1/jenkins/jenkins-home/jobs/apache-atlas-nightly/builds/761/testng/testng-results-5.xml'
Processing '/x1/jenkins/jenkins-home/jobs/apache-atlas-nightly/builds/761/testng/testng-results-6.xml'
Processing '/x1/jenkins/jenkins-home/jobs/apache-atlas-nightly/builds/761/testng/testng-results.xml'
TestNG Reports Processing: FINISH

Mime
View raw message