atlas-dev mailing list archives

Site index · List index
Message view « Date » · « Thread »
Top « Date » · « Thread »
From Apache Jenkins Server <jenk...@builds.apache.org>
Subject Build failed in Jenkins: apache-atlas-nightly #750
Date Wed, 24 May 2017 04:00:23 GMT
See <https://builds.apache.org/job/apache-atlas-nightly/750/display/redirect>

------------------------------------------
[...truncated 277.91 KB...]
Tests run: 5, Failures: 0, Errors: 0, Skipped: 0, Time elapsed: 56.54 sec - in org.apache.atlas.repository.impexp.ZipSinkTest
Tests run: 1, Failures: 0, Errors: 0, Skipped: 0, Time elapsed: 58.589 sec - in org.apache.atlas.repository.typestore.StoreBackedTypeCacheConfigurationTest
Tests run: 33, Failures: 0, Errors: 0, Skipped: 0, Time elapsed: 59.408 sec - in org.apache.atlas.repository.graph.Gremlin3QueryOptimizerTest
Running org.apache.atlas.util.CompiledQueryCacheKeyTest
Tests run: 0, Failures: 0, Errors: 0, Skipped: 0, Time elapsed: 61.284 sec - in org.apache.atlas.discovery.DataSetLineageServiceTest
Running org.apache.atlas.services.MetricsServiceTest
Running org.apache.atlas.services.EntityDiscoveryServiceTest
Running org.apache.atlas.query.QueryProcessorTest
Tests run: 5, Failures: 0, Errors: 0, Skipped: 0, Time elapsed: 63.851 sec - in org.apache.atlas.repository.graph.GraphBackedSearchIndexerTest
Tests run: 0, Failures: 0, Errors: 0, Skipped: 0, Time elapsed: 52.004 sec - in org.apache.atlas.repository.store.graph.v1.InverseReferenceUpdateV1Test
Running org.apache.atlas.query.ExpressionTest
Running org.apache.atlas.query.BaseGremlinTest
Tests run: 1, Failures: 0, Errors: 0, Skipped: 0, Time elapsed: 68.532 sec - in org.apache.atlas.repository.store.graph.AtlasEntityDefStoreV1Test
Running org.apache.atlas.query.LexerTest
Tests run: 5, Failures: 0, Errors: 0, Skipped: 0, Time elapsed: 82.499 sec - in org.apache.atlas.repository.graph.ReverseReferenceUpdateHardDeleteTest
Tests run: 5, Failures: 0, Errors: 0, Skipped: 0, Time elapsed: 83.628 sec - in org.apache.atlas.repository.graph.ReverseReferenceUpdateSoftDeleteTest
Running org.apache.atlas.query.LineageQueryTest
Running org.apache.atlas.query.GremlinTest
Tests run: 5, Failures: 0, Errors: 0, Skipped: 0, Time elapsed: 94.158 sec - in org.apache.atlas.repository.typestore.GraphBackedTypeStoreTest
Tests run: 3, Failures: 0, Errors: 0, Skipped: 0, Time elapsed: 96.356 sec - in org.apache.atlas.service.StoreBackedTypeCacheMetadataServiceTest
Tests run: 0, Failures: 0, Errors: 0, Skipped: 0, Time elapsed: 46.906 sec - in org.apache.atlas.repository.BaseTest
Running org.apache.atlas.query.ParserTest
Running org.apache.atlas.TestUtils
Running org.apache.atlas.TestOnlyModule
Tests run: 2, Failures: 0, Errors: 0, Skipped: 0, Time elapsed: 50.333 sec - in org.apache.atlas.repository.audit.HBaseBasedAuditRepositoryHATest
Tests run: 3, Failures: 0, Errors: 0, Skipped: 0, Time elapsed: 53.35 sec - in org.apache.atlas.repository.audit.InMemoryAuditRepositoryTest
Tests run: 1, Failures: 0, Errors: 0, Skipped: 0, Time elapsed: 55.37 sec - in org.apache.atlas.RepositoryServiceLoadingTest
Tests run: 14, Failures: 0, Errors: 0, Skipped: 0, Time elapsed: 114.324 sec - in org.apache.atlas.repository.graph.GraphHelperTest
Tests run: 5, Failures: 0, Errors: 0, Skipped: 0, Time elapsed: 113.167 sec - in org.apache.atlas.repository.store.graph.v1.InverseReferenceUpdateHardDeleteV1Test
Tests run: 5, Failures: 0, Errors: 0, Skipped: 0, Time elapsed: 62.52 sec - in org.apache.atlas.util.CompiledQueryCacheKeyTest
Tests run: 5, Failures: 0, Errors: 0, Skipped: 0, Time elapsed: 112.58 sec - in org.apache.atlas.repository.store.graph.v1.InverseReferenceUpdateSoftDeleteV1Test
Tests run: 5, Failures: 0, Errors: 0, Skipped: 0, Time elapsed: 60.885 sec - in org.apache.atlas.query.QueryProcessorTest
Tests run: 0, Failures: 0, Errors: 0, Skipped: 0, Time elapsed: 55.629 sec - in org.apache.atlas.query.BaseGremlinTest
Tests run: 1, Failures: 0, Errors: 0, Skipped: 0, Time elapsed: 63.66 sec - in org.apache.atlas.services.MetricsServiceTest
Tests run: 1, Failures: 0, Errors: 0, Skipped: 0, Time elapsed: 55.178 sec - in org.apache.atlas.query.LexerTest
Tests run: 19, Failures: 0, Errors: 0, Skipped: 0, Time elapsed: 59.974 sec - in org.apache.atlas.query.ExpressionTest
Tests run: 6, Failures: 1, Errors: 0, Skipped: 0, Time elapsed: 71.575 sec <<< FAILURE!
- in org.apache.atlas.services.EntityDiscoveryServiceTest
getSubTypeForTypeWithSubTypes_ReturnsOrClause(org.apache.atlas.services.EntityDiscoveryServiceTest)
 Time elapsed: 0.033 sec  <<< FAILURE!
java.lang.AssertionError: null
	at org.junit.Assert.fail(Assert.java:86)
	at org.junit.Assert.assertTrue(Assert.java:41)
	at org.junit.Assert.assertTrue(Assert.java:52)
	at org.apache.atlas.services.EntityDiscoveryServiceTest.getSubTypeForTypeWithSubTypes_ReturnsOrClause(EntityDiscoveryServiceTest.java:104)

Tests run: 11, Failures: 0, Errors: 0, Skipped: 0, Time elapsed: 138.248 sec - in org.apache.atlas.repository.store.graph.v1.SoftDeleteHandlerV1Test
Tests run: 0, Failures: 0, Errors: 0, Skipped: 0, Time elapsed: 40.653 sec - in org.apache.atlas.TestOnlyModule
Tests run: 21, Failures: 0, Errors: 0, Skipped: 0, Time elapsed: 143.985 sec - in org.apache.atlas.repository.graph.GraphBackedRepositoryHardDeleteTest
Tests run: 0, Failures: 0, Errors: 0, Skipped: 0, Time elapsed: 43.211 sec - in org.apache.atlas.TestUtils
Tests run: 12, Failures: 0, Errors: 0, Skipped: 0, Time elapsed: 142.96 sec - in org.apache.atlas.repository.store.graph.AtlasTypeDefGraphStoreTest
Tests run: 14, Failures: 0, Errors: 0, Skipped: 0, Time elapsed: 45.536 sec - in org.apache.atlas.query.ParserTest
Tests run: 3, Failures: 0, Errors: 0, Skipped: 0, Time elapsed: 145.618 sec - in org.apache.atlas.repository.impexp.ImportServiceTest
Tests run: 21, Failures: 0, Errors: 0, Skipped: 0, Time elapsed: 149.119 sec - in org.apache.atlas.repository.graph.GraphBackedRepositorySoftDeleteTest
Tests run: 30, Failures: 0, Errors: 0, Skipped: 0, Time elapsed: 149.628 sec - in org.apache.atlas.repository.graph.GraphBackedMetadataRepositoryTest
Tests run: 10, Failures: 0, Errors: 0, Skipped: 0, Time elapsed: 152.226 sec - in org.apache.atlas.repository.impexp.ExportServiceTest
Tests run: 11, Failures: 0, Errors: 0, Skipped: 0, Time elapsed: 120.668 sec - in org.apache.atlas.repository.store.graph.v1.HardDeleteHandlerV1Test
Tests run: 13, Failures: 0, Errors: 0, Skipped: 0, Time elapsed: 112.48 sec - in org.apache.atlas.repository.store.graph.v1.AtlasEntityStoreV1Test
Tests run: 26, Failures: 0, Errors: 0, Skipped: 0, Time elapsed: 163.496 sec - in org.apache.atlas.service.DefaultMetadataServiceTest
Tests run: 5, Failures: 0, Errors: 0, Skipped: 0, Time elapsed: 78.689 sec - in org.apache.atlas.query.LineageQueryTest
Tests run: 4, Failures: 0, Errors: 0, Skipped: 0, Time elapsed: 109.742 sec - in org.apache.atlas.repository.audit.HBaseBasedAuditRepositoryTest
Tests run: 23, Failures: 0, Errors: 0, Skipped: 0, Time elapsed: 119.261 sec - in org.apache.atlas.lineage.EntityLineageServiceTest
Tests run: 21, Failures: 0, Errors: 0, Skipped: 0, Time elapsed: 86.89 sec - in org.apache.atlas.query.GremlinTest
Tests run: 2, Failures: 0, Errors: 0, Skipped: 0, Time elapsed: 306.424 sec - in org.apache.atlas.repository.graph.GraphRepoMapperScaleTest
Tests run: 333, Failures: 0, Errors: 0, Skipped: 0, Time elapsed: 321.255 sec - in org.apache.atlas.discovery.GraphBackedDiscoveryServiceTest

Results :

Failed tests: 
  EntityDiscoveryServiceTest.getSubTypeForTypeWithSubTypes_ReturnsOrClause:104 null

Tests run: 731, Failures: 1, Errors: 0, Skipped: 0

[INFO] ------------------------------------------------------------------------
[INFO] Reactor Summary:
[INFO] 
[INFO] Apache Atlas Server Build Tools .................... SUCCESS [  2.696 s]
[INFO] apache-atlas ....................................... SUCCESS [ 21.508 s]
[INFO] Apache Atlas Integration ........................... SUCCESS [ 37.585 s]
[INFO] Apache Atlas Common ................................ SUCCESS [ 16.244 s]
[INFO] Apache Atlas Typesystem ............................ SUCCESS [01:16 min]
[INFO] Apache Atlas Client ................................ SUCCESS [ 21.186 s]
[INFO] Apache Atlas Server API ............................ SUCCESS [ 11.025 s]
[INFO] Apache Atlas Notification .......................... SUCCESS [ 26.752 s]
[INFO] Apache Atlas Graph Database Projects ............... SUCCESS [  0.723 s]
[INFO] Apache Atlas Graph Database API .................... SUCCESS [  7.913 s]
[INFO] Graph Database Common Code ......................... SUCCESS [  7.903 s]
[INFO] Apache Atlas Titan 1.0.0 GraphDB Impl .............. SUCCESS [ 36.415 s]
[INFO] Shaded version of Apache hbase client .............. SUCCESS [ 10.097 s]
[INFO] Apache Atlas Titan 0.5.4 Graph DB Impl ............. SUCCESS [01:23 min]
[INFO] Apache Atlas Graph Database Implementation Dependencies SUCCESS [  0.912 s]
[INFO] Shaded version of Apache hbase server .............. SUCCESS [ 24.699 s]
[INFO] Apache Atlas Repository ............................ FAILURE [06:24 min]
[INFO] Apache Atlas Authorization ......................... SKIPPED
[INFO] Apache Atlas Business Catalog ...................... SKIPPED
[INFO] Apache Atlas UI .................................... SKIPPED
[INFO] Apache Atlas Web Application ....................... SKIPPED
[INFO] Apache Atlas Documentation ......................... SKIPPED
[INFO] Apache Atlas FileSystem Model ...................... SKIPPED
[INFO] Apache Atlas Plugin Classloader .................... SKIPPED
[INFO] Apache Atlas Hive Bridge Shim ...................... SKIPPED
[INFO] Apache Atlas Hive Bridge ........................... SKIPPED
[INFO] Apache Atlas Falcon Bridge Shim .................... SKIPPED
[INFO] Apache Atlas Falcon Bridge ......................... SKIPPED
[INFO] Apache Atlas Sqoop Bridge Shim ..................... SKIPPED
[INFO] Apache Atlas Sqoop Bridge .......................... SKIPPED
[INFO] Apache Atlas Storm Bridge Shim ..................... SKIPPED
[INFO] Apache Atlas Storm Bridge .......................... SKIPPED
[INFO] Apache Atlas Distribution .......................... SKIPPED
[INFO] ------------------------------------------------------------------------
[INFO] BUILD FAILURE
[INFO] ------------------------------------------------------------------------
[INFO] Total time: 12:53 min
[INFO] Finished at: 2017-05-24T03:58:36+00:00
[INFO] Final Memory: 160M/1792M
[INFO] ------------------------------------------------------------------------
[ERROR] Failed to execute goal org.apache.maven.plugins:maven-surefire-plugin:2.18.1:test
(default-test) on project atlas-repository: ExecutionException: java.lang.RuntimeException:
There was an error in the forked process
[ERROR] java.lang.ExceptionInInitializerError
[ERROR] at java.lang.Class.forName0(Native Method)
[ERROR] at java.lang.Class.forName(Class.java:195)
[ERROR] at org.apache.atlas.ApplicationProperties.getClass(ApplicationProperties.java:120)
[ERROR] at org.apache.atlas.util.AtlasRepositoryConfiguration.getDeleteHandlerImpl(AtlasRepositoryConfiguration.java:103)
[ERROR] at org.apache.atlas.RepositoryMetadataModule.configure(RepositoryMetadataModule.java:114)
[ERROR] at org.apache.atlas.TestOnlyModule.configure(TestOnlyModule.java:28)
[ERROR] at com.google.inject.AbstractModule.configure(AbstractModule.java:62)
[ERROR] at com.google.inject.spi.Elements$RecordingBinder.install(Elements.java:340)
[ERROR] at com.google.inject.spi.Elements.getElements(Elements.java:110)
[ERROR] at com.google.inject.internal.InjectorShell$Builder.build(InjectorShell.java:138)
[ERROR] at com.google.inject.internal.InternalInjectorCreator.build(InternalInjectorCreator.java:104)
[ERROR] at com.google.inject.Guice.createInjector(Guice.java:99)
[ERROR] at com.google.inject.Guice.createInjector(Guice.java:73)
[ERROR] at org.testng.internal.ClassImpl.getInstanceFromGuice(ClassImpl.java:139)
[ERROR] at org.testng.internal.ClassImpl.getDefaultInstance(ClassImpl.java:104)
[ERROR] at org.testng.internal.ClassImpl.getInstances(ClassImpl.java:181)
[ERROR] at org.testng.internal.TestNGClassFinder.<init>(TestNGClassFinder.java:120)
[ERROR] at org.testng.TestRunner.initMethods(TestRunner.java:402)
[ERROR] at org.testng.TestRunner.init(TestRunner.java:228)
[ERROR] at org.testng.TestRunner.init(TestRunner.java:198)
[ERROR] at org.testng.TestRunner.<init>(TestRunner.java:147)
[ERROR] at org.testng.SuiteRunner$DefaultTestRunnerFactory.newTestRunner(SuiteRunner.java:525)
[ERROR] at org.testng.SuiteRunner.init(SuiteRunner.java:156)
[ERROR] at org.testng.SuiteRunner.<init>(SuiteRunner.java:110)
[ERROR] at org.testng.TestNG.createSuiteRunner(TestNG.java:1235)
[ERROR] at org.testng.TestNG.createSuiteRunners(TestNG.java:1222)
[ERROR] at org.testng.TestNG.runSuitesLocally(TestNG.java:1074)
[ERROR] at org.testng.TestNG.run(TestNG.java:999)
[ERROR] at org.apache.maven.surefire.testng.TestNGExecutor.run(TestNGExecutor.java:115)
[ERROR] at org.apache.maven.surefire.testng.TestNGDirectoryTestSuite.executeSingleClass(TestNGDirectoryTestSuite.java:129)
[ERROR] at org.apache.maven.surefire.testng.TestNGDirectoryTestSuite.execute(TestNGDirectoryTestSuite.java:113)
[ERROR] at org.apache.maven.surefire.testng.TestNGProvider.invoke(TestNGProvider.java:111)
[ERROR] at org.apache.maven.surefire.booter.ForkedBooter.invokeProviderInSameClassLoader(ForkedBooter.java:203)
[ERROR] at org.apache.maven.surefire.booter.ForkedBooter.runSuitesInProcess(ForkedBooter.java:155)
[ERROR] at org.apache.maven.surefire.booter.ForkedBooter.main(ForkedBooter.java:103)
[ERROR] Caused by: java.lang.IllegalArgumentException: Could not instantiate implementation:
com.thinkaurelius.titan.diskstorage.berkeleyje.BerkeleyJEStoreManager
[ERROR] at com.thinkaurelius.titan.util.system.ConfigurationUtil.instantiate(ConfigurationUtil.java:55)
[ERROR] at com.thinkaurelius.titan.diskstorage.Backend.getImplementationClass(Backend.java:421)
[ERROR] at com.thinkaurelius.titan.diskstorage.Backend.getStorageManager(Backend.java:361)
[ERROR] at com.thinkaurelius.titan.graphdb.configuration.GraphDatabaseConfiguration.<init>(GraphDatabaseConfiguration.java:1275)
[ERROR] at com.thinkaurelius.titan.core.TitanFactory.open(TitanFactory.java:93)
[ERROR] at com.thinkaurelius.titan.core.TitanFactory.open(TitanFactory.java:73)
[ERROR] at org.apache.atlas.repository.graphdb.titan0.Titan0GraphDatabase.getGraphInstance(Titan0GraphDatabase.java:115)
[ERROR] at org.apache.atlas.repository.graphdb.titan0.Titan0GraphDatabase.getGraph(Titan0GraphDatabase.java:171)
[ERROR] at org.apache.atlas.repository.graph.AtlasGraphProvider.getGraphInstance(AtlasGraphProvider.java:38)
[ERROR] at org.apache.atlas.repository.graph.GraphHelper.getInstance(GraphHelper.java:114)
[ERROR] at org.apache.atlas.repository.graph.DeleteHandler.<clinit>(DeleteHandler.java:54)
[ERROR] ... 35 more
[ERROR] Caused by: java.lang.reflect.InvocationTargetException
[ERROR] at sun.reflect.NativeConstructorAccessorImpl.newInstance0(Native Method)
[ERROR] at sun.reflect.NativeConstructorAccessorImpl.newInstance(NativeConstructorAccessorImpl.java:57)
[ERROR] at sun.reflect.DelegatingConstructorAccessorImpl.newInstance(DelegatingConstructorAccessorImpl.java:45)
[ERROR] at java.lang.reflect.Constructor.newInstance(Constructor.java:526)
[ERROR] at com.thinkaurelius.titan.util.system.ConfigurationUtil.instantiate(ConfigurationUtil.java:44)
[ERROR] ... 45 more
[ERROR] Caused by: com.thinkaurelius.titan.diskstorage.PermanentBackendException: Error during
BerkeleyJE initialization:
[ERROR] at com.thinkaurelius.titan.diskstorage.berkeleyje.BerkeleyJEStoreManager.initialize(BerkeleyJEStoreManager.java:108)
[ERROR] at com.thinkaurelius.titan.diskstorage.berkeleyje.BerkeleyJEStoreManager.<init>(BerkeleyJEStoreManager.java:68)
[ERROR] ... 50 more
[ERROR] Caused by: com.sleepycat.je.EnvironmentLockedException: (JE 5.0.73) <https://builds.apache.org/job/apache-atlas-nightly/ws/repository/target/data>:storage:1495598003105
The environment cannot be locked for single writer access. ENV_LOCKED: The je.lck file could
not be locked. Environment is invalid and must be closed.
[ERROR] at com.sleepycat.je.log.FileManager.<init>(FileManager.java:371)
[ERROR] at com.sleepycat.je.dbi.EnvironmentImpl.<init>(EnvironmentImpl.java:453)
[ERROR] at com.sleepycat.je.dbi.EnvironmentImpl.<init>(EnvironmentImpl.java:382)
[ERROR] at com.sleepycat.je.dbi.DbEnvPool.getEnvironment(DbEnvPool.java:178)
[ERROR] at com.sleepycat.je.Environment.makeEnvironmentImpl(Environment.java:246)
[ERROR] at com.sleepycat.je.Environment.<init>(Environment.java:227)
[ERROR] at com.sleepycat.je.Environment.<init>(Environment.java:170)
[ERROR] at com.thinkaurelius.titan.diskstorage.berkeleyje.BerkeleyJEStoreManager.initialize(BerkeleyJEStoreManager.java:104)
[ERROR] ... 51 more
[ERROR] -> [Help 1]
[ERROR] 
[ERROR] To see the full stack trace of the errors, re-run Maven with the -e switch.
[ERROR] Re-run Maven using the -X switch to enable full debug logging.
[ERROR] 
[ERROR] For more information about the errors and possible solutions, please read the following
articles:
[ERROR] [Help 1] http://cwiki.apache.org/confluence/display/MAVEN/MojoFailureException
[ERROR] 
[ERROR] After correcting the problems, you can resume the build with the command
[ERROR]   mvn <goals> -rf :atlas-repository
Build step 'Execute shell' marked build as failure
[CHECKSTYLE] Collecting checkstyle analysis files...
[CHECKSTYLE] Searching for all files in <https://builds.apache.org/job/apache-atlas-nightly/ws/>
that match the pattern **/target/checkstyle-result.xml
[CHECKSTYLE] Parsing 18 files in <https://builds.apache.org/job/apache-atlas-nightly/ws/>
[CHECKSTYLE] Successfully parsed file <https://builds.apache.org/job/apache-atlas-nightly/ws/authorization/target/checkstyle-result.xml>
with 464 unique warnings and 0 duplicates.
[CHECKSTYLE] Successfully parsed file <https://builds.apache.org/job/apache-atlas-nightly/ws/catalog/target/checkstyle-result.xml>
with 2609 unique warnings and 0 duplicates.
[CHECKSTYLE] Successfully parsed file <https://builds.apache.org/job/apache-atlas-nightly/ws/client/target/checkstyle-result.xml>
with 4223 unique warnings and 0 duplicates.
[CHECKSTYLE] Successfully parsed file <https://builds.apache.org/job/apache-atlas-nightly/ws/common/target/checkstyle-result.xml>
with 5390 unique warnings and 0 duplicates.
[CHECKSTYLE] Successfully parsed file <https://builds.apache.org/job/apache-atlas-nightly/ws/dashboardv2/target/checkstyle-result.xml>
with 5390 unique warnings and 0 duplicates.
[CHECKSTYLE] Successfully parsed file <https://builds.apache.org/job/apache-atlas-nightly/ws/graphdb/api/target/checkstyle-result.xml>
with 5638 unique warnings and 0 duplicates.
[CHECKSTYLE] Successfully parsed file <https://builds.apache.org/job/apache-atlas-nightly/ws/graphdb/common/target/checkstyle-result.xml>
with 5802 unique warnings and 0 duplicates.
[CHECKSTYLE] Successfully parsed file <https://builds.apache.org/job/apache-atlas-nightly/ws/graphdb/graphdb-impls/target/checkstyle-result.xml>
with 5802 unique warnings and 0 duplicates.
[CHECKSTYLE] Successfully parsed file <https://builds.apache.org/job/apache-atlas-nightly/ws/graphdb/target/checkstyle-result.xml>
with 5802 unique warnings and 0 duplicates.
[CHECKSTYLE] Successfully parsed file <https://builds.apache.org/job/apache-atlas-nightly/ws/graphdb/titan0/target/checkstyle-result.xml>
with 8032 unique warnings and 0 duplicates.
[CHECKSTYLE] Successfully parsed file <https://builds.apache.org/job/apache-atlas-nightly/ws/graphdb/titan1/target/checkstyle-result.xml>
with 8945 unique warnings and 0 duplicates.
[CHECKSTYLE] Successfully parsed file <https://builds.apache.org/job/apache-atlas-nightly/ws/intg/target/checkstyle-result.xml>
with 14912 unique warnings and 0 duplicates.
[CHECKSTYLE] Successfully parsed file <https://builds.apache.org/job/apache-atlas-nightly/ws/notification/target/checkstyle-result.xml>
with 16092 unique warnings and 0 duplicates.
[CHECKSTYLE] Successfully parsed file <https://builds.apache.org/job/apache-atlas-nightly/ws/server-api/target/checkstyle-result.xml>
with 16492 unique warnings and 0 duplicates.
[CHECKSTYLE] Successfully parsed file <https://builds.apache.org/job/apache-atlas-nightly/ws/shaded/hbase-client-shaded/target/checkstyle-result.xml>
with 16492 unique warnings and 0 duplicates.
[CHECKSTYLE] Successfully parsed file <https://builds.apache.org/job/apache-atlas-nightly/ws/shaded/hbase-server-shaded/target/checkstyle-result.xml>
with 16492 unique warnings and 0 duplicates.
[CHECKSTYLE] Successfully parsed file <https://builds.apache.org/job/apache-atlas-nightly/ws/target/checkstyle-result.xml>
with 16492 unique warnings and 0 duplicates.
[CHECKSTYLE] Successfully parsed file <https://builds.apache.org/job/apache-atlas-nightly/ws/typesystem/target/checkstyle-result.xml>
with 20711 unique warnings and 0 duplicates.
[CHECKSTYLE] Computing warning deltas based on reference build #711
[FINDBUGS] Collecting findbugs analysis files...
[FINDBUGS] Searching for all files in <https://builds.apache.org/job/apache-atlas-nightly/ws/>
that match the pattern **/target/findbugs.xml
[FINDBUGS] Parsing 11 files in <https://builds.apache.org/job/apache-atlas-nightly/ws/>
[FINDBUGS] Successfully parsed file <https://builds.apache.org/job/apache-atlas-nightly/ws/authorization/target/findbugs.xml>
with 0 unique warnings and 0 duplicates.
[FINDBUGS] Successfully parsed file <https://builds.apache.org/job/apache-atlas-nightly/ws/catalog/target/findbugs.xml>
with 0 unique warnings and 0 duplicates.
[FINDBUGS] Successfully parsed file <https://builds.apache.org/job/apache-atlas-nightly/ws/client/target/findbugs.xml>
with 0 unique warnings and 0 duplicates.
[FINDBUGS] Successfully parsed file <https://builds.apache.org/job/apache-atlas-nightly/ws/common/target/findbugs.xml>
with 0 unique warnings and 0 duplicates.
[FINDBUGS] Successfully parsed file <https://builds.apache.org/job/apache-atlas-nightly/ws/graphdb/api/target/findbugs.xml>
with 0 unique warnings and 0 duplicates.
[FINDBUGS] Successfully parsed file <https://builds.apache.org/job/apache-atlas-nightly/ws/graphdb/common/target/findbugs.xml>
with 0 unique warnings and 0 duplicates.
[FINDBUGS] Successfully parsed file <https://builds.apache.org/job/apache-atlas-nightly/ws/graphdb/titan0/target/findbugs.xml>
with 0 unique warnings and 0 duplicates.
[FINDBUGS] Successfully parsed file <https://builds.apache.org/job/apache-atlas-nightly/ws/intg/target/findbugs.xml>
with 0 unique warnings and 0 duplicates.
[FINDBUGS] Successfully parsed file <https://builds.apache.org/job/apache-atlas-nightly/ws/notification/target/findbugs.xml>
with 0 unique warnings and 0 duplicates.
[FINDBUGS] Successfully parsed file <https://builds.apache.org/job/apache-atlas-nightly/ws/server-api/target/findbugs.xml>
with 0 unique warnings and 0 duplicates.
[FINDBUGS] Successfully parsed file <https://builds.apache.org/job/apache-atlas-nightly/ws/typesystem/target/findbugs.xml>
with 0 unique warnings and 0 duplicates.
[FINDBUGS] Computing warning deltas based on reference build #711
Archiving artifacts
TestNG Reports Processing: START
Looking for TestNG results report in workspace using pattern: **/target/surefire-reports/testng-results.xml,**/target/failsafe-reports/testng-results.xml
testng-results.xml was last modified before this build started. Ignoring it.
testng-results.xml was last modified before this build started. Ignoring it.
testng-results.xml was last modified before this build started. Ignoring it.
testng-results.xml was last modified before this build started. Ignoring it.
Saving reports...
Processing '/x1/jenkins/jenkins-home/jobs/apache-atlas-nightly/builds/750/testng/testng-results-1.xml'
Processing '/x1/jenkins/jenkins-home/jobs/apache-atlas-nightly/builds/750/testng/testng-results-2.xml'
Processing '/x1/jenkins/jenkins-home/jobs/apache-atlas-nightly/builds/750/testng/testng-results-3.xml'
Processing '/x1/jenkins/jenkins-home/jobs/apache-atlas-nightly/builds/750/testng/testng-results-4.xml'
Processing '/x1/jenkins/jenkins-home/jobs/apache-atlas-nightly/builds/750/testng/testng-results-5.xml'
Processing '/x1/jenkins/jenkins-home/jobs/apache-atlas-nightly/builds/750/testng/testng-results-6.xml'
Processing '/x1/jenkins/jenkins-home/jobs/apache-atlas-nightly/builds/750/testng/testng-results.xml'
TestNG Reports Processing: FINISH

Mime
View raw message