atlas-dev mailing list archives

Site index · List index
Message view « Date » · « Thread »
Top « Date » · « Thread »
From Apache Jenkins Server <jenk...@builds.apache.org>
Subject Build failed in Jenkins: apache-atlas-nightly #751
Date Wed, 24 May 2017 19:15:52 GMT
See <https://builds.apache.org/job/apache-atlas-nightly/751/display/redirect?page=changes>

Changes:

[apoorvnaik] ATLAS-1198: Spring Framework (v4 with Spring security) over Guice

------------------------------------------
[...truncated 327.07 KB...]
[WARNING] Note: Recompile with -Xlint:unchecked for details.
[INFO] 
[INFO] --- maven-compiler-plugin:3.1:testCompile (default-testCompile) @ atlas-repository
---
[INFO] Changes detected - recompiling the module!
[INFO] Compiling 54 source files to <https://builds.apache.org/job/apache-atlas-nightly/ws/repository/target/test-classes>
[WARNING] <https://builds.apache.org/job/apache-atlas-nightly/ws/repository/src/test/java/org/apache/atlas/repository/typestore/StoreBackedTypeCacheTest.java>:
Some input files use or override a deprecated API.
[WARNING] <https://builds.apache.org/job/apache-atlas-nightly/ws/repository/src/test/java/org/apache/atlas/repository/typestore/StoreBackedTypeCacheTest.java>:
Recompile with -Xlint:deprecation for details.
[WARNING] <https://builds.apache.org/job/apache-atlas-nightly/ws/repository/src/test/java/org/apache/atlas/repository/typestore/StoreBackedTypeCacheTest.java>:
Some input files use unchecked or unsafe operations.
[WARNING] <https://builds.apache.org/job/apache-atlas-nightly/ws/repository/src/test/java/org/apache/atlas/repository/typestore/StoreBackedTypeCacheTest.java>:
Recompile with -Xlint:unchecked for details.
[INFO] 
[INFO] --- maven-surefire-plugin:2.18.1:test (default-test) @ atlas-repository ---
[INFO] Surefire report directory: <https://builds.apache.org/job/apache-atlas-nightly/ws/repository/target/surefire-reports>
[INFO] Using configured provider org.apache.maven.surefire.testng.TestNGProvider
[WARNING] file.encoding cannot be set as system property, use <argLine>-Dfile.encoding=...<argLine>
instead

-------------------------------------------------------
 T E S T S
-------------------------------------------------------
Running org.apache.atlas.RepositoryServiceLoadingTest
Running org.apache.atlas.repository.store.graph.v1.InverseReferenceUpdateSoftDeleteV1Test
Running org.apache.atlas.repository.store.graph.v1.AtlasDeleteHandlerV1Test
Running org.apache.atlas.TestModules
Running org.apache.atlas.repository.store.graph.AtlasEntityDefStoreV1Test
Running org.apache.atlas.util.CompiledQueryCacheKeyTest
Running org.apache.atlas.discovery.GraphBackedDiscoveryServiceTest
Running org.apache.atlas.repository.store.graph.v1.InverseReferenceUpdateHardDeleteV1Test
Running org.apache.atlas.discovery.DataSetLineageServiceTest
Running org.apache.atlas.repository.impexp.ImportServiceReportingTest
Running org.apache.atlas.repository.store.graph.AtlasTypeDefGraphStoreTest
Running org.apache.atlas.service.DefaultMetadataServiceTest
Running org.apache.atlas.repository.impexp.ZipSinkTest
Running org.apache.atlas.service.StoreBackedTypeCacheMetadataServiceTest
Running org.apache.atlas.repository.graph.GraphBackedMetadataRepositoryTest
Running org.apache.atlas.repository.graph.ReverseReferenceUpdateHardDeleteTest
Running org.apache.atlas.repository.store.graph.v1.HardDeleteHandlerV1Test
Running org.apache.atlas.repository.impexp.ZipSourceTest
Running org.apache.atlas.repository.audit.HBaseBasedAuditRepositoryHATest
Running org.apache.atlas.repository.impexp.ImportServiceTest
Running org.apache.atlas.repository.store.graph.v1.SoftDeleteHandlerV1Test
Running org.apache.atlas.repository.audit.HBaseBasedAuditRepositoryTest
Running org.apache.atlas.repository.impexp.ExportServiceTest
Running org.apache.atlas.repository.store.graph.v1.InverseReferenceUpdateV1Test
Running org.apache.atlas.repository.audit.InMemoryAuditRepositoryTest
Running org.apache.atlas.repository.graph.GraphHelperTest
Running org.apache.atlas.repository.graph.ReverseReferenceUpdateSoftDeleteTest
Running org.apache.atlas.repository.store.graph.v1.AtlasEntityStoreV1Test
Running org.apache.atlas.repository.graph.Gremlin3QueryOptimizerTest
Running org.apache.atlas.repository.graph.TestIntSequence
Running org.apache.atlas.repository.graph.GraphBackedRepositorySoftDeleteTest
Running org.apache.atlas.repository.graph.GraphBackedRepositoryHardDeleteTest
Tests run: 5, Failures: 0, Errors: 0, Skipped: 0, Time elapsed: 27.076 sec - in org.apache.atlas.util.CompiledQueryCacheKeyTest
Tests run: 0, Failures: 0, Errors: 0, Skipped: 0, Time elapsed: 27.544 sec - in org.apache.atlas.repository.store.graph.v1.AtlasDeleteHandlerV1Test
Running org.apache.atlas.repository.graph.AbstractGremlinQueryOptimizerTest
Running org.apache.atlas.repository.graph.GraphBackedSearchIndexerMockTest
Tests run: 0, Failures: 0, Errors: 0, Skipped: 0, Time elapsed: 29.485 sec - in org.apache.atlas.TestModules
Tests run: 0, Failures: 0, Errors: 0, Skipped: 0, Time elapsed: 30.305 sec - in org.apache.atlas.repository.impexp.ImportServiceReportingTest
Running org.apache.atlas.repository.graph.GraphHelperMockTest
Tests run: 0, Failures: 0, Errors: 0, Skipped: 0, Time elapsed: 30.429 sec - in org.apache.atlas.repository.store.graph.v1.InverseReferenceUpdateV1Test
Tests run: 3, Failures: 0, Errors: 0, Skipped: 0, Time elapsed: 30.461 sec - in org.apache.atlas.repository.audit.InMemoryAuditRepositoryTest
Tests run: 2, Failures: 0, Errors: 0, Skipped: 0, Time elapsed: 31.092 sec - in org.apache.atlas.repository.audit.HBaseBasedAuditRepositoryHATest
Running org.apache.atlas.repository.graph.GraphRepoMapperScaleTest
Tests run: 5, Failures: 0, Errors: 0, Skipped: 0, Time elapsed: 32.067 sec - in org.apache.atlas.repository.impexp.ZipSinkTest
Tests run: 3, Failures: 0, Errors: 0, Skipped: 0, Time elapsed: 31.937 sec - in org.apache.atlas.repository.impexp.ZipSourceTest
Running org.apache.atlas.repository.graph.Gremlin2QueryOptimizerTest
Running org.apache.atlas.repository.graph.GraphBackedSearchIndexerTest
Tests run: 0, Failures: 0, Errors: 0, Skipped: 0, Time elapsed: 32.086 sec - in org.apache.atlas.repository.graph.TestIntSequence
Running org.apache.atlas.repository.BaseTest
Running org.apache.atlas.repository.typestore.GraphBackedTypeStoreTest
Running org.apache.atlas.repository.typestore.StoreBackedTypeCacheTest
Running org.apache.atlas.lineage.EntityLineageServiceTest
Tests run: 33, Failures: 0, Errors: 0, Skipped: 0, Time elapsed: 34.336 sec - in org.apache.atlas.repository.graph.Gremlin3QueryOptimizerTest
Running org.apache.atlas.BaseRepositoryTest
Tests run: 0, Failures: 0, Errors: 0, Skipped: 0, Time elapsed: 38.856 sec - in org.apache.atlas.discovery.DataSetLineageServiceTest
Running org.apache.atlas.query.ExpressionTest
Tests run: 1, Failures: 0, Errors: 0, Skipped: 0, Time elapsed: 43.714 sec - in org.apache.atlas.RepositoryServiceLoadingTest
Running org.apache.atlas.query.LexerTest
Tests run: 1, Failures: 0, Errors: 0, Skipped: 0, Time elapsed: 49.513 sec - in org.apache.atlas.repository.store.graph.AtlasEntityDefStoreV1Test
Running org.apache.atlas.query.ParserTest
Tests run: 5, Failures: 0, Errors: 0, Skipped: 0, Time elapsed: 53.569 sec - in org.apache.atlas.repository.graph.ReverseReferenceUpdateSoftDeleteTest
Tests run: 0, Failures: 0, Errors: 0, Skipped: 0, Time elapsed: 27.505 sec - in org.apache.atlas.repository.graph.AbstractGremlinQueryOptimizerTest
Tests run: 5, Failures: 0, Errors: 0, Skipped: 0, Time elapsed: 55.985 sec - in org.apache.atlas.repository.graph.ReverseReferenceUpdateHardDeleteTest
Running org.apache.atlas.query.LineageQueryTest
Running org.apache.atlas.query.QueryProcessorTest
Running org.apache.atlas.query.GremlinTest
Tests run: 3, Failures: 0, Errors: 0, Skipped: 0, Time elapsed: 35.59 sec - in org.apache.atlas.repository.graph.GraphBackedSearchIndexerMockTest
Tests run: 3, Failures: 0, Errors: 0, Skipped: 0, Time elapsed: 65.642 sec - in org.apache.atlas.service.StoreBackedTypeCacheMetadataServiceTest
Tests run: 33, Failures: 0, Errors: 0, Skipped: 0, Time elapsed: 34.097 sec - in org.apache.atlas.repository.graph.Gremlin2QueryOptimizerTest
Tests run: 2, Failures: 0, Errors: 0, Skipped: 0, Time elapsed: 36.179 sec - in org.apache.atlas.repository.graph.GraphHelperMockTest
Tests run: 0, Failures: 0, Errors: 0, Skipped: 0, Time elapsed: 33.433 sec - in org.apache.atlas.repository.BaseTest
Running org.apache.atlas.query.BaseGremlinTest
Running org.apache.atlas.services.MetricsServiceTest
Running org.apache.atlas.services.EntityDiscoveryServiceTest
Running org.apache.atlas.TestUtils
Tests run: 5, Failures: 0, Errors: 0, Skipped: 0, Time elapsed: 72.972 sec - in org.apache.atlas.repository.store.graph.v1.InverseReferenceUpdateSoftDeleteV1Test
Tests run: 5, Failures: 0, Errors: 0, Skipped: 0, Time elapsed: 75.338 sec - in org.apache.atlas.repository.store.graph.v1.InverseReferenceUpdateHardDeleteV1Test
Tests run: 0, Failures: 0, Errors: 0, Skipped: 0, Time elapsed: 38.777 sec - in org.apache.atlas.BaseRepositoryTest
Tests run: 14, Failures: 0, Errors: 0, Skipped: 0, Time elapsed: 74.948 sec - in org.apache.atlas.repository.graph.GraphHelperTest
Tests run: 19, Failures: 0, Errors: 0, Skipped: 0, Time elapsed: 35.605 sec - in org.apache.atlas.query.ExpressionTest
Tests run: 5, Failures: 0, Errors: 0, Skipped: 0, Time elapsed: 45.856 sec - in org.apache.atlas.repository.graph.GraphBackedSearchIndexerTest
Tests run: 13, Failures: 0, Errors: 0, Skipped: 0, Time elapsed: 80.694 sec - in org.apache.atlas.repository.store.graph.v1.AtlasEntityStoreV1Test
Tests run: 1, Failures: 0, Errors: 0, Skipped: 0, Time elapsed: 37.356 sec - in org.apache.atlas.query.LexerTest
Tests run: 5, Failures: 0, Errors: 0, Skipped: 0, Time elapsed: 48.576 sec - in org.apache.atlas.repository.typestore.GraphBackedTypeStoreTest
Tests run: 14, Failures: 0, Errors: 0, Skipped: 0, Time elapsed: 35.224 sec - in org.apache.atlas.query.ParserTest
Tests run: 2, Failures: 0, Errors: 0, Skipped: 0, Time elapsed: 54.007 sec - in org.apache.atlas.repository.typestore.StoreBackedTypeCacheTest
Tests run: 4, Failures: 0, Errors: 0, Skipped: 0, Time elapsed: 88.338 sec - in org.apache.atlas.repository.audit.HBaseBasedAuditRepositoryTest
Tests run: 3, Failures: 0, Errors: 0, Skipped: 0, Time elapsed: 89.35 sec - in org.apache.atlas.repository.impexp.ImportServiceTest
Tests run: 12, Failures: 0, Errors: 0, Skipped: 0, Time elapsed: 90.321 sec - in org.apache.atlas.repository.store.graph.AtlasTypeDefGraphStoreTest
Tests run: 5, Failures: 0, Errors: 0, Skipped: 0, Time elapsed: 33.372 sec - in org.apache.atlas.query.QueryProcessorTest
Tests run: 30, Failures: 0, Errors: 0, Skipped: 0, Time elapsed: 92.453 sec - in org.apache.atlas.repository.graph.GraphBackedMetadataRepositoryTest
Tests run: 0, Failures: 0, Errors: 0, Skipped: 0, Time elapsed: 24.788 sec - in org.apache.atlas.TestUtils
Tests run: 21, Failures: 0, Errors: 0, Skipped: 0, Time elapsed: 92.412 sec - in org.apache.atlas.repository.graph.GraphBackedRepositorySoftDeleteTest
Tests run: 0, Failures: 0, Errors: 0, Skipped: 0, Time elapsed: 26.919 sec - in org.apache.atlas.query.BaseGremlinTest
Tests run: 11, Failures: 0, Errors: 0, Skipped: 0, Time elapsed: 94.573 sec - in org.apache.atlas.repository.store.graph.v1.SoftDeleteHandlerV1Test
Tests run: 21, Failures: 0, Errors: 0, Skipped: 0, Time elapsed: 94.779 sec - in org.apache.atlas.repository.graph.GraphBackedRepositoryHardDeleteTest
Tests run: 10, Failures: 0, Errors: 0, Skipped: 0, Time elapsed: 96.355 sec - in org.apache.atlas.repository.impexp.ExportServiceTest
Tests run: 11, Failures: 0, Errors: 0, Skipped: 0, Time elapsed: 97 sec - in org.apache.atlas.repository.store.graph.v1.HardDeleteHandlerV1Test
Tests run: 6, Failures: 1, Errors: 0, Skipped: 0, Time elapsed: 29.513 sec <<< FAILURE!
- in org.apache.atlas.services.EntityDiscoveryServiceTest
getSubTypeForTypeWithSubTypes_ReturnsOrClause(org.apache.atlas.services.EntityDiscoveryServiceTest)
 Time elapsed: 0.044 sec  <<< FAILURE!
java.lang.AssertionError: null
	at org.junit.Assert.fail(Assert.java:86)
	at org.junit.Assert.assertTrue(Assert.java:41)
	at org.junit.Assert.assertTrue(Assert.java:52)
	at org.apache.atlas.services.EntityDiscoveryServiceTest.getSubTypeForTypeWithSubTypes_ReturnsOrClause(EntityDiscoveryServiceTest.java:103)

Tests run: 1, Failures: 0, Errors: 0, Skipped: 0, Time elapsed: 30.506 sec - in org.apache.atlas.services.MetricsServiceTest
Tests run: 26, Failures: 0, Errors: 0, Skipped: 0, Time elapsed: 102.809 sec - in org.apache.atlas.service.DefaultMetadataServiceTest
Tests run: 5, Failures: 0, Errors: 0, Skipped: 0, Time elapsed: 49.226 sec - in org.apache.atlas.query.LineageQueryTest
Tests run: 23, Failures: 0, Errors: 0, Skipped: 0, Time elapsed: 74.757 sec - in org.apache.atlas.lineage.EntityLineageServiceTest
Tests run: 21, Failures: 0, Errors: 0, Skipped: 0, Time elapsed: 56.647 sec - in org.apache.atlas.query.GremlinTest
Tests run: 2, Failures: 0, Errors: 0, Skipped: 0, Time elapsed: 211.888 sec - in org.apache.atlas.repository.graph.GraphRepoMapperScaleTest
Tests run: 333, Failures: 0, Errors: 0, Skipped: 0, Time elapsed: 248.373 sec - in org.apache.atlas.discovery.GraphBackedDiscoveryServiceTest

Results :

Failed tests: 
  EntityDiscoveryServiceTest.getSubTypeForTypeWithSubTypes_ReturnsOrClause:103 null

Tests run: 732, Failures: 1, Errors: 0, Skipped: 0

[INFO] ------------------------------------------------------------------------
[INFO] Reactor Summary:
[INFO] 
[INFO] Apache Atlas Server Build Tools .................... SUCCESS [  2.600 s]
[INFO] apache-atlas ....................................... SUCCESS [ 18.661 s]
[INFO] Apache Atlas Integration ........................... SUCCESS [ 43.054 s]
[INFO] Apache Atlas Common ................................ SUCCESS [ 16.457 s]
[INFO] Apache Atlas Typesystem ............................ SUCCESS [01:12 min]
[INFO] Apache Atlas Client ................................ SUCCESS [ 21.190 s]
[INFO] Apache Atlas Server API ............................ SUCCESS [ 10.637 s]
[INFO] Apache Atlas Notification .......................... SUCCESS [ 24.865 s]
[INFO] Apache Atlas Graph Database Projects ............... SUCCESS [  0.707 s]
[INFO] Apache Atlas Graph Database API .................... SUCCESS [  7.734 s]
[INFO] Graph Database Common Code ......................... SUCCESS [  7.545 s]
[INFO] Apache Atlas Titan 1.0.0 GraphDB Impl .............. SUCCESS [ 36.581 s]
[INFO] Shaded version of Apache hbase client .............. SUCCESS [  9.333 s]
[INFO] Apache Atlas Titan 0.5.4 Graph DB Impl ............. SUCCESS [01:25 min]
[INFO] Apache Atlas Graph Database Implementation Dependencies SUCCESS [  0.893 s]
[INFO] Shaded version of Apache hbase server .............. SUCCESS [ 25.222 s]
[INFO] Apache Atlas Repository ............................ FAILURE [05:08 min]
[INFO] Apache Atlas Authorization ......................... SKIPPED
[INFO] Apache Atlas Business Catalog ...................... SKIPPED
[INFO] Apache Atlas UI .................................... SKIPPED
[INFO] Apache Atlas Web Application ....................... SKIPPED
[INFO] Apache Atlas Documentation ......................... SKIPPED
[INFO] Apache Atlas FileSystem Model ...................... SKIPPED
[INFO] Apache Atlas Plugin Classloader .................... SKIPPED
[INFO] Apache Atlas Hive Bridge Shim ...................... SKIPPED
[INFO] Apache Atlas Hive Bridge ........................... SKIPPED
[INFO] Apache Atlas Falcon Bridge Shim .................... SKIPPED
[INFO] Apache Atlas Falcon Bridge ......................... SKIPPED
[INFO] Apache Atlas Sqoop Bridge Shim ..................... SKIPPED
[INFO] Apache Atlas Sqoop Bridge .......................... SKIPPED
[INFO] Apache Atlas Storm Bridge Shim ..................... SKIPPED
[INFO] Apache Atlas Storm Bridge .......................... SKIPPED
[INFO] Apache Atlas Distribution .......................... SKIPPED
[INFO] ------------------------------------------------------------------------
[INFO] BUILD FAILURE
[INFO] ------------------------------------------------------------------------
[INFO] Total time: 11:36 min
[INFO] Finished at: 2017-05-24T19:11:53+00:00
[INFO] Final Memory: 157M/1748M
[INFO] ------------------------------------------------------------------------
[ERROR] Failed to execute goal org.apache.maven.plugins:maven-surefire-plugin:2.18.1:test
(default-test) on project atlas-repository: There are test failures.
[ERROR] 
[ERROR] Please refer to <https://builds.apache.org/job/apache-atlas-nightly/ws/repository/target/surefire-reports>
for the individual test results.
[ERROR] -> [Help 1]
[ERROR] 
[ERROR] To see the full stack trace of the errors, re-run Maven with the -e switch.
[ERROR] Re-run Maven using the -X switch to enable full debug logging.
[ERROR] 
[ERROR] For more information about the errors and possible solutions, please read the following
articles:
[ERROR] [Help 1] http://cwiki.apache.org/confluence/display/MAVEN/MojoFailureException
[ERROR] 
[ERROR] After correcting the problems, you can resume the build with the command
[ERROR]   mvn <goals> -rf :atlas-repository
Build step 'Execute shell' marked build as failure
[CHECKSTYLE] Collecting checkstyle analysis files...
[CHECKSTYLE] Searching for all files in <https://builds.apache.org/job/apache-atlas-nightly/ws/>
that match the pattern **/target/checkstyle-result.xml
[CHECKSTYLE] Parsing 18 files in <https://builds.apache.org/job/apache-atlas-nightly/ws/>
[CHECKSTYLE] Successfully parsed file <https://builds.apache.org/job/apache-atlas-nightly/ws/authorization/target/checkstyle-result.xml>
with 464 unique warnings and 0 duplicates.
[CHECKSTYLE] Successfully parsed file <https://builds.apache.org/job/apache-atlas-nightly/ws/catalog/target/checkstyle-result.xml>
with 2609 unique warnings and 0 duplicates.
[CHECKSTYLE] Successfully parsed file <https://builds.apache.org/job/apache-atlas-nightly/ws/client/target/checkstyle-result.xml>
with 4183 unique warnings and 0 duplicates.
[CHECKSTYLE] Successfully parsed file <https://builds.apache.org/job/apache-atlas-nightly/ws/common/target/checkstyle-result.xml>
with 5380 unique warnings and 0 duplicates.
[CHECKSTYLE] Successfully parsed file <https://builds.apache.org/job/apache-atlas-nightly/ws/dashboardv2/target/checkstyle-result.xml>
with 5380 unique warnings and 0 duplicates.
[CHECKSTYLE] Successfully parsed file <https://builds.apache.org/job/apache-atlas-nightly/ws/graphdb/api/target/checkstyle-result.xml>
with 5628 unique warnings and 0 duplicates.
[CHECKSTYLE] Successfully parsed file <https://builds.apache.org/job/apache-atlas-nightly/ws/graphdb/common/target/checkstyle-result.xml>
with 5792 unique warnings and 0 duplicates.
[CHECKSTYLE] Successfully parsed file <https://builds.apache.org/job/apache-atlas-nightly/ws/graphdb/graphdb-impls/target/checkstyle-result.xml>
with 5792 unique warnings and 0 duplicates.
[CHECKSTYLE] Successfully parsed file <https://builds.apache.org/job/apache-atlas-nightly/ws/graphdb/target/checkstyle-result.xml>
with 5792 unique warnings and 0 duplicates.
[CHECKSTYLE] Successfully parsed file <https://builds.apache.org/job/apache-atlas-nightly/ws/graphdb/titan0/target/checkstyle-result.xml>
with 8022 unique warnings and 0 duplicates.
[CHECKSTYLE] Successfully parsed file <https://builds.apache.org/job/apache-atlas-nightly/ws/graphdb/titan1/target/checkstyle-result.xml>
with 8935 unique warnings and 0 duplicates.
[CHECKSTYLE] Successfully parsed file <https://builds.apache.org/job/apache-atlas-nightly/ws/intg/target/checkstyle-result.xml>
with 14949 unique warnings and 0 duplicates.
[CHECKSTYLE] Successfully parsed file <https://builds.apache.org/job/apache-atlas-nightly/ws/notification/target/checkstyle-result.xml>
with 16130 unique warnings and 0 duplicates.
[CHECKSTYLE] Successfully parsed file <https://builds.apache.org/job/apache-atlas-nightly/ws/server-api/target/checkstyle-result.xml>
with 16509 unique warnings and 0 duplicates.
[CHECKSTYLE] Successfully parsed file <https://builds.apache.org/job/apache-atlas-nightly/ws/shaded/hbase-client-shaded/target/checkstyle-result.xml>
with 16509 unique warnings and 0 duplicates.
[CHECKSTYLE] Successfully parsed file <https://builds.apache.org/job/apache-atlas-nightly/ws/shaded/hbase-server-shaded/target/checkstyle-result.xml>
with 16509 unique warnings and 0 duplicates.
[CHECKSTYLE] Successfully parsed file <https://builds.apache.org/job/apache-atlas-nightly/ws/target/checkstyle-result.xml>
with 16509 unique warnings and 0 duplicates.
[CHECKSTYLE] Successfully parsed file <https://builds.apache.org/job/apache-atlas-nightly/ws/typesystem/target/checkstyle-result.xml>
with 20726 unique warnings and 0 duplicates.
[CHECKSTYLE] Computing warning deltas based on reference build #711
[FINDBUGS] Collecting findbugs analysis files...
[FINDBUGS] Searching for all files in <https://builds.apache.org/job/apache-atlas-nightly/ws/>
that match the pattern **/target/findbugs.xml
[FINDBUGS] Parsing 11 files in <https://builds.apache.org/job/apache-atlas-nightly/ws/>
[FINDBUGS] Successfully parsed file <https://builds.apache.org/job/apache-atlas-nightly/ws/authorization/target/findbugs.xml>
with 0 unique warnings and 0 duplicates.
[FINDBUGS] Successfully parsed file <https://builds.apache.org/job/apache-atlas-nightly/ws/catalog/target/findbugs.xml>
with 0 unique warnings and 0 duplicates.
[FINDBUGS] Successfully parsed file <https://builds.apache.org/job/apache-atlas-nightly/ws/client/target/findbugs.xml>
with 0 unique warnings and 0 duplicates.
[FINDBUGS] Successfully parsed file <https://builds.apache.org/job/apache-atlas-nightly/ws/common/target/findbugs.xml>
with 0 unique warnings and 0 duplicates.
[FINDBUGS] Successfully parsed file <https://builds.apache.org/job/apache-atlas-nightly/ws/graphdb/api/target/findbugs.xml>
with 0 unique warnings and 0 duplicates.
[FINDBUGS] Successfully parsed file <https://builds.apache.org/job/apache-atlas-nightly/ws/graphdb/common/target/findbugs.xml>
with 0 unique warnings and 0 duplicates.
[FINDBUGS] Successfully parsed file <https://builds.apache.org/job/apache-atlas-nightly/ws/graphdb/titan0/target/findbugs.xml>
with 0 unique warnings and 0 duplicates.
[FINDBUGS] Successfully parsed file <https://builds.apache.org/job/apache-atlas-nightly/ws/intg/target/findbugs.xml>
with 0 unique warnings and 0 duplicates.
[FINDBUGS] Successfully parsed file <https://builds.apache.org/job/apache-atlas-nightly/ws/notification/target/findbugs.xml>
with 0 unique warnings and 0 duplicates.
[FINDBUGS] Successfully parsed file <https://builds.apache.org/job/apache-atlas-nightly/ws/server-api/target/findbugs.xml>
with 0 unique warnings and 0 duplicates.
[FINDBUGS] Successfully parsed file <https://builds.apache.org/job/apache-atlas-nightly/ws/typesystem/target/findbugs.xml>
with 0 unique warnings and 0 duplicates.
[FINDBUGS] Computing warning deltas based on reference build #711
Archiving artifacts
TestNG Reports Processing: START
Looking for TestNG results report in workspace using pattern: **/target/surefire-reports/testng-results.xml,**/target/failsafe-reports/testng-results.xml
testng-results.xml was last modified before this build started. Ignoring it.
testng-results.xml was last modified before this build started. Ignoring it.
testng-results.xml was last modified before this build started. Ignoring it.
testng-results.xml was last modified before this build started. Ignoring it.
Saving reports...
Processing '/x1/jenkins/jenkins-home/jobs/apache-atlas-nightly/builds/751/testng/testng-results-1.xml'
Processing '/x1/jenkins/jenkins-home/jobs/apache-atlas-nightly/builds/751/testng/testng-results-2.xml'
Processing '/x1/jenkins/jenkins-home/jobs/apache-atlas-nightly/builds/751/testng/testng-results-3.xml'
Processing '/x1/jenkins/jenkins-home/jobs/apache-atlas-nightly/builds/751/testng/testng-results-4.xml'
Processing '/x1/jenkins/jenkins-home/jobs/apache-atlas-nightly/builds/751/testng/testng-results-5.xml'
Processing '/x1/jenkins/jenkins-home/jobs/apache-atlas-nightly/builds/751/testng/testng-results-6.xml'
Processing '/x1/jenkins/jenkins-home/jobs/apache-atlas-nightly/builds/751/testng/testng-results.xml'
TestNG Reports Processing: FINISH

Mime
View raw message