atlas-dev mailing list archives

Site index · List index
Message view « Date » · « Thread »
Top « Date » · « Thread »
From Apache Jenkins Server <jenk...@builds.apache.org>
Subject Build failed in Jenkins: apache-atlas-nightly #732
Date Wed, 10 May 2017 22:52:04 GMT
See <https://builds.apache.org/job/apache-atlas-nightly/732/display/redirect?page=changes>

Changes:

[apoorvnaik] Disable Forks while running ITs

------------------------------------------
[...truncated 985.12 KB...]
127.0.0.1 - - [10/May/2017:22:34:39 +0000] "GET /api/atlas/entities/cd8bd379-857d-4b74-92b8-ca15d4accc80
HTTP/1.1" 200 - "-" "Java/1.7.0_80"
127.0.0.1 - - [10/May/2017:22:34:39 +0000] "POST /api/atlas/entities HTTP/1.1" 201 - "-" "Java/1.7.0_80"
127.0.0.1 - - [10/May/2017:22:34:39 +0000] "DELETE /api/atlas/entities?type=hive_db&property=qualifiedName&value=iTqEqiYWlQ
HTTP/1.1" 200 - "-" "Java/1.7.0_80"
127.0.0.1 - - [10/May/2017:22:34:39 +0000] "GET /api/atlas/entities/562e49e8-54e3-44f7-90bf-1409e142abca
HTTP/1.1" 200 - "-" "Java/1.7.0_80"
127.0.0.1 - - [10/May/2017:22:34:39 +0000] "DELETE /api/atlas/entities/random/traits HTTP/1.1"
500 - "-" "Java/1.7.0_80"
127.0.0.1 - - [10/May/2017:22:34:39 +0000] "POST /api/atlas/entities HTTP/1.1" 201 - "-" "Java/1.7.0_80"
127.0.0.1 - - [10/May/2017:22:34:39 +0000] "GET /api/atlas/entities/c1a2ab05-e0e7-422d-921c-9343da2010bc/audit?count=100
HTTP/1.1" 200 - "-" "Java/1.7.0_80"
127.0.0.1 - - [10/May/2017:22:35:40 +0000] "POST /api/atlas/types HTTP/1.1" 201 - "-" "Java/1.7.0_80"
127.0.0.1 - - [10/May/2017:22:35:41 +0000] "POST /api/atlas/entities HTTP/1.1" 201 - "-" "Java/1.7.0_80"
127.0.0.1 - - [10/May/2017:22:35:41 +0000] "PUT /api/atlas/types HTTP/1.1" 200 - "-" "Java/1.7.0_80"
127.0.0.1 - - [10/May/2017:22:35:41 +0000] "GET /api/atlas/entities/206ba6e3-a972-466c-ace5-c6cbd615a905
HTTP/1.1" 200 - "-" "Java/1.7.0_80"
127.0.0.1 - - [10/May/2017:22:35:41 +0000] "POST /api/atlas/entities HTTP/1.1" 400 - "-" "Java/1.7.0_80"
127.0.0.1 - - [10/May/2017:22:35:41 +0000] "POST /api/atlas/entities HTTP/1.1" 400 - "-" "Java/1.7.0_80"
127.0.0.1 - - [10/May/2017:22:35:41 +0000] "POST /api/atlas/entities HTTP/1.1" 201 - "-" "Java/1.7.0_80"
127.0.0.1 - - [10/May/2017:22:35:41 +0000] "GET /api/atlas/entities?type=hive_db&property=qualifiedName&value=ghpzu2bdtb
HTTP/1.1" 200 - "-" "Java/1.7.0_80"
127.0.0.1 - - [10/May/2017:22:35:41 +0000] "GET /api/atlas/entities?type=blah HTTP/1.1" 400
- "-" "Java/1.7.0_80"
127.0.0.1 - - [10/May/2017:22:35:41 +0000] "POST /api/atlas/types HTTP/1.1" 201 - "-" "Java/1.7.0_80"
127.0.0.1 - - [10/May/2017:22:35:41 +0000] "GET /api/atlas/entities?type=testnH0RrPxK5g HTTP/1.1"
200 - "-" "Java/1.7.0_80"
127.0.0.1 - - [10/May/2017:22:35:41 +0000] "GET /api/atlas/entities/blah HTTP/1.1" 404 - "-"
"Java/1.7.0_80"
127.0.0.1 - - [10/May/2017:22:35:41 +0000] "POST /api/atlas/entities HTTP/1.1" 201 - "-" "Java/1.7.0_80"
127.0.0.1 - - [10/May/2017:22:35:41 +0000] "GET /api/atlas/entities/a1985326-09bb-4cce-8a64-da19f1baa7a8/audit?count=10
HTTP/1.1" 200 - "-" "Java/1.7.0_80"
127.0.0.1 - - [10/May/2017:22:35:41 +0000] "POST /api/atlas/entities HTTP/1.1" 400 - "-" "Java/1.7.0_80"
127.0.0.1 - - [10/May/2017:22:35:41 +0000] "POST /api/atlas/entities HTTP/1.1" 201 - "-" "Java/1.7.0_80"
127.0.0.1 - - [10/May/2017:22:35:41 +0000] "GET /api/atlas/types/Fqb27HMZAA HTTP/1.1" 404
- "-" "Java/1.7.0_80"
127.0.0.1 - - [10/May/2017:22:35:41 +0000] "POST /api/atlas/types HTTP/1.1" 201 - "-" "Java/1.7.0_80"
127.0.0.1 - - [10/May/2017:22:35:41 +0000] "POST /api/atlas/entities HTTP/1.1" 201 - "-" "Java/1.7.0_80"
127.0.0.1 - - [10/May/2017:22:35:41 +0000] "GET /api/atlas/entities/efce32f2-57c0-4b80-bbcf-d0da84117544
HTTP/1.1" 200 - "-" "Java/1.7.0_80"
127.0.0.1 - - [10/May/2017:22:35:41 +0000] "GET /api/atlas/v2/entity/guid/796de4a2-4a9f-4177-b6b4-750caac31b79
HTTP/1.1" 200 - "-" "Java/1.7.0_80"
127.0.0.1 - - [10/May/2017:22:35:41 +0000] "POST /api/atlas/v2/entity/ HTTP/1.1" 200 - "-"
"Java/1.7.0_80"
127.0.0.1 - - [10/May/2017:22:35:41 +0000] "POST /api/atlas/v2/entity/guid/random/classifications
HTTP/1.1" 404 - "-" "Java/1.7.0_80"
127.0.0.1 - - [10/May/2017:22:35:41 +0000] "POST /api/atlas/v2/entity/bulk/ HTTP/1.1" 200
- "-" "Java/1.7.0_80"
127.0.0.1 - - [10/May/2017:22:35:42 +0000] "POST /api/atlas/v2/entity/ HTTP/1.1" 200 - "-"
"Java/1.7.0_80"
127.0.0.1 - - [10/May/2017:22:35:42 +0000] "POST /api/atlas/v2/entity/ HTTP/1.1" 200 - "-"
"Java/1.7.0_80"
127.0.0.1 - - [10/May/2017:22:35:42 +0000] "DELETE /api/atlas/v2/entity/bulk/?guid=163f025e-4cbc-4751-a2d4-d7b596c6a167&guid=56ff2e86-f26d-44c7-a3e9-98eb79df164a
HTTP/1.1" 200 - "-" "Java/1.7.0_80"
127.0.0.1 - - [10/May/2017:22:35:42 +0000] "POST /api/atlas/v2/entity/ HTTP/1.1" 200 - "-"
"Java/1.7.0_80"
127.0.0.1 - - [10/May/2017:22:35:42 +0000] "DELETE /api/atlas/v2/entity/uniqueAttribute/type/hive_db_v2?attr:name=dburg0VIIt1G%EB%9C%AE%E9%8D%BE%EA%A4%8B%E7%80%A1%EE%AC%BA%EE%AA%BA%E5%B9%82%E5%BB%9E%E7%9D%B7%E8%AE%BF
HTTP/1.1" 200 - "-" "Java/1.7.0_80"
127.0.0.1 - - [10/May/2017:22:35:42 +0000] "DELETE /api/atlas/v2/entity/guid/random/classification/blah_trait
HTTP/1.1" 400 - "-" "Java/1.7.0_80"
127.0.0.1 - - [10/May/2017:22:35:42 +0000] "GET /api/atlas/discovery/search/dsl?query=hive_db_v2+where+name%3D'dburg0VIIt1G'&limit=10&offset=0
HTTP/1.1" 200 - "-" "Java/1.7.0_80"
127.0.0.1 - - [10/May/2017:22:36:44 +0000] "POST /api/atlas/v2/types/typedefs/ HTTP/1.1" 200
- "-" "Java/1.7.0_80"
127.0.0.1 - - [10/May/2017:22:36:44 +0000] "POST /api/atlas/v2/entity/ HTTP/1.1" 200 - "-"
"Java/1.7.0_80"
127.0.0.1 - - [10/May/2017:22:36:44 +0000] "PUT /api/atlas/v2/types/typedefs/ HTTP/1.1" 200
- "-" "Java/1.7.0_80"
127.0.0.1 - - [10/May/2017:22:36:44 +0000] "GET /api/atlas/v2/entity/guid/d204e37c-00e2-4ed7-9940-8389f1bfc518
HTTP/1.1" 200 - "-" "Java/1.7.0_80"
127.0.0.1 - - [10/May/2017:22:36:44 +0000] "POST /api/atlas/v2/entity/ HTTP/1.1" 404 - "-"
"Java/1.7.0_80"
127.0.0.1 - - [10/May/2017:22:36:44 +0000] "POST /api/atlas/v2/entity/ HTTP/1.1" 200 - "-"
"Java/1.7.0_80"
127.0.0.1 - - [10/May/2017:22:36:44 +0000] "POST /api/atlas/v2/entity/ HTTP/1.1" 200 - "-"
"Java/1.7.0_80"
127.0.0.1 - - [10/May/2017:22:36:44 +0000] "GET /api/atlas/v2/entity/uniqueAttribute/type/hive_db_v2?attr:name=dburg0VIIt1G
HTTP/1.1" 200 - "-" "Java/1.7.0_80"
127.0.0.1 - - [10/May/2017:22:36:44 +0000] "POST /api/atlas/v2/entity/ HTTP/1.1" 200 - "-"
"Java/1.7.0_80"
127.0.0.1 - - [10/May/2017:22:36:44 +0000] "POST /api/atlas/v2/entity/ HTTP/1.1" 200 - "-"
"Java/1.7.0_80"
127.0.0.1 - - [10/May/2017:22:36:44 +0000] "POST /api/atlas/v2/types/typedefs/ HTTP/1.1" 200
- "-" "Java/1.7.0_80"
127.0.0.1 - - [10/May/2017:22:36:45 +0000] "POST /api/atlas/v2/entity/ HTTP/1.1" 200 - "-"
"Java/1.7.0_80"
127.0.0.1 - - [10/May/2017:22:36:45 +0000] "GET /api/atlas/v2/entity/guid/e6263be5-77f0-4f15-9b20-90d7d427e98b
HTTP/1.1" 200 - "-" "Java/1.7.0_80"
127.0.0.1 - - [10/May/2017:22:36:45 +0000] "POST /api/atlas/v2/entity/ HTTP/1.1" 200 - "-"
"Java/1.7.0_80"
127.0.0.1 - - [10/May/2017:22:36:45 +0000] "GET /api/atlas/entities/937c01e2-70c8-4b99-877b-3545a6de6a82/audit?count=10
HTTP/1.1" 200 - "-" "Java/1.7.0_80"
127.0.0.1 - - [10/May/2017:22:36:45 +0000] "GET /api/atlas/v2/entity/guid/blah HTTP/1.1" 404
- "-" "Java/1.7.0_80"
127.0.0.1 - - [10/May/2017:22:36:45 +0000] "GET /api/atlas/discovery/search/dsl?query=from+hive_db_v1+name%3D%22dbtolfR6l6PZ%22
HTTP/1.1" 200 - "-" "Java/1.7.0_80"
127.0.0.1 - - [10/May/2017:22:36:45 +0000] "GET /api/atlas/discovery/search/dsl?query=from+blah
HTTP/1.1" 400 - "-" "Java/1.7.0_80"
127.0.0.1 - - [10/May/2017:22:36:45 +0000] "GET /api/atlas/discovery/search?query=* HTTP/1.1"
200 - "-" "Java/1.7.0_80"
127.0.0.1 - - [10/May/2017:22:36:45 +0000] "GET /api/atlas/discovery/search?query=from+hive_db_v1+name%3D%22dbtolfR6l6PZ%22
HTTP/1.1" 200 - "-" "Java/1.7.0_80"
127.0.0.1 - - [10/May/2017:22:36:46 +0000] "GET /api/atlas/discovery/search/gremlin?query=g.V.has('type',+'hive_table_v1').toList()
HTTP/1.1" 200 - "-" "Java/1.7.0_80"
127.0.0.1 - - [10/May/2017:22:36:47 +0000] "POST /api/atlas/v2/types/typedefs/ HTTP/1.1" 200
- "-" "Java/1.7.0_80"
127.0.0.1 - - [10/May/2017:22:36:47 +0000] "POST /api/atlas/v2/types/typedefs/ HTTP/1.1" 409
- "-" "Java/1.7.0_80"
127.0.0.1 - - [10/May/2017:22:36:47 +0000] "GET /api/atlas/v2/types/enumdef/name/blah HTTP/1.1"
404 - "-" "Java/1.7.0_80"
127.0.0.1 - - [10/May/2017:22:36:47 +0000] "GET /api/atlas/v2/types/enumdef/guid/blah HTTP/1.1"
404 - "-" "Java/1.7.0_80"
127.0.0.1 - - [10/May/2017:22:36:47 +0000] "GET /api/atlas/v2/types/entitydef/name/blah HTTP/1.1"
404 - "-" "Java/1.7.0_80"
127.0.0.1 - - [10/May/2017:22:36:47 +0000] "GET /api/atlas/v2/types/entitydef/guid/blah HTTP/1.1"
404 - "-" "Java/1.7.0_80"
127.0.0.1 - - [10/May/2017:22:36:47 +0000] "GET /api/atlas/v2/types/classificationdef/name/blah
HTTP/1.1" 404 - "-" "Java/1.7.0_80"
127.0.0.1 - - [10/May/2017:22:36:47 +0000] "GET /api/atlas/v2/types/classificationdef/guid/blah
HTTP/1.1" 404 - "-" "Java/1.7.0_80"
127.0.0.1 - - [10/May/2017:22:36:47 +0000] "GET /api/atlas/v2/types/entitydef/name/blah HTTP/1.1"
404 - "-" "Java/1.7.0_80"
127.0.0.1 - - [10/May/2017:22:36:47 +0000] "GET /api/atlas/v2/types/entitydef/guid/blah HTTP/1.1"
404 - "-" "Java/1.7.0_80"
127.0.0.1 - - [10/May/2017:22:36:47 +0000] "POST /api/atlas/v2/types/typedefs/ HTTP/1.1" 200
- "-" "Java/1.7.0_80"
127.0.0.1 - - [10/May/2017:22:36:47 +0000] "GET /api/atlas/v2/types/typedefs/?supertype=Az0hTvZXprD&type=CLASS
HTTP/1.1" 200 - "-" "Java/1.7.0_80"
127.0.0.1 - - [10/May/2017:22:36:47 +0000] "GET /api/atlas/v2/types/typedefs/?notsupertype=BoRaLU8nGMc&supertype=Az0hTvZXprD&type=CLASS
HTTP/1.1" 200 - "-" "Java/1.7.0_80"
127.0.0.1 - - [10/May/2017:22:36:47 +0000] "POST /api/atlas/v2/types/typedefs/ HTTP/1.1" 200
- "-" "Java/1.7.0_80"
127.0.0.1 - - [10/May/2017:22:36:48 +0000] "PUT /api/atlas/v2/types/typedefs/ HTTP/1.1" 200
- "-" "Java/1.7.0_80"
127.0.0.1 - - [10/May/2017:22:36:48 +0000] "GET /api/atlas/v2/types/typedefs/?type=ENTITY
HTTP/1.1" 200 - "-" "Java/1.7.0_80"
127.0.0.1 - - [10/May/2017:22:36:48 +0000] "POST /api/atlas/types HTTP/1.1" 201 - "-" "Java/1.7.0_80"
127.0.0.1 - - [10/May/2017:22:36:48 +0000] "POST /api/atlas/types HTTP/1.1" 409 - "-" "Java/1.7.0_80"
127.0.0.1 - - [10/May/2017:22:36:48 +0000] "GET /api/atlas/types/blah HTTP/1.1" 404 - "-"
"Java/1.7.0_80"
127.0.0.1 - - [10/May/2017:22:36:48 +0000] "POST /api/atlas/types HTTP/1.1" 201 - "-" "Java/1.7.0_80"
127.0.0.1 - - [10/May/2017:22:36:48 +0000] "POST /api/atlas/types HTTP/1.1" 201 - "-" "Java/1.7.0_80"
127.0.0.1 - - [10/May/2017:22:36:48 +0000] "POST /api/atlas/types HTTP/1.1" 201 - "-" "Java/1.7.0_80"
127.0.0.1 - - [10/May/2017:22:36:48 +0000] "POST /api/atlas/types HTTP/1.1" 201 - "-" "Java/1.7.0_80"
127.0.0.1 - - [10/May/2017:22:36:48 +0000] "POST /api/atlas/types HTTP/1.1" 201 - "-" "Java/1.7.0_80"
127.0.0.1 - - [10/May/2017:22:36:48 +0000] "POST /api/atlas/types HTTP/1.1" 201 - "-" "Java/1.7.0_80"
127.0.0.1 - - [10/May/2017:22:36:48 +0000] "GET /api/atlas/types?type=TRAIT HTTP/1.1" 200
- "-" "Java/1.7.0_80"
127.0.0.1 - - [10/May/2017:22:36:48 +0000] "POST /api/atlas/types HTTP/1.1" 201 - "-" "Java/1.7.0_80"
127.0.0.1 - - [10/May/2017:22:36:49 +0000] "POST /api/atlas/types HTTP/1.1" 201 - "-" "Java/1.7.0_80"
127.0.0.1 - - [10/May/2017:22:36:49 +0000] "POST /api/atlas/types HTTP/1.1" 201 - "-" "Java/1.7.0_80"
127.0.0.1 - - [10/May/2017:22:36:49 +0000] "POST /api/atlas/types HTTP/1.1" 201 - "-" "Java/1.7.0_80"
127.0.0.1 - - [10/May/2017:22:36:49 +0000] "GET /api/atlas/types?type=CLASS&supertype=AKJRyvngmTf&notsupertype=BmCGaIEO7lf
HTTP/1.1" 200 - "-" "Java/1.7.0_80"
127.0.0.1 - - [10/May/2017:22:36:49 +0000] "POST /api/atlas/types HTTP/1.1" 201 - "-" "Java/1.7.0_80"
127.0.0.1 - - [10/May/2017:22:36:49 +0000] "PUT /api/atlas/types HTTP/1.1" 200 - "-" "Java/1.7.0_80"
127.0.0.1 - - [10/May/2017:22:36:49 +0000] "GET /api/atlas/types/Jv7xh3wbeO HTTP/1.1" 200
- "-" "Java/1.7.0_80"
127.0.0.1 - - [10/May/2017:22:36:50 +0000] "GET /api/atlas/admin/version HTTP/1.1" 200 - "-"
"Java/1.7.0_80"
Tests run: 133, Failures: 3, Errors: 0, Skipped: 0, Time elapsed: 269.559 sec <<<
FAILURE! - in TestSuite
testUpdateEntityPartial(org.apache.atlas.notification.NotificationHookConsumerIT)  Time elapsed:
0.561 sec  <<< FAILURE!
org.apache.atlas.AtlasServiceException: Metadata service API org.apache.atlas.AtlasBaseClient$APIInfo@33cd9e2d
failed with status 500 (Internal Server Error) Response Body ({"error":"Could not execute
operation due to backend exception"})
	at org.apache.atlas.notification.NotificationHookConsumerIT.testUpdateEntityPartial(NotificationHookConsumerIT.java:130)

testEntityDeduping(org.apache.atlas.web.resources.EntityJerseyResourceIT)  Time elapsed: 61.437
sec  <<< FAILURE!
java.lang.Exception: Waiting timed out after 60000 msec
	at org.apache.atlas.web.resources.EntityJerseyResourceIT.testEntityDeduping(EntityJerseyResourceIT.java:253)

testEntityDeduping(org.apache.atlas.web.resources.EntityV2JerseyResourceIT)  Time elapsed:
62.248 sec  <<< FAILURE!
java.lang.Exception: Waiting timed out after 60000 msec
	at org.apache.atlas.web.resources.EntityV2JerseyResourceIT.testEntityDeduping(EntityV2JerseyResourceIT.java:180)


Results :

Failed tests: 
  NotificationHookConsumerIT.testUpdateEntityPartial:130->BaseResourceIT.waitFor:641 »
AtlasService
  EntityJerseyResourceIT.testEntityDeduping:253->BaseResourceIT.waitForNotification:654->BaseResourceIT.waitFor:646
» 
  EntityV2JerseyResourceIT.testEntityDeduping:180->BaseResourceIT.waitForNotification:654->BaseResourceIT.waitFor:646
» 

Tests run: 133, Failures: 3, Errors: 0, Skipped: 0

[INFO] 
[INFO] --- jetty-maven-plugin:9.2.12.v20150709:stop (stop-jetty) @ atlas-webapp ---
[INFO] Waiting 10 seconds for jetty to stop
[INFO] Stopped ServerConnector@77431915{HTTP/1.1}{0.0.0.0:31000}
[INFO] Closing Spring root WebApplicationContext
[INFO] Shutting down log4j
[INFO] Stopped o.e.j.m.p.JettyWebAppContext@2d63966c{/,<https://builds.apache.org/job/apache-atlas-nightly/ws/webapp/target/atlas-webapp-0.9-incubating-SNAPSHOT/,UNAVAILABLE}{/home/jenkins/jenkins-slave/workspace/apache-atlas-nightly/webapp/target/atlas-webapp-0.9-incubating-SNAPSHOT.war}>
[INFO] Server reports itself as stopped
[INFO] 
[INFO] --- maven-source-plugin:2.4:jar-no-fork (attach-sources) @ atlas-webapp ---
[INFO] Building jar: <https://builds.apache.org/job/apache-atlas-nightly/ws/webapp/target/atlas-webapp-0.9-incubating-SNAPSHOT-sources.jar>
[INFO] 
[INFO] --- maven-source-plugin:2.4:test-jar-no-fork (attach-sources) @ atlas-webapp ---
log4j:WARN No appenders could be found for logger (org.apache.zookeeper.ClientCnxn).
log4j:WARN Please initialize the log4j system properly.
log4j:WARN See http://logging.apache.org/log4j/1.2/faq.html#noconfig for more info.
[INFO] Building jar: <https://builds.apache.org/job/apache-atlas-nightly/ws/webapp/target/atlas-webapp-0.9-incubating-SNAPSHOT-test-sources.jar>
[INFO] 
[INFO] --- maven-failsafe-plugin:2.19.1:verify (verify) @ atlas-webapp ---
[INFO] ------------------------------------------------------------------------
[INFO] Reactor Summary:
[INFO] 
[INFO] Apache Atlas Server Build Tools .................... SUCCESS [  0.967 s]
[INFO] apache-atlas ....................................... SUCCESS [ 10.043 s]
[INFO] Apache Atlas Integration ........................... SUCCESS [ 37.764 s]
[INFO] Apache Atlas Common ................................ SUCCESS [ 16.552 s]
[INFO] Apache Atlas Typesystem ............................ SUCCESS [01:23 min]
[INFO] Apache Atlas Client ................................ SUCCESS [ 18.915 s]
[INFO] Apache Atlas Server API ............................ SUCCESS [ 11.808 s]
[INFO] Apache Atlas Notification .......................... SUCCESS [ 23.523 s]
[INFO] Apache Atlas Graph Database Projects ............... SUCCESS [  0.594 s]
[INFO] Apache Atlas Graph Database API .................... SUCCESS [  7.492 s]
[INFO] Graph Database Common Code ......................... SUCCESS [  7.510 s]
[INFO] Apache Atlas Titan 1.0.0 GraphDB Impl .............. SUCCESS [ 45.153 s]
[INFO] Shaded version of Apache hbase client .............. SUCCESS [  8.752 s]
[INFO] Apache Atlas Titan 0.5.4 Graph DB Impl ............. SUCCESS [01:23 min]
[INFO] Apache Atlas Graph Database Implementation Dependencies SUCCESS [  0.772 s]
[INFO] Shaded version of Apache hbase server .............. SUCCESS [ 24.170 s]
[INFO] Apache Atlas Repository ............................ SUCCESS [07:11 min]
[INFO] Apache Atlas Authorization ......................... SUCCESS [ 13.058 s]
[INFO] Apache Atlas Business Catalog ...................... SUCCESS [ 21.013 s]
[INFO] Apache Atlas UI .................................... SUCCESS [01:01 min]
[INFO] Apache Atlas Web Application ....................... FAILURE [09:51 min]
[INFO] Apache Atlas Documentation ......................... SKIPPED
[INFO] Apache Atlas FileSystem Model ...................... SKIPPED
[INFO] Apache Atlas Plugin Classloader .................... SKIPPED
[INFO] Apache Atlas Hive Bridge Shim ...................... SKIPPED
[INFO] Apache Atlas Hive Bridge ........................... SKIPPED
[INFO] Apache Atlas Falcon Bridge Shim .................... SKIPPED
[INFO] Apache Atlas Falcon Bridge ......................... SKIPPED
[INFO] Apache Atlas Sqoop Bridge Shim ..................... SKIPPED
[INFO] Apache Atlas Sqoop Bridge .......................... SKIPPED
[INFO] Apache Atlas Storm Bridge Shim ..................... SKIPPED
[INFO] Apache Atlas Storm Bridge .......................... SKIPPED
[INFO] Apache Atlas Distribution .......................... SKIPPED
[INFO] ------------------------------------------------------------------------
[INFO] BUILD FAILURE
[INFO] ------------------------------------------------------------------------
[INFO] Total time: 25:01 min
[INFO] Finished at: 2017-05-10T22:36:56+00:00
[INFO] Final Memory: 368M/2009M
[INFO] ------------------------------------------------------------------------
[ERROR] Failed to execute goal org.apache.maven.plugins:maven-failsafe-plugin:2.19.1:verify
(verify) on project atlas-webapp: There are test failures.
[ERROR] 
[ERROR] Please refer to <https://builds.apache.org/job/apache-atlas-nightly/ws/webapp/target/failsafe-reports>
for the individual test results.
[ERROR] -> [Help 1]
[ERROR] 
[ERROR] To see the full stack trace of the errors, re-run Maven with the -e switch.
[ERROR] Re-run Maven using the -X switch to enable full debug logging.
[ERROR] 
[ERROR] For more information about the errors and possible solutions, please read the following
articles:
[ERROR] [Help 1] http://cwiki.apache.org/confluence/display/MAVEN/MojoFailureException
[ERROR] 
[ERROR] After correcting the problems, you can resume the build with the command
[ERROR]   mvn <goals> -rf :atlas-webapp
Build step 'Execute shell' marked build as failure
[CHECKSTYLE] Collecting checkstyle analysis files...
[CHECKSTYLE] Searching for all files in <https://builds.apache.org/job/apache-atlas-nightly/ws/>
that match the pattern **/target/checkstyle-result.xml
[CHECKSTYLE] Parsing 19 files in <https://builds.apache.org/job/apache-atlas-nightly/ws/>
[CHECKSTYLE] Successfully parsed file <https://builds.apache.org/job/apache-atlas-nightly/ws/authorization/target/checkstyle-result.xml>
with 464 unique warnings and 0 duplicates.
[CHECKSTYLE] Successfully parsed file <https://builds.apache.org/job/apache-atlas-nightly/ws/catalog/target/checkstyle-result.xml>
with 2609 unique warnings and 0 duplicates.
[CHECKSTYLE] Successfully parsed file <https://builds.apache.org/job/apache-atlas-nightly/ws/client/target/checkstyle-result.xml>
with 4223 unique warnings and 0 duplicates.
[CHECKSTYLE] Successfully parsed file <https://builds.apache.org/job/apache-atlas-nightly/ws/common/target/checkstyle-result.xml>
with 5390 unique warnings and 0 duplicates.
[CHECKSTYLE] Successfully parsed file <https://builds.apache.org/job/apache-atlas-nightly/ws/dashboardv2/target/checkstyle-result.xml>
with 5390 unique warnings and 0 duplicates.
[CHECKSTYLE] Successfully parsed file <https://builds.apache.org/job/apache-atlas-nightly/ws/graphdb/api/target/checkstyle-result.xml>
with 5635 unique warnings and 0 duplicates.
[CHECKSTYLE] Successfully parsed file <https://builds.apache.org/job/apache-atlas-nightly/ws/graphdb/common/target/checkstyle-result.xml>
with 5799 unique warnings and 0 duplicates.
[CHECKSTYLE] Successfully parsed file <https://builds.apache.org/job/apache-atlas-nightly/ws/graphdb/graphdb-impls/target/checkstyle-result.xml>
with 5799 unique warnings and 0 duplicates.
[CHECKSTYLE] Successfully parsed file <https://builds.apache.org/job/apache-atlas-nightly/ws/graphdb/target/checkstyle-result.xml>
with 5799 unique warnings and 0 duplicates.
[CHECKSTYLE] Successfully parsed file <https://builds.apache.org/job/apache-atlas-nightly/ws/graphdb/titan0/target/checkstyle-result.xml>
with 8021 unique warnings and 0 duplicates.
[CHECKSTYLE] Successfully parsed file <https://builds.apache.org/job/apache-atlas-nightly/ws/graphdb/titan1/target/checkstyle-result.xml>
with 8926 unique warnings and 0 duplicates.
[CHECKSTYLE] Successfully parsed file <https://builds.apache.org/job/apache-atlas-nightly/ws/intg/target/checkstyle-result.xml>
with 14893 unique warnings and 0 duplicates.
[CHECKSTYLE] Successfully parsed file <https://builds.apache.org/job/apache-atlas-nightly/ws/notification/target/checkstyle-result.xml>
with 16073 unique warnings and 0 duplicates.
[CHECKSTYLE] Successfully parsed file <https://builds.apache.org/job/apache-atlas-nightly/ws/repository/target/checkstyle-result.xml>
with 31967 unique warnings and 0 duplicates.
[CHECKSTYLE] Successfully parsed file <https://builds.apache.org/job/apache-atlas-nightly/ws/server-api/target/checkstyle-result.xml>
with 32367 unique warnings and 0 duplicates.
[CHECKSTYLE] Successfully parsed file <https://builds.apache.org/job/apache-atlas-nightly/ws/shaded/hbase-client-shaded/target/checkstyle-result.xml>
with 32367 unique warnings and 0 duplicates.
[CHECKSTYLE] Successfully parsed file <https://builds.apache.org/job/apache-atlas-nightly/ws/shaded/hbase-server-shaded/target/checkstyle-result.xml>
with 32367 unique warnings and 0 duplicates.
[CHECKSTYLE] Successfully parsed file <https://builds.apache.org/job/apache-atlas-nightly/ws/target/checkstyle-result.xml>
with 32367 unique warnings and 0 duplicates.
[CHECKSTYLE] Successfully parsed file <https://builds.apache.org/job/apache-atlas-nightly/ws/typesystem/target/checkstyle-result.xml>
with 36586 unique warnings and 0 duplicates.
[CHECKSTYLE] Computing warning deltas based on reference build #711
[FINDBUGS] Collecting findbugs analysis files...
[FINDBUGS] Searching for all files in <https://builds.apache.org/job/apache-atlas-nightly/ws/>
that match the pattern **/target/findbugs.xml
[FINDBUGS] Parsing 12 files in <https://builds.apache.org/job/apache-atlas-nightly/ws/>
[FINDBUGS] Successfully parsed file <https://builds.apache.org/job/apache-atlas-nightly/ws/authorization/target/findbugs.xml>
with 0 unique warnings and 0 duplicates.
[FINDBUGS] Successfully parsed file <https://builds.apache.org/job/apache-atlas-nightly/ws/catalog/target/findbugs.xml>
with 0 unique warnings and 0 duplicates.
[FINDBUGS] Successfully parsed file <https://builds.apache.org/job/apache-atlas-nightly/ws/client/target/findbugs.xml>
with 0 unique warnings and 0 duplicates.
[FINDBUGS] Successfully parsed file <https://builds.apache.org/job/apache-atlas-nightly/ws/common/target/findbugs.xml>
with 0 unique warnings and 0 duplicates.
[FINDBUGS] Successfully parsed file <https://builds.apache.org/job/apache-atlas-nightly/ws/graphdb/api/target/findbugs.xml>
with 0 unique warnings and 0 duplicates.
[FINDBUGS] Successfully parsed file <https://builds.apache.org/job/apache-atlas-nightly/ws/graphdb/common/target/findbugs.xml>
with 0 unique warnings and 0 duplicates.
[FINDBUGS] Successfully parsed file <https://builds.apache.org/job/apache-atlas-nightly/ws/graphdb/titan0/target/findbugs.xml>
with 0 unique warnings and 0 duplicates.
[FINDBUGS] Successfully parsed file <https://builds.apache.org/job/apache-atlas-nightly/ws/intg/target/findbugs.xml>
with 0 unique warnings and 0 duplicates.
[FINDBUGS] Successfully parsed file <https://builds.apache.org/job/apache-atlas-nightly/ws/notification/target/findbugs.xml>
with 0 unique warnings and 0 duplicates.
[FINDBUGS] Successfully parsed file <https://builds.apache.org/job/apache-atlas-nightly/ws/repository/target/findbugs.xml>
with 0 unique warnings and 0 duplicates.
[FINDBUGS] Successfully parsed file <https://builds.apache.org/job/apache-atlas-nightly/ws/server-api/target/findbugs.xml>
with 0 unique warnings and 0 duplicates.
[FINDBUGS] Successfully parsed file <https://builds.apache.org/job/apache-atlas-nightly/ws/typesystem/target/findbugs.xml>
with 0 unique warnings and 0 duplicates.
[FINDBUGS] Computing warning deltas based on reference build #711
Archiving artifacts
TestNG Reports Processing: START
Looking for TestNG results report in workspace using pattern: **/target/surefire-reports/testng-results.xml,**/target/failsafe-reports/testng-results.xml
Saving reports...
Processing '/x1/jenkins/jenkins-home/jobs/apache-atlas-nightly/builds/732/testng/testng-results-1.xml'
Processing '/x1/jenkins/jenkins-home/jobs/apache-atlas-nightly/builds/732/testng/testng-results-10.xml'
Processing '/x1/jenkins/jenkins-home/jobs/apache-atlas-nightly/builds/732/testng/testng-results-2.xml'
Processing '/x1/jenkins/jenkins-home/jobs/apache-atlas-nightly/builds/732/testng/testng-results-3.xml'
Processing '/x1/jenkins/jenkins-home/jobs/apache-atlas-nightly/builds/732/testng/testng-results-4.xml'
Processing '/x1/jenkins/jenkins-home/jobs/apache-atlas-nightly/builds/732/testng/testng-results-5.xml'
Processing '/x1/jenkins/jenkins-home/jobs/apache-atlas-nightly/builds/732/testng/testng-results-6.xml'
Processing '/x1/jenkins/jenkins-home/jobs/apache-atlas-nightly/builds/732/testng/testng-results-7.xml'
Processing '/x1/jenkins/jenkins-home/jobs/apache-atlas-nightly/builds/732/testng/testng-results-8.xml'
Processing '/x1/jenkins/jenkins-home/jobs/apache-atlas-nightly/builds/732/testng/testng-results-9.xml'
Processing '/x1/jenkins/jenkins-home/jobs/apache-atlas-nightly/builds/732/testng/testng-results.xml'
0.571429% of tests failed, which exceeded threshold of 0%. Marking build as UNSTABLE
TestNG Reports Processing: FINISH

Mime
View raw message