atlas-dev mailing list archives

Site index · List index
Message view « Date » · « Thread »
Top « Date » · « Thread »
From Apache Jenkins Server <jenk...@builds.apache.org>
Subject Build failed in Jenkins: apache-atlas-nightly #716
Date Fri, 28 Apr 2017 19:34:35 GMT
See <https://builds.apache.org/job/apache-atlas-nightly/716/display/redirect>

------------------------------------------
[...truncated 503.03 KB...]
org.apache.atlas.AtlasServiceException: Metadata service API org.apache.atlas.AtlasBaseClient$APIInfo@3340302c
failed with status 400 (Bad Request) Response Body ({"error":"Unknown datatype: hive_db"})
	at org.apache.atlas.notification.NotificationHookConsumerIT.testUpdateEntityFullUpdate(NotificationHookConsumerIT.java:205)

testUpdateEntityPartial(org.apache.atlas.notification.NotificationHookConsumerIT)  Time elapsed:
0.014 sec  <<< FAILURE!
org.apache.atlas.AtlasServiceException: Metadata service API org.apache.atlas.AtlasBaseClient$APIInfo@55dd1e5b
failed with status 400 (Bad Request) Response Body ({"error":"Unknown datatype: hive_db"})
	at org.apache.atlas.notification.NotificationHookConsumerIT.testUpdateEntityPartial(NotificationHookConsumerIT.java:124)

testUpdatePartialUpdatingQualifiedName(org.apache.atlas.notification.NotificationHookConsumerIT)
 Time elapsed: 0.011 sec  <<< FAILURE!
org.apache.atlas.AtlasServiceException: Metadata service API org.apache.atlas.AtlasBaseClient$APIInfo@9678aaf
failed with status 400 (Bad Request) Response Body ({"error":"Unknown datatype: hive_db"})
	at org.apache.atlas.notification.NotificationHookConsumerIT.testUpdatePartialUpdatingQualifiedName(NotificationHookConsumerIT.java:152)

Running org.apache.atlas.notification.EntityNotificationIT
127.0.0.1 - - [28/Apr/2017:19:30:03 +0000] "GET /api/atlas/types/tableType HTTP/1.1" 200 -
"-" "Java/1.7.0_80"
127.0.0.1 - - [28/Apr/2017:19:30:04 +0000] "GET /api/atlas/types/serdeType HTTP/1.1" 200 -
"-" "Java/1.7.0_80"
127.0.0.1 - - [28/Apr/2017:19:30:04 +0000] "GET /api/atlas/types/classification HTTP/1.1"
200 - "-" "Java/1.7.0_80"
127.0.0.1 - - [28/Apr/2017:19:30:04 +0000] "GET /api/atlas/types/hive_db_v1 HTTP/1.1" 200
- "-" "Java/1.7.0_80"
127.0.0.1 - - [28/Apr/2017:19:30:04 +0000] "POST /api/atlas/entities HTTP/1.1" 400 - "-" "Java/1.7.0_80"
Tests run: 6, Failures: 1, Errors: 0, Skipped: 5, Time elapsed: 3.409 sec <<< FAILURE!
- in org.apache.atlas.notification.EntityNotificationIT
setUp(org.apache.atlas.notification.EntityNotificationIT)  Time elapsed: 3.351 sec  <<<
FAILURE!
org.apache.atlas.AtlasServiceException: Metadata service API org.apache.atlas.AtlasBaseClient$APIInfo@44bbc65e
failed with status 400 (Bad Request) Response Body ({"error":"Unknown datatype: hive_db"})
	at org.apache.atlas.notification.EntityNotificationIT.setUp(EntityNotificationIT.java:68)

Running org.apache.atlas.examples.QuickStartV2IT
127.0.0.1 - - [28/Apr/2017:19:30:08 +0000] "POST /api/atlas/v2/types/typedefs/ HTTP/1.1" 409
- "-" "Java/1.7.0_80"
Tests run: 6, Failures: 1, Errors: 0, Skipped: 5, Time elapsed: 2.39 sec <<< FAILURE!
- in org.apache.atlas.examples.QuickStartV2IT
runQuickStart(org.apache.atlas.examples.QuickStartV2IT)  Time elapsed: 2.335 sec  <<<
FAILURE!
org.apache.atlas.AtlasServiceException: Metadata service API org.apache.atlas.AtlasBaseClient$APIInfo@a7720c2
failed with status 409 (Conflict) Response Body ({"errorCode":"ATLAS-409-00-001","errorMessage":"Given
type Dimension already exists"})
	at org.apache.atlas.examples.QuickStartV2IT.runQuickStart(QuickStartV2IT.java:50)

Running org.apache.atlas.examples.QuickStartIT
127.0.0.1 - - [28/Apr/2017:19:30:11 +0000] "POST /api/atlas/types HTTP/1.1" 201 - "-" "Java/1.7.0_80"
127.0.0.1 - - [28/Apr/2017:19:30:11 +0000] "GET /api/atlas/types HTTP/1.1" 200 - "-" "Java/1.7.0_80"
127.0.0.1 - - [28/Apr/2017:19:30:12 +0000] "POST /api/atlas/entities HTTP/1.1" 201 - "-" "Java/1.7.0_80"
127.0.0.1 - - [28/Apr/2017:19:30:12 +0000] "POST /api/atlas/entities HTTP/1.1" 201 - "-" "Java/1.7.0_80"
127.0.0.1 - - [28/Apr/2017:19:30:13 +0000] "POST /api/atlas/entities HTTP/1.1" 201 - "-" "Java/1.7.0_80"
127.0.0.1 - - [28/Apr/2017:19:30:13 +0000] "POST /api/atlas/entities HTTP/1.1" 201 - "-" "Java/1.7.0_80"
127.0.0.1 - - [28/Apr/2017:19:30:13 +0000] "POST /api/atlas/entities HTTP/1.1" 201 - "-" "Java/1.7.0_80"
127.0.0.1 - - [28/Apr/2017:19:30:13 +0000] "POST /api/atlas/entities HTTP/1.1" 201 - "-" "Java/1.7.0_80"
127.0.0.1 - - [28/Apr/2017:19:30:13 +0000] "POST /api/atlas/entities HTTP/1.1" 201 - "-" "Java/1.7.0_80"
127.0.0.1 - - [28/Apr/2017:19:30:13 +0000] "POST /api/atlas/entities HTTP/1.1" 201 - "-" "Java/1.7.0_80"
127.0.0.1 - - [28/Apr/2017:19:30:13 +0000] "POST /api/atlas/entities HTTP/1.1" 201 - "-" "Java/1.7.0_80"
127.0.0.1 - - [28/Apr/2017:19:30:13 +0000] "POST /api/atlas/entities HTTP/1.1" 201 - "-" "Java/1.7.0_80"
127.0.0.1 - - [28/Apr/2017:19:30:13 +0000] "POST /api/atlas/entities HTTP/1.1" 201 - "-" "Java/1.7.0_80"
127.0.0.1 - - [28/Apr/2017:19:30:13 +0000] "POST /api/atlas/entities HTTP/1.1" 201 - "-" "Java/1.7.0_80"
127.0.0.1 - - [28/Apr/2017:19:30:13 +0000] "POST /api/atlas/entities HTTP/1.1" 201 - "-" "Java/1.7.0_80"
127.0.0.1 - - [28/Apr/2017:19:30:13 +0000] "POST /api/atlas/entities HTTP/1.1" 201 - "-" "Java/1.7.0_80"
127.0.0.1 - - [28/Apr/2017:19:30:13 +0000] "POST /api/atlas/entities HTTP/1.1" 201 - "-" "Java/1.7.0_80"
127.0.0.1 - - [28/Apr/2017:19:30:13 +0000] "POST /api/atlas/entities HTTP/1.1" 201 - "-" "Java/1.7.0_80"
127.0.0.1 - - [28/Apr/2017:19:30:13 +0000] "GET /api/atlas/discovery/search?query=from+DB_v1&limit=10&offset=0
HTTP/1.1" 200 - "-" "Java/1.7.0_80"
127.0.0.1 - - [28/Apr/2017:19:30:14 +0000] "GET /api/atlas/discovery/search?query=DB_v1&limit=10&offset=0
HTTP/1.1" 200 - "-" "Java/1.7.0_80"
127.0.0.1 - - [28/Apr/2017:19:30:15 +0000] "GET /api/atlas/discovery/search?query=DB_v1+where+name%3D%22Reporting%22&limit=10&offset=0
HTTP/1.1" 200 - "-" "Java/1.7.0_80"
127.0.0.1 - - [28/Apr/2017:19:30:16 +0000] "GET /api/atlas/discovery/search?query=DB_v1+where+DB_v1.name%3D%22Reporting%22&limit=10&offset=0
HTTP/1.1" 200 - "-" "Java/1.7.0_80"
127.0.0.1 - - [28/Apr/2017:19:30:16 +0000] "GET /api/atlas/discovery/search?query=DB_v1+name+%3D+%22Reporting%22&limit=10&offset=0
HTTP/1.1" 200 - "-" "Java/1.7.0_80"
127.0.0.1 - - [28/Apr/2017:19:30:17 +0000] "GET /api/atlas/discovery/search?query=DB_v1+DB_v1.name+%3D+%22Reporting%22&limit=10&offset=0
HTTP/1.1" 200 - "-" "Java/1.7.0_80"
127.0.0.1 - - [28/Apr/2017:19:30:18 +0000] "GET /api/atlas/discovery/search?query=DB_v1+where+name%3D%22Reporting%22+select+name,+owner&limit=10&offset=0
HTTP/1.1" 200 - "-" "Java/1.7.0_80"
127.0.0.1 - - [28/Apr/2017:19:30:19 +0000] "GET /api/atlas/discovery/search?query=DB_v1+where+DB_v1.name%3D%22Reporting%22+select+name,+owner&limit=10&offset=0
HTTP/1.1" 200 - "-" "Java/1.7.0_80"
127.0.0.1 - - [28/Apr/2017:19:30:21 +0000] "GET /api/atlas/discovery/search?query=DB_v1+has+name&limit=10&offset=0
HTTP/1.1" 200 - "-" "Java/1.7.0_80"
127.0.0.1 - - [28/Apr/2017:19:30:21 +0000] "GET /api/atlas/discovery/search?query=DB_v1+where+DB_v1+has+name&limit=10&offset=0
HTTP/1.1" 200 - "-" "Java/1.7.0_80"
127.0.0.1 - - [28/Apr/2017:19:30:22 +0000] "GET /api/atlas/discovery/search?query=DB_v1,+Table_v1&limit=10&offset=0
HTTP/1.1" 200 - "-" "Java/1.7.0_80"
127.0.0.1 - - [28/Apr/2017:19:30:23 +0000] "GET /api/atlas/discovery/search?query=DB_v1+is+JdbcAccess&limit=10&offset=0
HTTP/1.1" 200 - "-" "Java/1.7.0_80"
127.0.0.1 - - [28/Apr/2017:19:30:23 +0000] "GET /api/atlas/discovery/search?query=from+Table_v1&limit=10&offset=0
HTTP/1.1" 200 - "-" "Java/1.7.0_80"
127.0.0.1 - - [28/Apr/2017:19:30:24 +0000] "GET /api/atlas/discovery/search?query=Table_v1&limit=10&offset=0
HTTP/1.1" 200 - "-" "Java/1.7.0_80"
127.0.0.1 - - [28/Apr/2017:19:30:25 +0000] "GET /api/atlas/discovery/search?query=Table_v1+is+Dimension_v1&limit=10&offset=0
HTTP/1.1" 200 - "-" "Java/1.7.0_80"
127.0.0.1 - - [28/Apr/2017:19:30:25 +0000] "GET /api/atlas/discovery/search?query=Column_v1+where+Column_v1+isa+PII_v1&limit=10&offset=0
HTTP/1.1" 200 - "-" "Java/1.7.0_80"
127.0.0.1 - - [28/Apr/2017:19:30:26 +0000] "GET /api/atlas/discovery/search?query=View_v1+is+Dimension_v1&limit=10&offset=0
HTTP/1.1" 200 - "-" "Java/1.7.0_80"
127.0.0.1 - - [28/Apr/2017:19:30:27 +0000] "GET /api/atlas/discovery/search?query=Column_v1+select+Column_v1.name&limit=10&offset=0
HTTP/1.1" 200 - "-" "Java/1.7.0_80"
127.0.0.1 - - [28/Apr/2017:19:30:28 +0000] "GET /api/atlas/discovery/search?query=Column_v1+select+name&limit=10&offset=0
HTTP/1.1" 200 - "-" "Java/1.7.0_80"
127.0.0.1 - - [28/Apr/2017:19:30:29 +0000] "GET /api/atlas/discovery/search?query=Column_v1+where+Column_v1.name%3D%22customer_id%22&limit=10&offset=0
HTTP/1.1" 200 - "-" "Java/1.7.0_80"
127.0.0.1 - - [28/Apr/2017:19:30:30 +0000] "GET /api/atlas/discovery/search?query=from+Table_v1+select+Table_v1.name&limit=10&offset=0
HTTP/1.1" 200 - "-" "Java/1.7.0_80"
127.0.0.1 - - [28/Apr/2017:19:30:31 +0000] "GET /api/atlas/discovery/search?query=DB_v1+where+(name+%3D+%22Reporting%22)&limit=10&offset=0
HTTP/1.1" 200 - "-" "Java/1.7.0_80"
127.0.0.1 - - [28/Apr/2017:19:30:31 +0000] "GET /api/atlas/discovery/search?query=DB_v1+where+(name+%3D+%22Reporting%22)+select+name+as+_col_0,+owner+as+_col_1&limit=10&offset=0
HTTP/1.1" 200 - "-" "Java/1.7.0_80"
127.0.0.1 - - [28/Apr/2017:19:30:33 +0000] "GET /api/atlas/discovery/search?query=DB_v1+where+DB_v1+is+JdbcAccess_v1&limit=10&offset=0
HTTP/1.1" 200 - "-" "Java/1.7.0_80"
127.0.0.1 - - [28/Apr/2017:19:30:34 +0000] "GET /api/atlas/discovery/search?query=DB_v1+where+DB_v1+has+name&limit=10&offset=0
HTTP/1.1" 200 - "-" "Java/1.7.0_80"
127.0.0.1 - - [28/Apr/2017:19:30:34 +0000] "GET /api/atlas/discovery/search?query=DB_v1+Table_v1&limit=10&offset=0
HTTP/1.1" 200 - "-" "Java/1.7.0_80"
127.0.0.1 - - [28/Apr/2017:19:30:35 +0000] "GET /api/atlas/discovery/search?query=DB_v1+where+DB_v1+has+name&limit=10&offset=0
HTTP/1.1" 200 - "-" "Java/1.7.0_80"
127.0.0.1 - - [28/Apr/2017:19:30:36 +0000] "GET /api/atlas/discovery/search?query=DB_v1+as+db1+Table+where+(db1.name+%3D+%22Reporting%22)&limit=10&offset=0
HTTP/1.1" 200 - "-" "Java/1.7.0_80"
127.0.0.1 - - [28/Apr/2017:19:30:36 +0000] "GET /api/atlas/discovery/search?query=DB_v1+where+(name+%3D+%22Reporting%22)+select+name+as+_col_0,+(createTime+%2B+1)+as+_col_1+&limit=10&offset=0
HTTP/1.1" 200 - "-" "Java/1.7.0_80"
127.0.0.1 - - [28/Apr/2017:19:30:37 +0000] "GET /api/atlas/discovery/search?query=Dimension_v1&limit=10&offset=0
HTTP/1.1" 200 - "-" "Java/1.7.0_80"
127.0.0.1 - - [28/Apr/2017:19:30:38 +0000] "GET /api/atlas/discovery/search?query=JdbcAccess_v1&limit=10&offset=0
HTTP/1.1" 200 - "-" "Java/1.7.0_80"
127.0.0.1 - - [28/Apr/2017:19:30:39 +0000] "GET /api/atlas/discovery/search?query=ETL_v1&limit=10&offset=0
HTTP/1.1" 200 - "-" "Java/1.7.0_80"
127.0.0.1 - - [28/Apr/2017:19:30:40 +0000] "GET /api/atlas/discovery/search?query=Metric_v1&limit=10&offset=0
HTTP/1.1" 200 - "-" "Java/1.7.0_80"
127.0.0.1 - - [28/Apr/2017:19:30:40 +0000] "GET /api/atlas/discovery/search?query=PII_v1&limit=10&offset=0
HTTP/1.1" 200 - "-" "Java/1.7.0_80"
127.0.0.1 - - [28/Apr/2017:19:30:41 +0000] "GET /api/atlas/discovery/search?query=%60Log+Data_v1%60&limit=10&offset=0
HTTP/1.1" 200 - "-" "Java/1.7.0_80"
127.0.0.1 - - [28/Apr/2017:19:30:42 +0000] "GET /api/atlas/discovery/search?query=Table_v1+where+name%3D%22sales_fact%22,+columns&limit=10&offset=0
HTTP/1.1" 200 - "-" "Java/1.7.0_80"
127.0.0.1 - - [28/Apr/2017:19:30:43 +0000] "GET /api/atlas/discovery/search?query=Table_v1+where+name%3D%22sales_fact%22,+columns+as+column+select+column.name,+column.dataType,+column.comment&limit=10&offset=0
HTTP/1.1" 200 - "-" "Java/1.7.0_80"
127.0.0.1 - - [28/Apr/2017:19:30:44 +0000] "GET /api/atlas/discovery/search?query=from+DataSet&limit=10&offset=0
HTTP/1.1" 200 - "-" "Java/1.7.0_80"
127.0.0.1 - - [28/Apr/2017:19:30:45 +0000] "GET /api/atlas/discovery/search?query=from+Process&limit=10&offset=0
HTTP/1.1" 200 - "-" "Java/1.7.0_80"
127.0.0.1 - - [28/Apr/2017:19:30:46 +0000] "GET /api/atlas/entities?type=DB_v1&property=name&value=Sales
HTTP/1.1" 200 - "-" "Java/1.7.0_80"
127.0.0.1 - - [28/Apr/2017:19:30:46 +0000] "GET /api/atlas/entities?type=Table_v1&property=qualifiedName&value=sales_fact
HTTP/1.1" 200 - "-" "Java/1.7.0_80"
127.0.0.1 - - [28/Apr/2017:19:30:46 +0000] "GET /api/atlas/entities?type=Table_v1&property=qualifiedName&value=time_dim
HTTP/1.1" 200 - "-" "Java/1.7.0_80"
127.0.0.1 - - [28/Apr/2017:19:30:46 +0000] "GET /api/atlas/entities?type=Table_v1&property=qualifiedName&value=sales_fact_daily_mv
HTTP/1.1" 200 - "-" "Java/1.7.0_80"
127.0.0.1 - - [28/Apr/2017:19:30:46 +0000] "GET /api/atlas/lineage/hive/table/sales_fact_daily_mv/inputs/graph
HTTP/1.1" 200 - "-" "Java/1.7.0_80"
127.0.0.1 - - [28/Apr/2017:19:30:48 +0000] "GET /api/atlas/entities?type=LoadProcess_v1&property=qualifiedName&value=loadSalesDaily
HTTP/1.1" 200 - "-" "Java/1.7.0_80"
127.0.0.1 - - [28/Apr/2017:19:30:48 +0000] "GET /api/atlas/entities?type=Table_v1&property=qualifiedName&value=sales_fact
HTTP/1.1" 200 - "-" "Java/1.7.0_80"
127.0.0.1 - - [28/Apr/2017:19:30:48 +0000] "GET /api/atlas/entities?type=Table_v1&property=qualifiedName&value=time_dim
HTTP/1.1" 200 - "-" "Java/1.7.0_80"
127.0.0.1 - - [28/Apr/2017:19:30:48 +0000] "GET /api/atlas/entities?type=Table_v1&property=qualifiedName&value=sales_fact_daily_mv
HTTP/1.1" 200 - "-" "Java/1.7.0_80"
127.0.0.1 - - [28/Apr/2017:19:30:48 +0000] "GET /api/atlas/entities?type=Table_v1&property=qualifiedName&value=sales_fact
HTTP/1.1" 200 - "-" "Java/1.7.0_80"
127.0.0.1 - - [28/Apr/2017:19:30:48 +0000] "GET /api/atlas/entities?type=DB_v1&property=name&value=Sales
HTTP/1.1" 200 - "-" "Java/1.7.0_80"
127.0.0.1 - - [28/Apr/2017:19:30:48 +0000] "GET /api/atlas/entities?type=View_v1&property=qualifiedName&value=product_dim_view
HTTP/1.1" 200 - "-" "Java/1.7.0_80"
127.0.0.1 - - [28/Apr/2017:19:30:48 +0000] "GET /api/atlas/entities?type=Table_v1&property=qualifiedName&value=product_dim
HTTP/1.1" 200 - "-" "Java/1.7.0_80"
Tests run: 5, Failures: 0, Errors: 0, Skipped: 0, Time elapsed: 39.986 sec - in org.apache.atlas.examples.QuickStartIT

Results :

Failed tests: 
  QuickStartV2IT.runQuickStart:50 » AtlasService Metadata service API org.apache...
  EntityNotificationIT.setUp:68->BaseResourceIT.createInstance:234 » AtlasService
  NotificationHookConsumerIT.testCreateEntity:99->BaseResourceIT.waitFor:641->access$100:38->BaseResourceIT.searchByDSL:688
» AtlasService
  NotificationHookConsumerIT.testDeleteByQualifiedName:183 » AtlasService Metada...
  NotificationHookConsumerIT.testMessageHandleFailureConsumerContinues:79->BaseResourceIT.waitFor:641->access$000:38->BaseResourceIT.searchByDSL:688
» AtlasService
  NotificationHookConsumerIT.testUpdateEntityFullUpdate:205 » AtlasService Metad...
  NotificationHookConsumerIT.testUpdateEntityPartial:124 » AtlasService Metadata...
  NotificationHookConsumerIT.testUpdatePartialUpdatingQualifiedName:152 » AtlasService
  EntityDiscoveryJerseyResourceIT.setUp:59->BaseResourceIT.createInstance:234 » AtlasService
  EntityJerseyResourceIT.setUp:108->BaseResourceIT.createInstance:234 » AtlasService

Tests run: 136, Failures: 10, Errors: 0, Skipped: 48

[INFO] 
[INFO] --- jetty-maven-plugin:9.2.12.v20150709:stop (stop-jetty) @ atlas-webapp ---
[INFO] Waiting 10 seconds for jetty to stop
[INFO] Stopped ServerConnector@7f7852f8{HTTP/1.1}{0.0.0.0:31000}
[INFO] Closing Spring root WebApplicationContext
[INFO] Shutting down log4j
[INFO] Stopped o.e.j.m.p.JettyWebAppContext@da26ae6{/,<https://builds.apache.org/job/apache-atlas-nightly/ws/webapp/target/atlas-webapp-0.9-incubating-SNAPSHOT/,UNAVAILABLE}{/home/jenkins/jenkins-slave/workspace/apache-atlas-nightly/webapp/target/atlas-webapp-0.9-incubating-SNAPSHOT.war}>
[INFO] Server reports itself as stopped
[INFO] 
[INFO] --- maven-source-plugin:2.4:jar-no-fork (attach-sources) @ atlas-webapp ---
[INFO] Building jar: <https://builds.apache.org/job/apache-atlas-nightly/ws/webapp/target/atlas-webapp-0.9-incubating-SNAPSHOT-sources.jar>
log4j:WARN No appenders could be found for logger (org.apache.zookeeper.ClientCnxn).
log4j:WARN Please initialize the log4j system properly.
log4j:WARN See http://logging.apache.org/log4j/1.2/faq.html#noconfig for more info.
[INFO] 
[INFO] --- maven-source-plugin:2.4:test-jar-no-fork (attach-sources) @ atlas-webapp ---
[INFO] Building jar: <https://builds.apache.org/job/apache-atlas-nightly/ws/webapp/target/atlas-webapp-0.9-incubating-SNAPSHOT-test-sources.jar>
[INFO] 
[INFO] --- maven-failsafe-plugin:2.19.1:verify (verify) @ atlas-webapp ---
[INFO] ------------------------------------------------------------------------
[INFO] Reactor Summary:
[INFO] 
[INFO] Apache Atlas Server Build Tools .................... SUCCESS [  0.991 s]
[INFO] apache-atlas ....................................... SUCCESS [  6.962 s]
[INFO] Apache Atlas Integration ........................... SUCCESS [ 57.979 s]
[INFO] Apache Atlas Common ................................ SUCCESS [ 19.216 s]
[INFO] Apache Atlas Typesystem ............................ SUCCESS [01:34 min]
[INFO] Apache Atlas Client ................................ SUCCESS [ 23.891 s]
[INFO] Apache Atlas Server API ............................ SUCCESS [ 12.735 s]
[INFO] Apache Atlas Notification .......................... SUCCESS [ 44.840 s]
[INFO] Apache Atlas Graph Database Projects ............... SUCCESS [  0.630 s]
[INFO] Apache Atlas Graph Database API .................... SUCCESS [  7.604 s]
[INFO] Graph Database Common Code ......................... SUCCESS [  7.649 s]
[INFO] Apache Atlas Titan 1.0.0 GraphDB Impl .............. SUCCESS [ 33.222 s]
[INFO] Shaded version of Apache hbase client .............. SUCCESS [  8.663 s]
[INFO] Apache Atlas Titan 0.5.4 Graph DB Impl ............. SUCCESS [01:49 min]
[INFO] Apache Atlas Graph Database Implementation Dependencies SUCCESS [  0.740 s]
[INFO] Shaded version of Apache hbase server .............. SUCCESS [ 24.149 s]
[INFO] Apache Atlas Repository ............................ SUCCESS [17:36 min]
[INFO] Apache Atlas Authorization ......................... SUCCESS [ 17.979 s]
[INFO] Apache Atlas Business Catalog ...................... SUCCESS [ 38.324 s]
[INFO] Apache Atlas UI .................................... SUCCESS [01:02 min]
[INFO] Apache Atlas Web Application ....................... FAILURE [07:29 min]
[INFO] Apache Atlas Documentation ......................... SKIPPED
[INFO] Apache Atlas FileSystem Model ...................... SKIPPED
[INFO] Apache Atlas Plugin Classloader .................... SKIPPED
[INFO] Apache Atlas Hive Bridge Shim ...................... SKIPPED
[INFO] Apache Atlas Hive Bridge ........................... SKIPPED
[INFO] Apache Atlas Falcon Bridge Shim .................... SKIPPED
[INFO] Apache Atlas Falcon Bridge ......................... SKIPPED
[INFO] Apache Atlas Sqoop Bridge Shim ..................... SKIPPED
[INFO] Apache Atlas Sqoop Bridge .......................... SKIPPED
[INFO] Apache Atlas Storm Bridge Shim ..................... SKIPPED
[INFO] Apache Atlas Storm Bridge .......................... SKIPPED
[INFO] Apache Atlas Distribution .......................... SKIPPED
[INFO] ------------------------------------------------------------------------
[INFO] BUILD FAILURE
[INFO] ------------------------------------------------------------------------
[INFO] Total time: 34:38 min
[INFO] Finished at: 2017-04-28T19:30:54+00:00
[INFO] Final Memory: 346M/1301M
[INFO] ------------------------------------------------------------------------
[ERROR] Failed to execute goal org.apache.maven.plugins:maven-failsafe-plugin:2.19.1:verify
(verify) on project atlas-webapp: There are test failures.
[ERROR] 
[ERROR] Please refer to <https://builds.apache.org/job/apache-atlas-nightly/ws/webapp/target/failsafe-reports>
for the individual test results.
[ERROR] -> [Help 1]
[ERROR] 
[ERROR] To see the full stack trace of the errors, re-run Maven with the -e switch.
[ERROR] Re-run Maven using the -X switch to enable full debug logging.
[ERROR] 
[ERROR] For more information about the errors and possible solutions, please read the following
articles:
[ERROR] [Help 1] http://cwiki.apache.org/confluence/display/MAVEN/MojoFailureException
[ERROR] 
[ERROR] After correcting the problems, you can resume the build with the command
[ERROR]   mvn <goals> -rf :atlas-webapp
Build step 'Execute shell' marked build as failure
[CHECKSTYLE] Collecting checkstyle analysis files...
[CHECKSTYLE] Searching for all files in <https://builds.apache.org/job/apache-atlas-nightly/ws/>
that match the pattern **/target/checkstyle-result.xml
[CHECKSTYLE] Parsing 19 files in <https://builds.apache.org/job/apache-atlas-nightly/ws/>
[CHECKSTYLE] Successfully parsed file <https://builds.apache.org/job/apache-atlas-nightly/ws/authorization/target/checkstyle-result.xml>
with 464 unique warnings and 0 duplicates.
[CHECKSTYLE] Successfully parsed file <https://builds.apache.org/job/apache-atlas-nightly/ws/catalog/target/checkstyle-result.xml>
with 2609 unique warnings and 0 duplicates.
[CHECKSTYLE] Successfully parsed file <https://builds.apache.org/job/apache-atlas-nightly/ws/client/target/checkstyle-result.xml>
with 4223 unique warnings and 0 duplicates.
[CHECKSTYLE] Successfully parsed file <https://builds.apache.org/job/apache-atlas-nightly/ws/common/target/checkstyle-result.xml>
with 5390 unique warnings and 0 duplicates.
[CHECKSTYLE] Successfully parsed file <https://builds.apache.org/job/apache-atlas-nightly/ws/dashboardv2/target/checkstyle-result.xml>
with 5390 unique warnings and 0 duplicates.
[CHECKSTYLE] Successfully parsed file <https://builds.apache.org/job/apache-atlas-nightly/ws/graphdb/api/target/checkstyle-result.xml>
with 5635 unique warnings and 0 duplicates.
[CHECKSTYLE] Successfully parsed file <https://builds.apache.org/job/apache-atlas-nightly/ws/graphdb/common/target/checkstyle-result.xml>
with 5784 unique warnings and 0 duplicates.
[CHECKSTYLE] Successfully parsed file <https://builds.apache.org/job/apache-atlas-nightly/ws/graphdb/graphdb-impls/target/checkstyle-result.xml>
with 5784 unique warnings and 0 duplicates.
[CHECKSTYLE] Successfully parsed file <https://builds.apache.org/job/apache-atlas-nightly/ws/graphdb/target/checkstyle-result.xml>
with 5784 unique warnings and 0 duplicates.
[CHECKSTYLE] Successfully parsed file <https://builds.apache.org/job/apache-atlas-nightly/ws/graphdb/titan0/target/checkstyle-result.xml>
with 8006 unique warnings and 0 duplicates.
[CHECKSTYLE] Successfully parsed file <https://builds.apache.org/job/apache-atlas-nightly/ws/graphdb/titan1/target/checkstyle-result.xml>
with 8911 unique warnings and 0 duplicates.
[CHECKSTYLE] Successfully parsed file <https://builds.apache.org/job/apache-atlas-nightly/ws/intg/target/checkstyle-result.xml>
with 14878 unique warnings and 0 duplicates.
[CHECKSTYLE] Successfully parsed file <https://builds.apache.org/job/apache-atlas-nightly/ws/notification/target/checkstyle-result.xml>
with 16058 unique warnings and 0 duplicates.
[CHECKSTYLE] Successfully parsed file <https://builds.apache.org/job/apache-atlas-nightly/ws/repository/target/checkstyle-result.xml>
with 31853 unique warnings and 0 duplicates.
[CHECKSTYLE] Successfully parsed file <https://builds.apache.org/job/apache-atlas-nightly/ws/server-api/target/checkstyle-result.xml>
with 32253 unique warnings and 0 duplicates.
[CHECKSTYLE] Successfully parsed file <https://builds.apache.org/job/apache-atlas-nightly/ws/shaded/hbase-client-shaded/target/checkstyle-result.xml>
with 32253 unique warnings and 0 duplicates.
[CHECKSTYLE] Successfully parsed file <https://builds.apache.org/job/apache-atlas-nightly/ws/shaded/hbase-server-shaded/target/checkstyle-result.xml>
with 32253 unique warnings and 0 duplicates.
[CHECKSTYLE] Successfully parsed file <https://builds.apache.org/job/apache-atlas-nightly/ws/target/checkstyle-result.xml>
with 32253 unique warnings and 0 duplicates.
[CHECKSTYLE] Successfully parsed file <https://builds.apache.org/job/apache-atlas-nightly/ws/typesystem/target/checkstyle-result.xml>
with 36472 unique warnings and 0 duplicates.
[CHECKSTYLE] Computing warning deltas based on reference build #711
[FINDBUGS] Collecting findbugs analysis files...
[FINDBUGS] Searching for all files in <https://builds.apache.org/job/apache-atlas-nightly/ws/>
that match the pattern **/target/findbugs.xml
[FINDBUGS] Parsing 12 files in <https://builds.apache.org/job/apache-atlas-nightly/ws/>
[FINDBUGS] Successfully parsed file <https://builds.apache.org/job/apache-atlas-nightly/ws/authorization/target/findbugs.xml>
with 0 unique warnings and 0 duplicates.
[FINDBUGS] Successfully parsed file <https://builds.apache.org/job/apache-atlas-nightly/ws/catalog/target/findbugs.xml>
with 0 unique warnings and 0 duplicates.
[FINDBUGS] Successfully parsed file <https://builds.apache.org/job/apache-atlas-nightly/ws/client/target/findbugs.xml>
with 0 unique warnings and 0 duplicates.
[FINDBUGS] Successfully parsed file <https://builds.apache.org/job/apache-atlas-nightly/ws/common/target/findbugs.xml>
with 0 unique warnings and 0 duplicates.
[FINDBUGS] Successfully parsed file <https://builds.apache.org/job/apache-atlas-nightly/ws/graphdb/api/target/findbugs.xml>
with 0 unique warnings and 0 duplicates.
[FINDBUGS] Successfully parsed file <https://builds.apache.org/job/apache-atlas-nightly/ws/graphdb/common/target/findbugs.xml>
with 0 unique warnings and 0 duplicates.
[FINDBUGS] Successfully parsed file <https://builds.apache.org/job/apache-atlas-nightly/ws/graphdb/titan0/target/findbugs.xml>
with 0 unique warnings and 0 duplicates.
[FINDBUGS] Successfully parsed file <https://builds.apache.org/job/apache-atlas-nightly/ws/intg/target/findbugs.xml>
with 0 unique warnings and 0 duplicates.
[FINDBUGS] Successfully parsed file <https://builds.apache.org/job/apache-atlas-nightly/ws/notification/target/findbugs.xml>
with 0 unique warnings and 0 duplicates.
[FINDBUGS] Successfully parsed file <https://builds.apache.org/job/apache-atlas-nightly/ws/repository/target/findbugs.xml>
with 0 unique warnings and 0 duplicates.
[FINDBUGS] Successfully parsed file <https://builds.apache.org/job/apache-atlas-nightly/ws/server-api/target/findbugs.xml>
with 0 unique warnings and 0 duplicates.
[FINDBUGS] Successfully parsed file <https://builds.apache.org/job/apache-atlas-nightly/ws/typesystem/target/findbugs.xml>
with 0 unique warnings and 0 duplicates.
[FINDBUGS] Computing warning deltas based on reference build #711
Archiving artifacts
TestNG Reports Processing: START
Looking for TestNG results report in workspace using pattern: **/target/surefire-reports/testng-results.xml,**/target/failsafe-reports/testng-results.xml
Saving reports...
Processing '/x1/jenkins/jenkins-home/jobs/apache-atlas-nightly/builds/716/testng/testng-results-1.xml'
Processing '/x1/jenkins/jenkins-home/jobs/apache-atlas-nightly/builds/716/testng/testng-results-10.xml'
Processing '/x1/jenkins/jenkins-home/jobs/apache-atlas-nightly/builds/716/testng/testng-results-2.xml'
Processing '/x1/jenkins/jenkins-home/jobs/apache-atlas-nightly/builds/716/testng/testng-results-3.xml'
Processing '/x1/jenkins/jenkins-home/jobs/apache-atlas-nightly/builds/716/testng/testng-results-4.xml'
Processing '/x1/jenkins/jenkins-home/jobs/apache-atlas-nightly/builds/716/testng/testng-results-5.xml'
Processing '/x1/jenkins/jenkins-home/jobs/apache-atlas-nightly/builds/716/testng/testng-results-6.xml'
Processing '/x1/jenkins/jenkins-home/jobs/apache-atlas-nightly/builds/716/testng/testng-results-7.xml'
Processing '/x1/jenkins/jenkins-home/jobs/apache-atlas-nightly/builds/716/testng/testng-results-8.xml'
Processing '/x1/jenkins/jenkins-home/jobs/apache-atlas-nightly/builds/716/testng/testng-results-9.xml'
Processing '/x1/jenkins/jenkins-home/jobs/apache-atlas-nightly/builds/716/testng/testng-results.xml'
TestNG Reports Processing: FINISH

Mime
View raw message