atlas-dev mailing list archives

Site index · List index
Message view « Date » · « Thread »
Top « Date » · « Thread »
From Apache Jenkins Server <jenk...@builds.apache.org>
Subject Build failed in Jenkins: apache-atlas-nightly #665
Date Sat, 04 Mar 2017 10:30:38 GMT
See <https://builds.apache.org/job/apache-atlas-nightly/665/display/redirect?page=changes>

Changes:

[madhan] ATLAS-1630: basic search implementation (#2)

------------------------------------------
[...truncated 491.27 KB...]
java.lang.IllegalArgumentException: Path segment is null

testInputsGraphForEntity(org.apache.atlas.web.resources.EntityLineageJerseyResourceIT)  Time
elapsed: 0.001 sec  <<< FAILURE!
java.lang.IllegalArgumentException: One or more of query value parameters are null

testOutputsGraph(org.apache.atlas.web.resources.EntityLineageJerseyResourceIT)  Time elapsed:
0.017 sec  <<< FAILURE!
org.apache.atlas.AtlasServiceException: Metadata service API org.apache.atlas.AtlasBaseClient$APIInfo@240f9525
failed with status 404 (Not Found) Response Body ({"error":"Dataset with name = sales_factbhuEVWUgfD
does not exist"})

testOutputsGraphForEntity(org.apache.atlas.web.resources.EntityLineageJerseyResourceIT)  Time
elapsed: 0.017 sec  <<< FAILURE!
org.apache.atlas.AtlasServiceException: Metadata service API org.apache.atlas.AtlasBaseClient$APIInfo@7c221721
failed with status 404 (Not Found) Response Body ({"error":"Instance hive_table_v1 with unique
attribute {qualifiedName=sales_factbhuEVWUgfD} does not exist"})

testSchema(org.apache.atlas.web.resources.EntityLineageJerseyResourceIT)  Time elapsed: 0.011
sec  <<< FAILURE!
org.apache.atlas.AtlasServiceException: Metadata service API org.apache.atlas.AtlasBaseClient$APIInfo@b3f451d
failed with status 404 (Not Found) Response Body ({"error":"Dataset with name = sales_factbhuEVWUgfD
does not exist"})

testSchemaForEntity(org.apache.atlas.web.resources.EntityLineageJerseyResourceIT)  Time elapsed:
0.012 sec  <<< FAILURE!
org.apache.atlas.AtlasServiceException: Metadata service API org.apache.atlas.AtlasBaseClient$APIInfo@7ac83a47
failed with status 404 (Not Found) Response Body ({"error":"Instance hive_table_v1 with unique
attribute {qualifiedName=sales_factbhuEVWUgfD} does not exist"})

Running org.apache.atlas.CredentialProviderUtilityIT
Tests run: 4, Failures: 0, Errors: 0, Skipped: 0, Time elapsed: 1.618 sec - in org.apache.atlas.CredentialProviderUtilityIT
Running org.apache.atlas.notification.EntityNotificationIT
127.0.0.1 - - [04/Mar/2017:10:28:23 +0000] "GET /api/atlas/types/tableType HTTP/1.1" 200 -
"-" "Java/1.7.0_80"
127.0.0.1 - - [04/Mar/2017:10:28:24 +0000] "GET /api/atlas/types/serdeType HTTP/1.1" 200 -
"-" "Java/1.7.0_80"
127.0.0.1 - - [04/Mar/2017:10:28:24 +0000] "GET /api/atlas/types/classification HTTP/1.1"
200 - "-" "Java/1.7.0_80"
127.0.0.1 - - [04/Mar/2017:10:28:24 +0000] "GET /api/atlas/types/hive_db_v1 HTTP/1.1" 200
- "-" "Java/1.7.0_80"
127.0.0.1 - - [04/Mar/2017:10:28:25 +0000] "POST /api/atlas/entities HTTP/1.1" 201 - "-" "Java/1.7.0_80"
127.0.0.1 - - [04/Mar/2017:10:28:25 +0000] "POST /api/atlas/entities HTTP/1.1" 500 - "-" "Java/1.7.0_80"
127.0.0.1 - - [04/Mar/2017:10:28:26 +0000] "POST /api/atlas/entities HTTP/1.1" 201 - "-" "Java/1.7.0_80"
127.0.0.1 - - [04/Mar/2017:10:28:26 +0000] "POST /api/atlas/entities HTTP/1.1" 500 - "-" "Java/1.7.0_80"
Tests run: 5, Failures: 2, Errors: 0, Skipped: 3, Time elapsed: 4.556 sec <<< FAILURE!
- in org.apache.atlas.notification.EntityNotificationIT
testCreateEntity(org.apache.atlas.notification.EntityNotificationIT)  Time elapsed: 0.26 sec
 <<< FAILURE!
org.apache.atlas.AtlasServiceException: Metadata service API org.apache.atlas.AtlasBaseClient$APIInfo@3d368f5d
failed with status 500 (Internal Server Error) Response Body ({"error":"Failed with java.lang.NullPointerException"})
	at org.apache.atlas.notification.EntityNotificationIT.testCreateEntity(EntityNotificationIT.java:79)

testDeleteEntity(org.apache.atlas.notification.EntityNotificationIT)  Time elapsed: 0.092
sec  <<< FAILURE!
org.apache.atlas.AtlasServiceException: Metadata service API org.apache.atlas.AtlasBaseClient$APIInfo@49d32eb
failed with status 500 (Internal Server Error) Response Body ({"error":"Failed with java.lang.NullPointerException"})
	at org.apache.atlas.notification.EntityNotificationIT.testDeleteEntity(EntityNotificationIT.java:108)

Running org.apache.atlas.notification.NotificationHookConsumerIT
127.0.0.1 - - [04/Mar/2017:10:28:29 +0000] "GET /api/atlas/types/tableType HTTP/1.1" 200 -
"-" "Java/1.7.0_80"
127.0.0.1 - - [04/Mar/2017:10:28:29 +0000] "GET /api/atlas/types/serdeType HTTP/1.1" 200 -
"-" "Java/1.7.0_80"
127.0.0.1 - - [04/Mar/2017:10:28:29 +0000] "GET /api/atlas/types/classification HTTP/1.1"
200 - "-" "Java/1.7.0_80"
127.0.0.1 - - [04/Mar/2017:10:28:29 +0000] "GET /api/atlas/types/hive_db_v1 HTTP/1.1" 200
- "-" "Java/1.7.0_80"
127.0.0.1 - - [04/Mar/2017:10:28:30 +0000] "GET /api/atlas/discovery/search/dsl?query=hive_db+where+qualifiedName%3D'dbTPgLg4M5dS'&limit=10&offset=0
HTTP/1.1" 200 - "-" "Java/1.7.0_80"
127.0.0.1 - - [04/Mar/2017:10:28:31 +0000] "GET /api/atlas/entities?type=hive_db&property=qualifiedName&value=dbTPgLg4M5dS
HTTP/1.1" 200 - "-" "Java/1.7.0_80"
127.0.0.1 - - [04/Mar/2017:10:28:31 +0000] "GET /api/atlas/entities/2c02420c-b7a9-4ff0-bc2f-d95c9fb6dcab/audit?count=1
HTTP/1.1" 200 - "-" "Java/1.7.0_80"
127.0.0.1 - - [04/Mar/2017:10:28:31 +0000] "POST /api/atlas/entities HTTP/1.1" 201 - "-" "Java/1.7.0_80"
127.0.0.1 - - [04/Mar/2017:10:28:31 +0000] "GET /api/atlas/entities/33746cb1-6cfe-43b0-971d-d2fcc3a7014e
HTTP/1.1" 200 - "-" "Java/1.7.0_80"
127.0.0.1 - - [04/Mar/2017:10:28:31 +0000] "GET /api/atlas/entities/33746cb1-6cfe-43b0-971d-d2fcc3a7014e
HTTP/1.1" 200 - "-" "Java/1.7.0_80"
127.0.0.1 - - [04/Mar/2017:10:28:31 +0000] "GET /api/atlas/discovery/search/dsl?query=hive_db+where+name%3D'dbSj4SxsYTaT'&limit=10&offset=0
HTTP/1.1" 200 - "-" "Java/1.7.0_80"
127.0.0.1 - - [04/Mar/2017:10:28:32 +0000] "GET /api/atlas/discovery/search/dsl?query=hive_db+where+name%3D'dbSj4SxsYTaT'&limit=10&offset=0
HTTP/1.1" 200 - "-" "Java/1.7.0_80"
127.0.0.1 - - [04/Mar/2017:10:28:33 +0000] "POST /api/atlas/entities HTTP/1.1" 201 - "-" "Java/1.7.0_80"
127.0.0.1 - - [04/Mar/2017:10:28:33 +0000] "GET /api/atlas/discovery/search/dsl?query=hive_db+where+qualifiedName%3D'dbfFIZGYh3JL'&limit=10&offset=0
HTTP/1.1" 200 - "-" "Java/1.7.0_80"
127.0.0.1 - - [04/Mar/2017:10:28:34 +0000] "GET /api/atlas/entities?type=hive_db&property=qualifiedName&value=dbfFIZGYh3JL
HTTP/1.1" 200 - "-" "Java/1.7.0_80"
127.0.0.1 - - [04/Mar/2017:10:28:34 +0000] "POST /api/atlas/entities HTTP/1.1" 201 - "-" "Java/1.7.0_80"
127.0.0.1 - - [04/Mar/2017:10:28:34 +0000] "GET /api/atlas/entities?type=hive_db&property=qualifiedName&value=dbtELXfdkMFj
HTTP/1.1" 200 - "-" "Java/1.7.0_80"
127.0.0.1 - - [04/Mar/2017:10:28:34 +0000] "GET /api/atlas/entities?type=hive_db&property=qualifiedName&value=dbtELXfdkMFj
HTTP/1.1" 200 - "-" "Java/1.7.0_80"
127.0.0.1 - - [04/Mar/2017:10:28:34 +0000] "GET /api/atlas/entities?type=hive_db&property=qualifiedName&value=dbtELXfdkMFj
HTTP/1.1" 200 - "-" "Java/1.7.0_80"
127.0.0.1 - - [04/Mar/2017:10:28:34 +0000] "POST /api/atlas/entities HTTP/1.1" 201 - "-" "Java/1.7.0_80"
127.0.0.1 - - [04/Mar/2017:10:28:34 +0000] "GET /api/atlas/discovery/search/dsl?query=hive_db+where+qualifiedName%3D'dbEB0psTI3ek'&limit=10&offset=0
HTTP/1.1" 200 - "-" "Java/1.7.0_80"
127.0.0.1 - - [04/Mar/2017:10:28:35 +0000] "GET /api/atlas/discovery/search/dsl?query=hive_db+where+qualifiedName%3D'dbOZ0gu3Y7fi'&limit=10&offset=0
HTTP/1.1" 200 - "-" "Java/1.7.0_80"
Tests run: 6, Failures: 0, Errors: 0, Skipped: 0, Time elapsed: 9.692 sec - in org.apache.atlas.notification.NotificationHookConsumerIT

Results :

Failed tests: 
  QuickStartIT.runQuickStart:44 » AtlasService Metadata service API org.apache.a...
  QuickStartV2IT.runQuickStart:50 » AtlasService Metadata service API org.apache...
  EntityNotificationIT.testCreateEntity:79->BaseResourceIT.createInstance:234 » AtlasService
  EntityNotificationIT.testDeleteEntity:108->BaseResourceIT.createInstance:234 » AtlasService
  DataSetLineageJerseyResourceIT.setUp:57->setupInstances:206->table:275->BaseResourceIT.createInstance:234
» AtlasService
  EntityJerseyResourceIT.testEntityDeduping:284 » AtlasService Metadata service ...
  EntityJerseyResourceIT.testSubmitEntity:179->BaseResourceIT.createInstance:234 » AtlasService
  EntityLineageJerseyResourceIT.setUp:61->DataSetLineageJerseyResourceIT.setUp:57->DataSetLineageJerseyResourceIT.setupInstances:206->DataSetLineageJerseyResourceIT.table:275->BaseResourceIT.createInstance:234
» AtlasService
  EntityLineageJerseyResourceIT>DataSetLineageJerseyResourceIT.testInputsGraph:62 »
IllegalArgument
  EntityLineageJerseyResourceIT>DataSetLineageJerseyResourceIT.testInputsGraphForEntity:81
» IllegalArgument
  EntityLineageJerseyResourceIT>DataSetLineageJerseyResourceIT.testOutputsGraph:98 »
AtlasService
  EntityLineageJerseyResourceIT>DataSetLineageJerseyResourceIT.testOutputsGraphForEntity:117
» AtlasService
  EntityLineageJerseyResourceIT>DataSetLineageJerseyResourceIT.testSchema:134 » AtlasService
  EntityLineageJerseyResourceIT>DataSetLineageJerseyResourceIT.testSchemaForEntity:158
» AtlasService
  EntityV2JerseyResourceIT.testAddNullPropertyValue:346->createHiveTable:454->createHiveTable:463
expected object to not be null
  EntityV2JerseyResourceIT.testEntityDeduping:196 » AtlasService Metadata servic...
  EntityV2JerseyResourceIT.testSubmitEntity:102->createDBAndTable:448->createHiveTable:454->createHiveTable:463
expected object to not be null
  EntityV2JerseyResourceIT.testSubmitEntityWithBadDateFormat:309 expected object to not be
null
  MetadataDiscoveryJerseyResourceIT.setUp:64->BaseResourceIT.createInstance:234 » AtlasService

Tests run: 138, Failures: 19, Errors: 0, Skipped: 55

[INFO] 
[INFO] --- jetty-maven-plugin:9.2.12.v20150709:stop (stop-jetty) @ atlas-webapp ---
[INFO] Waiting 10 seconds for jetty to stop
[INFO] Stopped ServerConnector@74aec669{HTTP/1.1}{0.0.0.0:31000}
[INFO] Closing Spring root WebApplicationContext
[INFO] Shutting down log4j
[INFO] Stopped o.e.j.m.p.JettyWebAppContext@29df38c{/,<https://builds.apache.org/job/apache-atlas-nightly/ws/webapp/target/atlas-webapp-0.8-incubating-SNAPSHOT/,UNAVAILABLE}{/home/jenkins/jenkins-slave/workspace/apache-atlas-nightly/webapp/target/atlas-webapp-0.8-incubating-SNAPSHOT.war}>
[INFO] Server reports itself as stopped
[INFO] 
[INFO] --- maven-source-plugin:2.4:jar-no-fork (attach-sources) @ atlas-webapp ---
[INFO] Building jar: <https://builds.apache.org/job/apache-atlas-nightly/ws/webapp/target/atlas-webapp-0.8-incubating-SNAPSHOT-sources.jar>
[INFO] 
[INFO] --- maven-source-plugin:2.4:test-jar-no-fork (attach-sources) @ atlas-webapp ---
[INFO] Building jar: <https://builds.apache.org/job/apache-atlas-nightly/ws/webapp/target/atlas-webapp-0.8-incubating-SNAPSHOT-test-sources.jar>
[INFO] 
[INFO] --- maven-failsafe-plugin:2.19.1:verify (verify) @ atlas-webapp ---
[INFO] ------------------------------------------------------------------------
[INFO] Reactor Summary:
[INFO] 
[INFO] Apache Atlas Server Build Tools .................... SUCCESS [  0.916 s]
[INFO] apache-atlas ....................................... SUCCESS [  7.266 s]
[INFO] Apache Atlas Integration ........................... SUCCESS [ 59.753 s]
[INFO] Apache Atlas Common ................................ SUCCESS [ 20.629 s]
[INFO] Apache Atlas Typesystem ............................ SUCCESS [01:35 min]
[INFO] Apache Atlas Client ................................ SUCCESS [ 22.379 s]
[INFO] Apache Atlas Server API ............................ SUCCESS [ 12.719 s]
[INFO] Apache Atlas Notification .......................... SUCCESS [ 44.724 s]
[INFO] Apache Atlas Graph Database Projects ............... SUCCESS [  0.714 s]
[INFO] Apache Atlas Graph Database API .................... SUCCESS [  8.139 s]
[INFO] Graph Database Common Code ......................... SUCCESS [  8.218 s]
[INFO] Apache Atlas Titan 1.0.0 GraphDB Impl .............. SUCCESS [ 33.281 s]
[INFO] Shaded version of Apache hbase client .............. SUCCESS [  9.040 s]
[INFO] Apache Atlas Titan 0.5.4 Graph DB Impl ............. SUCCESS [01:48 min]
[INFO] Apache Atlas Graph Database Implementation Dependencies SUCCESS [  0.686 s]
[INFO] Shaded version of Apache hbase server .............. SUCCESS [ 23.299 s]
[INFO] Apache Atlas Repository ............................ SUCCESS [16:00 min]
[INFO] Apache Atlas Authorization ......................... SUCCESS [ 15.896 s]
[INFO] Apache Atlas Business Catalog ...................... SUCCESS [ 34.323 s]
[INFO] Apache Atlas UI .................................... SUCCESS [ 58.141 s]
[INFO] Apache Atlas Web Application ....................... FAILURE [07:04 min]
[INFO] Apache Atlas Documentation ......................... SKIPPED
[INFO] Apache Atlas FileSystem Model ...................... SKIPPED
[INFO] Apache Atlas Plugin Classloader .................... SKIPPED
[INFO] Apache Atlas Hive Bridge Shim ...................... SKIPPED
[INFO] Apache Atlas Hive Bridge ........................... SKIPPED
[INFO] Apache Atlas Falcon Bridge Shim .................... SKIPPED
[INFO] Apache Atlas Falcon Bridge ......................... SKIPPED
[INFO] Apache Atlas Sqoop Bridge Shim ..................... SKIPPED
[INFO] Apache Atlas Sqoop Bridge .......................... SKIPPED
[INFO] Apache Atlas Storm Bridge Shim ..................... SKIPPED
[INFO] Apache Atlas Storm Bridge .......................... SKIPPED
[INFO] Apache Atlas Distribution .......................... SKIPPED
[INFO] ------------------------------------------------------------------------
[INFO] BUILD FAILURE
[INFO] ------------------------------------------------------------------------
[INFO] Total time: 32:31 min
[INFO] Finished at: 2017-03-04T10:28:42+00:00
log4j:WARN No appenders could be found for logger (org.apache.zookeeper.ClientCnxn).
log4j:WARN Please initialize the log4j system properly.
log4j:WARN See http://logging.apache.org/log4j/1.2/faq.html#noconfig for more info.
[INFO] Final Memory: 338M/1812M
[INFO] ------------------------------------------------------------------------
[ERROR] Failed to execute goal org.apache.maven.plugins:maven-failsafe-plugin:2.19.1:verify
(verify) on project atlas-webapp: There are test failures.
[ERROR] 
[ERROR] Please refer to <https://builds.apache.org/job/apache-atlas-nightly/ws/webapp/target/failsafe-reports>
for the individual test results.
[ERROR] -> [Help 1]
[ERROR] 
[ERROR] To see the full stack trace of the errors, re-run Maven with the -e switch.
[ERROR] Re-run Maven using the -X switch to enable full debug logging.
[ERROR] 
[ERROR] For more information about the errors and possible solutions, please read the following
articles:
[ERROR] [Help 1] http://cwiki.apache.org/confluence/display/MAVEN/MojoFailureException
[ERROR] 
[ERROR] After correcting the problems, you can resume the build with the command
[ERROR]   mvn <goals> -rf :atlas-webapp
Build step 'Execute shell' marked build as failure
[CHECKSTYLE] Collecting checkstyle analysis files...
[CHECKSTYLE] Finding all files that match the pattern **/target/checkstyle-result.xml
[CHECKSTYLE] Parsing 32 files in <https://builds.apache.org/job/apache-atlas-nightly/ws/>
[CHECKSTYLE] Successfully parsed file <https://builds.apache.org/job/apache-atlas-nightly/ws/addons/falcon-bridge-shim/target/checkstyle-result.xml>
with 29 unique warnings and 0 duplicates.
[CHECKSTYLE] Successfully parsed file <https://builds.apache.org/job/apache-atlas-nightly/ws/addons/falcon-bridge/target/checkstyle-result.xml>
with 420 unique warnings and 0 duplicates.
[CHECKSTYLE] Successfully parsed file <https://builds.apache.org/job/apache-atlas-nightly/ws/addons/hdfs-model/target/checkstyle-result.xml>
with 420 unique warnings and 0 duplicates.
[CHECKSTYLE] Successfully parsed file <https://builds.apache.org/job/apache-atlas-nightly/ws/addons/hive-bridge-shim/target/checkstyle-result.xml>
with 435 unique warnings and 0 duplicates.
[CHECKSTYLE] Successfully parsed file <https://builds.apache.org/job/apache-atlas-nightly/ws/addons/hive-bridge/target/checkstyle-result.xml>
with 2228 unique warnings and 0 duplicates.
[CHECKSTYLE] Successfully parsed file <https://builds.apache.org/job/apache-atlas-nightly/ws/addons/sqoop-bridge-shim/target/checkstyle-result.xml>
with 2244 unique warnings and 0 duplicates.
[CHECKSTYLE] Successfully parsed file <https://builds.apache.org/job/apache-atlas-nightly/ws/addons/sqoop-bridge/target/checkstyle-result.xml>
with 2369 unique warnings and 0 duplicates.
[CHECKSTYLE] Successfully parsed file <https://builds.apache.org/job/apache-atlas-nightly/ws/addons/storm-bridge-shim/target/checkstyle-result.xml>
with 2390 unique warnings and 0 duplicates.
[CHECKSTYLE] Successfully parsed file <https://builds.apache.org/job/apache-atlas-nightly/ws/addons/storm-bridge/target/checkstyle-result.xml>
with 2659 unique warnings and 0 duplicates.
[CHECKSTYLE] Successfully parsed file <https://builds.apache.org/job/apache-atlas-nightly/ws/authorization/target/checkstyle-result.xml>
with 3112 unique warnings and 0 duplicates.
[CHECKSTYLE] Successfully parsed file <https://builds.apache.org/job/apache-atlas-nightly/ws/catalog/target/checkstyle-result.xml>
with 5246 unique warnings and 0 duplicates.
[CHECKSTYLE] Successfully parsed file <https://builds.apache.org/job/apache-atlas-nightly/ws/client/target/checkstyle-result.xml>
with 6856 unique warnings and 0 duplicates.
[CHECKSTYLE] Successfully parsed file <https://builds.apache.org/job/apache-atlas-nightly/ws/common/target/checkstyle-result.xml>
with 8038 unique warnings and 0 duplicates.
[CHECKSTYLE] Successfully parsed file <https://builds.apache.org/job/apache-atlas-nightly/ws/dashboardv2/target/checkstyle-result.xml>
with 8038 unique warnings and 0 duplicates.
[CHECKSTYLE] Successfully parsed file <https://builds.apache.org/job/apache-atlas-nightly/ws/distro/target/checkstyle-result.xml>
with 8038 unique warnings and 0 duplicates.
[CHECKSTYLE] Successfully parsed file <https://builds.apache.org/job/apache-atlas-nightly/ws/docs/target/checkstyle-result.xml>
with 8038 unique warnings and 0 duplicates.
[CHECKSTYLE] Successfully parsed file <https://builds.apache.org/job/apache-atlas-nightly/ws/graphdb/api/target/checkstyle-result.xml>
with 8277 unique warnings and 0 duplicates.
[CHECKSTYLE] Successfully parsed file <https://builds.apache.org/job/apache-atlas-nightly/ws/graphdb/common/target/checkstyle-result.xml>
with 8426 unique warnings and 0 duplicates.
[CHECKSTYLE] Successfully parsed file <https://builds.apache.org/job/apache-atlas-nightly/ws/graphdb/graphdb-impls/target/checkstyle-result.xml>
with 8426 unique warnings and 0 duplicates.
[CHECKSTYLE] Successfully parsed file <https://builds.apache.org/job/apache-atlas-nightly/ws/graphdb/target/checkstyle-result.xml>
with 8426 unique warnings and 0 duplicates.
[CHECKSTYLE] Successfully parsed file <https://builds.apache.org/job/apache-atlas-nightly/ws/graphdb/titan0/target/checkstyle-result.xml>
with 10642 unique warnings and 0 duplicates.
[CHECKSTYLE] Successfully parsed file <https://builds.apache.org/job/apache-atlas-nightly/ws/graphdb/titan1/target/checkstyle-result.xml>
with 11542 unique warnings and 0 duplicates.
[CHECKSTYLE] Successfully parsed file <https://builds.apache.org/job/apache-atlas-nightly/ws/intg/target/checkstyle-result.xml>
with 17435 unique warnings and 0 duplicates.
[CHECKSTYLE] Successfully parsed file <https://builds.apache.org/job/apache-atlas-nightly/ws/notification/target/checkstyle-result.xml>
with 18600 unique warnings and 0 duplicates.
[CHECKSTYLE] Successfully parsed file <https://builds.apache.org/job/apache-atlas-nightly/ws/plugin-classloader/target/checkstyle-result.xml>
with 18708 unique warnings and 0 duplicates.
[CHECKSTYLE] Successfully parsed file <https://builds.apache.org/job/apache-atlas-nightly/ws/repository/target/checkstyle-result.xml>
with 33332 unique warnings and 0 duplicates.
[CHECKSTYLE] Successfully parsed file <https://builds.apache.org/job/apache-atlas-nightly/ws/server-api/target/checkstyle-result.xml>
with 33729 unique warnings and 0 duplicates.
[CHECKSTYLE] Successfully parsed file <https://builds.apache.org/job/apache-atlas-nightly/ws/shaded/hbase-client-shaded/target/checkstyle-result.xml>
with 33729 unique warnings and 0 duplicates.
[CHECKSTYLE] Successfully parsed file <https://builds.apache.org/job/apache-atlas-nightly/ws/shaded/hbase-server-shaded/target/checkstyle-result.xml>
with 33729 unique warnings and 0 duplicates.
[CHECKSTYLE] Successfully parsed file <https://builds.apache.org/job/apache-atlas-nightly/ws/target/checkstyle-result.xml>
with 33729 unique warnings and 0 duplicates.
[CHECKSTYLE] Successfully parsed file <https://builds.apache.org/job/apache-atlas-nightly/ws/titan/target/checkstyle-result.xml>
with 34191 unique warnings and 0 duplicates.
[CHECKSTYLE] Successfully parsed file <https://builds.apache.org/job/apache-atlas-nightly/ws/typesystem/target/checkstyle-result.xml>
with 38410 unique warnings and 0 duplicates.
[CHECKSTYLE] Computing warning deltas based on reference build #535
[FINDBUGS] Collecting findbugs analysis files...
[FINDBUGS] Finding all files that match the pattern **/target/findbugs.xml
[FINDBUGS] Parsing 22 files in <https://builds.apache.org/job/apache-atlas-nightly/ws/>
[FINDBUGS] Successfully parsed file <https://builds.apache.org/job/apache-atlas-nightly/ws/addons/falcon-bridge-shim/target/findbugs.xml>
with 0 unique warnings and 0 duplicates.
[FINDBUGS] Successfully parsed file <https://builds.apache.org/job/apache-atlas-nightly/ws/addons/falcon-bridge/target/findbugs.xml>
with 0 unique warnings and 0 duplicates.
[FINDBUGS] Successfully parsed file <https://builds.apache.org/job/apache-atlas-nightly/ws/addons/hive-bridge-shim/target/findbugs.xml>
with 0 unique warnings and 0 duplicates.
[FINDBUGS] Successfully parsed file <https://builds.apache.org/job/apache-atlas-nightly/ws/addons/hive-bridge/target/findbugs.xml>
with 0 unique warnings and 0 duplicates.
[FINDBUGS] Successfully parsed file <https://builds.apache.org/job/apache-atlas-nightly/ws/addons/sqoop-bridge-shim/target/findbugs.xml>
with 0 unique warnings and 0 duplicates.
[FINDBUGS] Successfully parsed file <https://builds.apache.org/job/apache-atlas-nightly/ws/addons/sqoop-bridge/target/findbugs.xml>
with 0 unique warnings and 0 duplicates.
[FINDBUGS] Successfully parsed file <https://builds.apache.org/job/apache-atlas-nightly/ws/addons/storm-bridge-shim/target/findbugs.xml>
with 0 unique warnings and 0 duplicates.
[FINDBUGS] Successfully parsed file <https://builds.apache.org/job/apache-atlas-nightly/ws/addons/storm-bridge/target/findbugs.xml>
with 0 unique warnings and 0 duplicates.
[FINDBUGS] Successfully parsed file <https://builds.apache.org/job/apache-atlas-nightly/ws/authorization/target/findbugs.xml>
with 0 unique warnings and 0 duplicates.
[FINDBUGS] Successfully parsed file <https://builds.apache.org/job/apache-atlas-nightly/ws/catalog/target/findbugs.xml>
with 0 unique warnings and 0 duplicates.
[FINDBUGS] Successfully parsed file <https://builds.apache.org/job/apache-atlas-nightly/ws/client/target/findbugs.xml>
with 0 unique warnings and 0 duplicates.
[FINDBUGS] Successfully parsed file <https://builds.apache.org/job/apache-atlas-nightly/ws/common/target/findbugs.xml>
with 0 unique warnings and 0 duplicates.
[FINDBUGS] Successfully parsed file <https://builds.apache.org/job/apache-atlas-nightly/ws/graphdb/api/target/findbugs.xml>
with 0 unique warnings and 0 duplicates.
[FINDBUGS] Successfully parsed file <https://builds.apache.org/job/apache-atlas-nightly/ws/graphdb/common/target/findbugs.xml>
with 0 unique warnings and 0 duplicates.
[FINDBUGS] Successfully parsed file <https://builds.apache.org/job/apache-atlas-nightly/ws/graphdb/titan0/target/findbugs.xml>
with 0 unique warnings and 0 duplicates.
[FINDBUGS] Successfully parsed file <https://builds.apache.org/job/apache-atlas-nightly/ws/intg/target/findbugs.xml>
with 0 unique warnings and 0 duplicates.
[FINDBUGS] Successfully parsed file <https://builds.apache.org/job/apache-atlas-nightly/ws/notification/target/findbugs.xml>
with 0 unique warnings and 0 duplicates.
[FINDBUGS] Successfully parsed file <https://builds.apache.org/job/apache-atlas-nightly/ws/plugin-classloader/target/findbugs.xml>
with 0 unique warnings and 0 duplicates.
[FINDBUGS] Successfully parsed file <https://builds.apache.org/job/apache-atlas-nightly/ws/repository/target/findbugs.xml>
with 0 unique warnings and 0 duplicates.
[FINDBUGS] Successfully parsed file <https://builds.apache.org/job/apache-atlas-nightly/ws/server-api/target/findbugs.xml>
with 0 unique warnings and 0 duplicates.
[FINDBUGS] Successfully parsed file <https://builds.apache.org/job/apache-atlas-nightly/ws/titan/target/findbugs.xml>
with 0 unique warnings and 0 duplicates.
[FINDBUGS] Successfully parsed file <https://builds.apache.org/job/apache-atlas-nightly/ws/typesystem/target/findbugs.xml>
with 0 unique warnings and 0 duplicates.
[FINDBUGS] Computing warning deltas based on reference build #535
Archiving artifacts
Compressed 571.65 MB of artifacts by 64.1% relative to #535
TestNG Reports Processing: START
Looking for TestNG results report in workspace using pattern: **/target/surefire-reports/testng-results.xml,**/target/failsafe-reports/testng-results.xml
testng-results.xml was last modified before this build started. Ignoring it.
testng-results.xml was last modified before this build started. Ignoring it.
testng-results.xml was last modified before this build started. Ignoring it.
testng-results.xml was last modified before this build started. Ignoring it.
testng-results.xml was last modified before this build started. Ignoring it.
testng-results.xml was last modified before this build started. Ignoring it.
testng-results.xml was last modified before this build started. Ignoring it.
Saving reports...
Processing '/x1/jenkins/jenkins-home/jobs/apache-atlas-nightly/builds/665/testng/testng-results-1.xml'
Processing '/x1/jenkins/jenkins-home/jobs/apache-atlas-nightly/builds/665/testng/testng-results-10.xml'
Processing '/x1/jenkins/jenkins-home/jobs/apache-atlas-nightly/builds/665/testng/testng-results-2.xml'
Processing '/x1/jenkins/jenkins-home/jobs/apache-atlas-nightly/builds/665/testng/testng-results-3.xml'
Processing '/x1/jenkins/jenkins-home/jobs/apache-atlas-nightly/builds/665/testng/testng-results-4.xml'
Processing '/x1/jenkins/jenkins-home/jobs/apache-atlas-nightly/builds/665/testng/testng-results-5.xml'
Processing '/x1/jenkins/jenkins-home/jobs/apache-atlas-nightly/builds/665/testng/testng-results-6.xml'
Processing '/x1/jenkins/jenkins-home/jobs/apache-atlas-nightly/builds/665/testng/testng-results-7.xml'
Processing '/x1/jenkins/jenkins-home/jobs/apache-atlas-nightly/builds/665/testng/testng-results-8.xml'
Processing '/x1/jenkins/jenkins-home/jobs/apache-atlas-nightly/builds/665/testng/testng-results-9.xml'
Processing '/x1/jenkins/jenkins-home/jobs/apache-atlas-nightly/builds/665/testng/testng-results.xml'
TestNG Reports Processing: FINISH

Mime
View raw message