atlas-dev mailing list archives

Site index · List index
Message view « Date » · « Thread »
Top « Date » · « Thread »
From Apache Jenkins Server <jenk...@builds.apache.org>
Subject Build failed in Jenkins: apache-atlas-nightly #632
Date Mon, 20 Feb 2017 13:45:41 GMT
See <https://builds.apache.org/job/apache-atlas-nightly/632/display/redirect?page=changes>

Changes:

[kbhatt] ATLAS-1546: Changed to LOG.warn instead error in Hive hook should choose

------------------------------------------
[...truncated 485.52 KB...]
127.0.0.1 - - [20/Feb/2017:13:30:06 +0000] "GET /api/atlas/lineage/bb537e3c-795d-4d33-9bcc-9b08b0abc1c9/inputs/graph
HTTP/1.1" 200 - "-" "Java/1.7.0_80"
127.0.0.1 - - [20/Feb/2017:13:30:07 +0000] "GET /api/atlas/lineage/hive/table/sales_factrUBnHOhhGY/outputs/graph
HTTP/1.1" 200 - "-" "Java/1.7.0_80"
127.0.0.1 - - [20/Feb/2017:13:30:10 +0000] "GET /api/atlas/entities?type=hive_table_v1&property=qualifiedName&value=sales_factrUBnHOhhGY
HTTP/1.1" 200 - "-" "Java/1.7.0_80"
127.0.0.1 - - [20/Feb/2017:13:30:10 +0000] "GET /api/atlas/lineage/1da3967f-d947-4d97-8255-4476ef8dfea9/outputs/graph
HTTP/1.1" 200 - "-" "Java/1.7.0_80"
127.0.0.1 - - [20/Feb/2017:13:30:11 +0000] "GET /api/atlas/lineage/hive/table/sales_factrUBnHOhhGY/schema
HTTP/1.1" 200 - "-" "Java/1.7.0_80"
127.0.0.1 - - [20/Feb/2017:13:30:12 +0000] "GET /api/atlas/lineage/hive/table/Salesms21Ft8wbx/schema
HTTP/1.1" 404 - "-" "Java/1.7.0_80"
127.0.0.1 - - [20/Feb/2017:13:30:12 +0000] "GET /api/atlas/entities?type=hive_table_v1&property=qualifiedName&value=sales_factrUBnHOhhGY
HTTP/1.1" 200 - "-" "Java/1.7.0_80"
127.0.0.1 - - [20/Feb/2017:13:30:12 +0000] "GET /api/atlas/lineage/1da3967f-d947-4d97-8255-4476ef8dfea9/schema
HTTP/1.1" 200 - "-" "Java/1.7.0_80"
127.0.0.1 - - [20/Feb/2017:13:30:13 +0000] "GET /api/atlas/lineage/hive/table/blah/schema
HTTP/1.1" 404 - "-" "Java/1.7.0_80"
127.0.0.1 - - [20/Feb/2017:13:30:13 +0000] "GET /api/atlas/entities?type=hive_table_v1&property=qualifiedName&value=sales_fact_monthly_mvIPOET02UtU
HTTP/1.1" 200 - "-" "Java/1.7.0_80"
127.0.0.1 - - [20/Feb/2017:13:30:13 +0000] "GET /api/atlas/v2/lineage/04ad6d92-440b-480d-ab05-665fab033d60?direction=INPUT&depth=5
HTTP/1.1" 200 - "-" "Java/1.7.0_80"
127.0.0.1 - - [20/Feb/2017:13:30:14 +0000] "GET /api/atlas/entities?type=hive_table_v1&property=qualifiedName&value=sales_fact_monthly_mvIPOET02UtU
HTTP/1.1" 200 - "-" "Java/1.7.0_80"
127.0.0.1 - - [20/Feb/2017:13:30:14 +0000] "GET /api/atlas/v2/lineage/04ad6d92-440b-480d-ab05-665fab033d60?direction=BOTH&depth=5
HTTP/1.1" 200 - "-" "Java/1.7.0_80"
127.0.0.1 - - [20/Feb/2017:13:30:16 +0000] "GET /api/atlas/entities?type=hive_table_v1&property=qualifiedName&value=sales_factlSWu65jzik
HTTP/1.1" 200 - "-" "Java/1.7.0_80"
127.0.0.1 - - [20/Feb/2017:13:30:16 +0000] "GET /api/atlas/v2/lineage/a752a26a-2a6d-4628-a0e2-d4e15818dc61?direction=OUTPUT&depth=5
HTTP/1.1" 200 - "-" "Java/1.7.0_80"
Tests run: 11, Failures: 0, Errors: 0, Skipped: 0, Time elapsed: 18.589 sec - in org.apache.atlas.web.resources.EntityLineageJerseyResourceIT
Running org.apache.atlas.CredentialProviderUtilityIT
Tests run: 4, Failures: 0, Errors: 0, Skipped: 0, Time elapsed: 1.706 sec - in org.apache.atlas.CredentialProviderUtilityIT
Running org.apache.atlas.notification.EntityNotificationIT
127.0.0.1 - - [20/Feb/2017:13:30:23 +0000] "GET /api/atlas/types/tableType HTTP/1.1" 200 -
"-" "Java/1.7.0_80"
127.0.0.1 - - [20/Feb/2017:13:30:23 +0000] "GET /api/atlas/types/serdeType HTTP/1.1" 200 -
"-" "Java/1.7.0_80"
127.0.0.1 - - [20/Feb/2017:13:30:24 +0000] "GET /api/atlas/types/classification HTTP/1.1"
200 - "-" "Java/1.7.0_80"
127.0.0.1 - - [20/Feb/2017:13:30:24 +0000] "GET /api/atlas/types/hive_db_v1 HTTP/1.1" 200
- "-" "Java/1.7.0_80"
127.0.0.1 - - [20/Feb/2017:13:30:24 +0000] "POST /api/atlas/entities HTTP/1.1" 201 - "-" "Java/1.7.0_80"
127.0.0.1 - - [20/Feb/2017:13:30:25 +0000] "POST /api/atlas/entities HTTP/1.1" 201 - "-" "Java/1.7.0_80"
127.0.0.1 - - [20/Feb/2017:13:30:26 +0000] "POST /api/atlas/types HTTP/1.1" 201 - "-" "Java/1.7.0_80"
127.0.0.1 - - [20/Feb/2017:13:30:26 +0000] "POST /api/atlas/types HTTP/1.1" 201 - "-" "Java/1.7.0_80"
127.0.0.1 - - [20/Feb/2017:13:30:26 +0000] "POST /api/atlas/types HTTP/1.1" 201 - "-" "Java/1.7.0_80"
127.0.0.1 - - [20/Feb/2017:13:30:27 +0000] "POST /api/atlas/entities/d44679d0-2a04-4ead-8007-4d9c45bfaf78/traits
HTTP/1.1" 201 - "-" "Java/1.7.0_80"
127.0.0.1 - - [20/Feb/2017:13:30:27 +0000] "POST /api/atlas/types HTTP/1.1" 201 - "-" "Java/1.7.0_80"
127.0.0.1 - - [20/Feb/2017:13:30:27 +0000] "POST /api/atlas/entities/d44679d0-2a04-4ead-8007-4d9c45bfaf78/traits
HTTP/1.1" 201 - "-" "Java/1.7.0_80"
127.0.0.1 - - [20/Feb/2017:13:30:27 +0000] "DELETE /api/atlas/entities/d44679d0-2a04-4ead-8007-4d9c45bfaf78/traits/TraitZT45ReoqYU
HTTP/1.1" 200 - "-" "Java/1.7.0_80"
127.0.0.1 - - [20/Feb/2017:13:30:27 +0000] "POST /api/atlas/entities/d44679d0-2a04-4ead-8007-4d9c45bfaf78?property=description
HTTP/1.1" 200 - "-" "Java/1.7.0_80"
127.0.0.1 - - [20/Feb/2017:13:30:27 +0000] "POST /api/atlas/entities HTTP/1.1" 201 - "-" "Java/1.7.0_80"
127.0.0.1 - - [20/Feb/2017:13:30:27 +0000] "POST /api/atlas/entities HTTP/1.1" 201 - "-" "Java/1.7.0_80"
127.0.0.1 - - [20/Feb/2017:13:30:27 +0000] "DELETE /api/atlas/entities?type=hive_table&property=qualifiedName&value=table-hdhgZGJQ0v
HTTP/1.1" 200 - "-" "Java/1.7.0_80"
Tests run: 5, Failures: 0, Errors: 0, Skipped: 0, Time elapsed: 6.742 sec - in org.apache.atlas.notification.EntityNotificationIT
Running org.apache.atlas.notification.NotificationHookConsumerIT
127.0.0.1 - - [20/Feb/2017:13:30:31 +0000] "GET /api/atlas/types/tableType HTTP/1.1" 200 -
"-" "Java/1.7.0_80"
127.0.0.1 - - [20/Feb/2017:13:30:31 +0000] "GET /api/atlas/types/serdeType HTTP/1.1" 200 -
"-" "Java/1.7.0_80"
127.0.0.1 - - [20/Feb/2017:13:30:31 +0000] "GET /api/atlas/types/classification HTTP/1.1"
200 - "-" "Java/1.7.0_80"
127.0.0.1 - - [20/Feb/2017:13:30:31 +0000] "GET /api/atlas/types/hive_db_v1 HTTP/1.1" 200
- "-" "Java/1.7.0_80"
127.0.0.1 - - [20/Feb/2017:13:30:32 +0000] "GET /api/atlas/discovery/search/dsl?query=hive_db+where+qualifiedName%3D'dbsP3LV8jvpT'&limit=10&offset=0
HTTP/1.1" 200 - "-" "Java/1.7.0_80"
127.0.0.1 - - [20/Feb/2017:13:30:33 +0000] "GET /api/atlas/entities?type=hive_db&property=qualifiedName&value=dbsP3LV8jvpT
HTTP/1.1" 200 - "-" "Java/1.7.0_80"
127.0.0.1 - - [20/Feb/2017:13:30:33 +0000] "GET /api/atlas/entities/45ebcd30-d17d-4cd9-846e-a1e5facf27c1/audit?count=1
HTTP/1.1" 200 - "-" "Java/1.7.0_80"
127.0.0.1 - - [20/Feb/2017:13:30:33 +0000] "POST /api/atlas/entities HTTP/1.1" 201 - "-" "Java/1.7.0_80"
127.0.0.1 - - [20/Feb/2017:13:30:34 +0000] "GET /api/atlas/entities/50e22f61-1206-40b7-af92-c37cbb6247bc
HTTP/1.1" 200 - "-" "Java/1.7.0_80"
127.0.0.1 - - [20/Feb/2017:13:30:34 +0000] "GET /api/atlas/entities/50e22f61-1206-40b7-af92-c37cbb6247bc
HTTP/1.1" 200 - "-" "Java/1.7.0_80"
127.0.0.1 - - [20/Feb/2017:13:30:34 +0000] "GET /api/atlas/discovery/search/dsl?query=hive_db+where+name%3D'dbuELiadETQG'&limit=10&offset=0
HTTP/1.1" 200 - "-" "Java/1.7.0_80"
127.0.0.1 - - [20/Feb/2017:13:30:35 +0000] "GET /api/atlas/discovery/search/dsl?query=hive_db+where+name%3D'dbuELiadETQG'&limit=10&offset=0
HTTP/1.1" 200 - "-" "Java/1.7.0_80"
127.0.0.1 - - [20/Feb/2017:13:30:36 +0000] "POST /api/atlas/entities HTTP/1.1" 201 - "-" "Java/1.7.0_80"
127.0.0.1 - - [20/Feb/2017:13:30:36 +0000] "GET /api/atlas/discovery/search/dsl?query=hive_db+where+qualifiedName%3D'dbuYLpvju8iV'&limit=10&offset=0
HTTP/1.1" 200 - "-" "Java/1.7.0_80"
127.0.0.1 - - [20/Feb/2017:13:30:36 +0000] "GET /api/atlas/entities?type=hive_db&property=qualifiedName&value=dbuYLpvju8iV
HTTP/1.1" 200 - "-" "Java/1.7.0_80"
127.0.0.1 - - [20/Feb/2017:13:30:36 +0000] "POST /api/atlas/entities HTTP/1.1" 201 - "-" "Java/1.7.0_80"
127.0.0.1 - - [20/Feb/2017:13:30:37 +0000] "GET /api/atlas/entities?type=hive_db&property=qualifiedName&value=dbJLg898TtNk
HTTP/1.1" 200 - "-" "Java/1.7.0_80"
127.0.0.1 - - [20/Feb/2017:13:30:37 +0000] "GET /api/atlas/entities?type=hive_db&property=qualifiedName&value=dbJLg898TtNk
HTTP/1.1" 200 - "-" "Java/1.7.0_80"
127.0.0.1 - - [20/Feb/2017:13:30:37 +0000] "GET /api/atlas/entities?type=hive_db&property=qualifiedName&value=dbJLg898TtNk
HTTP/1.1" 200 - "-" "Java/1.7.0_80"
127.0.0.1 - - [20/Feb/2017:13:30:37 +0000] "POST /api/atlas/entities HTTP/1.1" 201 - "-" "Java/1.7.0_80"
127.0.0.1 - - [20/Feb/2017:13:30:37 +0000] "GET /api/atlas/discovery/search/dsl?query=hive_db+where+qualifiedName%3D'dbJSqiBhdivR'&limit=10&offset=0
HTTP/1.1" 200 - "-" "Java/1.7.0_80"
127.0.0.1 - - [20/Feb/2017:13:30:38 +0000] "GET /api/atlas/discovery/search/dsl?query=hive_db+where+qualifiedName%3D'dbqWHkd6eq3K'&limit=10&offset=0
HTTP/1.1" 200 - "-" "Java/1.7.0_80"
Tests run: 6, Failures: 2, Errors: 0, Skipped: 0, Time elapsed: 10.679 sec <<< FAILURE!
- in org.apache.atlas.notification.NotificationHookConsumerIT
testCreateEntity(org.apache.atlas.notification.NotificationHookConsumerIT)  Time elapsed:
2.033 sec  <<< FAILURE!
java.lang.AssertionError: expected:<testuser> but was:<null>
	at org.apache.atlas.notification.NotificationHookConsumerIT.testCreateEntity(NotificationHookConsumerIT.java:112)

testUpdatePartialUpdatingQualifiedName(org.apache.atlas.notification.NotificationHookConsumerIT)
 Time elapsed: 1.734 sec  <<< FAILURE!
java.lang.AssertionError: expected:<0> but was:<1>
	at org.apache.atlas.notification.NotificationHookConsumerIT.testUpdatePartialUpdatingQualifiedName(NotificationHookConsumerIT.java:170)


Results :

Failed tests: 
  QuickStartV2IT.runQuickStart:48 » AtlasService Metadata service API org.apache...
  NotificationHookConsumerIT.testCreateEntity:112 expected:<testuser> but was:<null>
  NotificationHookConsumerIT.testUpdatePartialUpdatingQualifiedName:170 expected:<0>
but was:<1>
  EntityV2JerseyResourceIT.testAddNullPropertyValue:335->createHiveTable:443->createHiveTable:452
expected object to not be null
  EntityV2JerseyResourceIT.testEntityDeduping:197 » AtlasService Metadata servic...
org.apache.atlas.web.resources.EntityV2JerseyResourceIT.testEntityInvalidValue(org.apache.atlas.web.resources.EntityV2JerseyResourceIT)
  Run 1: PASS
  Run 2: EntityV2JerseyResourceIT.testEntityInvalidValue:272 expected:<null> but was:<AtlasEntityHeader{guid='b105874b-f413-4aa9-beb6-599321c55687',
status=ACTIVE, displayText=null, classificationNames=[],, AtlasStruct{typeName='hive_db_v2',
attributes=[name:f1CAA6HE0k]}}>

  EntityV2JerseyResourceIT.testSubmitEntity:103->createDBAndTable:437->createHiveTable:443->createHiveTable:452
expected object to not be null
  EntityV2JerseyResourceIT.testSubmitEntityWithBadDateFormat:296 expected object to not be
null
  MetadataDiscoveryJerseyResourceIT.setUp:64->BaseResourceIT.createInstance:259 » AtlasService

Tests run: 136, Failures: 9, Errors: 0, Skipped: 22

[INFO] 
[INFO] --- jetty-maven-plugin:9.2.12.v20150709:stop (stop-jetty) @ atlas-webapp ---
[INFO] Waiting 10 seconds for jetty to stop
[INFO] Stopped ServerConnector@6ff5e3eb{HTTP/1.1}{0.0.0.0:31000}
[INFO] Closing Spring root WebApplicationContext
[INFO] Shutting down log4j
[INFO] Stopped o.e.j.m.p.JettyWebAppContext@418b2229{/,<https://builds.apache.org/job/apache-atlas-nightly/ws/webapp/target/atlas-webapp-0.8-incubating-SNAPSHOT/,UNAVAILABLE}{/home/jenkins/jenkins-slave/workspace/apache-atlas-nightly/webapp/target/atlas-webapp-0.8-incubating-SNAPSHOT.war}>
[INFO] Server reports itself as stopped
[INFO] 
[INFO] --- maven-source-plugin:2.4:jar-no-fork (attach-sources) @ atlas-webapp ---
[INFO] Building jar: <https://builds.apache.org/job/apache-atlas-nightly/ws/webapp/target/atlas-webapp-0.8-incubating-SNAPSHOT-sources.jar>
log4j:WARN No appenders could be found for logger (org.apache.zookeeper.ClientCnxn).
log4j:WARN Please initialize the log4j system properly.
log4j:WARN See http://logging.apache.org/log4j/1.2/faq.html#noconfig for more info.
[INFO] 
[INFO] --- maven-source-plugin:2.4:test-jar-no-fork (attach-sources) @ atlas-webapp ---
[INFO] Building jar: <https://builds.apache.org/job/apache-atlas-nightly/ws/webapp/target/atlas-webapp-0.8-incubating-SNAPSHOT-test-sources.jar>
[INFO] 
[INFO] --- maven-failsafe-plugin:2.19.1:verify (verify) @ atlas-webapp ---
[INFO] ------------------------------------------------------------------------
[INFO] Reactor Summary:
[INFO] 
[INFO] Apache Atlas Server Build Tools .................... SUCCESS [  0.995 s]
[INFO] apache-atlas ....................................... SUCCESS [  7.533 s]
[INFO] Apache Atlas Integration ........................... SUCCESS [ 56.242 s]
[INFO] Apache Atlas Common ................................ SUCCESS [ 19.425 s]
[INFO] Apache Atlas Typesystem ............................ SUCCESS [01:33 min]
[INFO] Apache Atlas Client ................................ SUCCESS [ 21.310 s]
[INFO] Apache Atlas Server API ............................ SUCCESS [ 12.237 s]
[INFO] Apache Atlas Notification .......................... SUCCESS [ 42.287 s]
[INFO] Apache Atlas Graph Database Projects ............... SUCCESS [  0.643 s]
[INFO] Apache Atlas Graph Database API .................... SUCCESS [  7.846 s]
[INFO] Graph Database Common Code ......................... SUCCESS [  7.577 s]
[INFO] Shaded version of Apache hbase client .............. SUCCESS [ 10.130 s]
[INFO] Apache Atlas Titan 0.5.4 Graph DB Impl ............. SUCCESS [01:59 min]
[INFO] Apache Atlas Graph Database Implementation Dependencies SUCCESS [  0.649 s]
[INFO] Shaded version of Apache hbase server .............. SUCCESS [ 24.883 s]
[INFO] Apache Atlas Repository ............................ SUCCESS [15:26 min]
[INFO] Apache Atlas Authorization ......................... SUCCESS [ 18.140 s]
[INFO] Apache Atlas Business Catalog ...................... SUCCESS [ 37.163 s]
[INFO] Apache Atlas UI .................................... SUCCESS [ 58.778 s]
[INFO] Apache Atlas Web Application ....................... FAILURE [09:37 min]
[INFO] Apache Atlas Documentation ......................... SKIPPED
[INFO] Apache Atlas FileSystem Model ...................... SKIPPED
[INFO] Apache Atlas Plugin Classloader .................... SKIPPED
[INFO] Apache Atlas Hive Bridge Shim ...................... SKIPPED
[INFO] Apache Atlas Hive Bridge ........................... SKIPPED
[INFO] Apache Atlas Falcon Bridge Shim .................... SKIPPED
[INFO] Apache Atlas Falcon Bridge ......................... SKIPPED
[INFO] Apache Atlas Sqoop Bridge Shim ..................... SKIPPED
[INFO] Apache Atlas Sqoop Bridge .......................... SKIPPED
[INFO] Apache Atlas Storm Bridge Shim ..................... SKIPPED
[INFO] Apache Atlas Storm Bridge .......................... SKIPPED
[INFO] Apache Atlas Distribution .......................... SKIPPED
[INFO] ------------------------------------------------------------------------
[INFO] BUILD FAILURE
[INFO] ------------------------------------------------------------------------
[INFO] Total time: 34:04 min
[INFO] Finished at: 2017-02-20T13:30:45+00:00
[INFO] Final Memory: 339M/1638M
[INFO] ------------------------------------------------------------------------
[ERROR] Failed to execute goal org.apache.maven.plugins:maven-failsafe-plugin:2.19.1:verify
(verify) on project atlas-webapp: There are test failures.
[ERROR] 
[ERROR] Please refer to <https://builds.apache.org/job/apache-atlas-nightly/ws/webapp/target/failsafe-reports>
for the individual test results.
[ERROR] -> [Help 1]
[ERROR] 
[ERROR] To see the full stack trace of the errors, re-run Maven with the -e switch.
[ERROR] Re-run Maven using the -X switch to enable full debug logging.
[ERROR] 
[ERROR] For more information about the errors and possible solutions, please read the following
articles:
[ERROR] [Help 1] http://cwiki.apache.org/confluence/display/MAVEN/MojoFailureException
[ERROR] 
[ERROR] After correcting the problems, you can resume the build with the command
[ERROR]   mvn <goals> -rf :atlas-webapp
Build step 'Execute shell' marked build as failure
[CHECKSTYLE] Collecting checkstyle analysis files...
[CHECKSTYLE] Finding all files that match the pattern **/target/checkstyle-result.xml
[CHECKSTYLE] Parsing 31 files in <https://builds.apache.org/job/apache-atlas-nightly/ws/>
[CHECKSTYLE] Successfully parsed file <https://builds.apache.org/job/apache-atlas-nightly/ws/addons/falcon-bridge-shim/target/checkstyle-result.xml>
with 29 unique warnings and 0 duplicates.
[CHECKSTYLE] Successfully parsed file <https://builds.apache.org/job/apache-atlas-nightly/ws/addons/falcon-bridge/target/checkstyle-result.xml>
with 420 unique warnings and 0 duplicates.
[CHECKSTYLE] Successfully parsed file <https://builds.apache.org/job/apache-atlas-nightly/ws/addons/hdfs-model/target/checkstyle-result.xml>
with 420 unique warnings and 0 duplicates.
[CHECKSTYLE] Successfully parsed file <https://builds.apache.org/job/apache-atlas-nightly/ws/addons/hive-bridge-shim/target/checkstyle-result.xml>
with 435 unique warnings and 0 duplicates.
[CHECKSTYLE] Successfully parsed file <https://builds.apache.org/job/apache-atlas-nightly/ws/addons/hive-bridge/target/checkstyle-result.xml>
with 2228 unique warnings and 0 duplicates.
[CHECKSTYLE] Successfully parsed file <https://builds.apache.org/job/apache-atlas-nightly/ws/addons/sqoop-bridge-shim/target/checkstyle-result.xml>
with 2244 unique warnings and 0 duplicates.
[CHECKSTYLE] Successfully parsed file <https://builds.apache.org/job/apache-atlas-nightly/ws/addons/sqoop-bridge/target/checkstyle-result.xml>
with 2369 unique warnings and 0 duplicates.
[CHECKSTYLE] Successfully parsed file <https://builds.apache.org/job/apache-atlas-nightly/ws/addons/storm-bridge-shim/target/checkstyle-result.xml>
with 2390 unique warnings and 0 duplicates.
[CHECKSTYLE] Successfully parsed file <https://builds.apache.org/job/apache-atlas-nightly/ws/addons/storm-bridge/target/checkstyle-result.xml>
with 2659 unique warnings and 0 duplicates.
[CHECKSTYLE] Successfully parsed file <https://builds.apache.org/job/apache-atlas-nightly/ws/authorization/target/checkstyle-result.xml>
with 3112 unique warnings and 0 duplicates.
[CHECKSTYLE] Successfully parsed file <https://builds.apache.org/job/apache-atlas-nightly/ws/catalog/target/checkstyle-result.xml>
with 5245 unique warnings and 0 duplicates.
[CHECKSTYLE] Successfully parsed file <https://builds.apache.org/job/apache-atlas-nightly/ws/client/target/checkstyle-result.xml>
with 6927 unique warnings and 0 duplicates.
[CHECKSTYLE] Successfully parsed file <https://builds.apache.org/job/apache-atlas-nightly/ws/common/target/checkstyle-result.xml>
with 8109 unique warnings and 0 duplicates.
[CHECKSTYLE] Successfully parsed file <https://builds.apache.org/job/apache-atlas-nightly/ws/dashboardv2/target/checkstyle-result.xml>
with 8109 unique warnings and 0 duplicates.
[CHECKSTYLE] Successfully parsed file <https://builds.apache.org/job/apache-atlas-nightly/ws/distro/target/checkstyle-result.xml>
with 8109 unique warnings and 0 duplicates.
[CHECKSTYLE] Successfully parsed file <https://builds.apache.org/job/apache-atlas-nightly/ws/docs/target/checkstyle-result.xml>
with 8109 unique warnings and 0 duplicates.
[CHECKSTYLE] Successfully parsed file <https://builds.apache.org/job/apache-atlas-nightly/ws/graphdb/api/target/checkstyle-result.xml>
with 8348 unique warnings and 0 duplicates.
[CHECKSTYLE] Successfully parsed file <https://builds.apache.org/job/apache-atlas-nightly/ws/graphdb/common/target/checkstyle-result.xml>
with 8490 unique warnings and 0 duplicates.
[CHECKSTYLE] Successfully parsed file <https://builds.apache.org/job/apache-atlas-nightly/ws/graphdb/graphdb-impls/target/checkstyle-result.xml>
with 8490 unique warnings and 0 duplicates.
[CHECKSTYLE] Successfully parsed file <https://builds.apache.org/job/apache-atlas-nightly/ws/graphdb/target/checkstyle-result.xml>
with 8490 unique warnings and 0 duplicates.
[CHECKSTYLE] Successfully parsed file <https://builds.apache.org/job/apache-atlas-nightly/ws/graphdb/titan0/target/checkstyle-result.xml>
with 10713 unique warnings and 0 duplicates.
[CHECKSTYLE] Successfully parsed file <https://builds.apache.org/job/apache-atlas-nightly/ws/intg/target/checkstyle-result.xml>
with 16482 unique warnings and 0 duplicates.
[CHECKSTYLE] Successfully parsed file <https://builds.apache.org/job/apache-atlas-nightly/ws/notification/target/checkstyle-result.xml>
with 17647 unique warnings and 0 duplicates.
[CHECKSTYLE] Successfully parsed file <https://builds.apache.org/job/apache-atlas-nightly/ws/plugin-classloader/target/checkstyle-result.xml>
with 17755 unique warnings and 0 duplicates.
[CHECKSTYLE] Successfully parsed file <https://builds.apache.org/job/apache-atlas-nightly/ws/repository/target/checkstyle-result.xml>
with 31641 unique warnings and 0 duplicates.
[CHECKSTYLE] Successfully parsed file <https://builds.apache.org/job/apache-atlas-nightly/ws/server-api/target/checkstyle-result.xml>
with 32025 unique warnings and 0 duplicates.
[CHECKSTYLE] Successfully parsed file <https://builds.apache.org/job/apache-atlas-nightly/ws/shaded/hbase-client-shaded/target/checkstyle-result.xml>
with 32025 unique warnings and 0 duplicates.
[CHECKSTYLE] Successfully parsed file <https://builds.apache.org/job/apache-atlas-nightly/ws/shaded/hbase-server-shaded/target/checkstyle-result.xml>
with 32025 unique warnings and 0 duplicates.
[CHECKSTYLE] Successfully parsed file <https://builds.apache.org/job/apache-atlas-nightly/ws/target/checkstyle-result.xml>
with 32025 unique warnings and 0 duplicates.
[CHECKSTYLE] Successfully parsed file <https://builds.apache.org/job/apache-atlas-nightly/ws/titan/target/checkstyle-result.xml>
with 32487 unique warnings and 0 duplicates.
[CHECKSTYLE] Successfully parsed file <https://builds.apache.org/job/apache-atlas-nightly/ws/typesystem/target/checkstyle-result.xml>
with 36698 unique warnings and 0 duplicates.
[CHECKSTYLE] Computing warning deltas based on reference build #535
[FINDBUGS] Collecting findbugs analysis files...
[FINDBUGS] Finding all files that match the pattern **/target/findbugs.xml
[FINDBUGS] Parsing 22 files in <https://builds.apache.org/job/apache-atlas-nightly/ws/>
[FINDBUGS] Successfully parsed file <https://builds.apache.org/job/apache-atlas-nightly/ws/addons/falcon-bridge-shim/target/findbugs.xml>
with 0 unique warnings and 0 duplicates.
[FINDBUGS] Successfully parsed file <https://builds.apache.org/job/apache-atlas-nightly/ws/addons/falcon-bridge/target/findbugs.xml>
with 0 unique warnings and 0 duplicates.
[FINDBUGS] Successfully parsed file <https://builds.apache.org/job/apache-atlas-nightly/ws/addons/hive-bridge-shim/target/findbugs.xml>
with 0 unique warnings and 0 duplicates.
[FINDBUGS] Successfully parsed file <https://builds.apache.org/job/apache-atlas-nightly/ws/addons/hive-bridge/target/findbugs.xml>
with 0 unique warnings and 0 duplicates.
[FINDBUGS] Successfully parsed file <https://builds.apache.org/job/apache-atlas-nightly/ws/addons/sqoop-bridge-shim/target/findbugs.xml>
with 0 unique warnings and 0 duplicates.
[FINDBUGS] Successfully parsed file <https://builds.apache.org/job/apache-atlas-nightly/ws/addons/sqoop-bridge/target/findbugs.xml>
with 0 unique warnings and 0 duplicates.
[FINDBUGS] Successfully parsed file <https://builds.apache.org/job/apache-atlas-nightly/ws/addons/storm-bridge-shim/target/findbugs.xml>
with 0 unique warnings and 0 duplicates.
[FINDBUGS] Successfully parsed file <https://builds.apache.org/job/apache-atlas-nightly/ws/addons/storm-bridge/target/findbugs.xml>
with 0 unique warnings and 0 duplicates.
[FINDBUGS] Successfully parsed file <https://builds.apache.org/job/apache-atlas-nightly/ws/authorization/target/findbugs.xml>
with 0 unique warnings and 0 duplicates.
[FINDBUGS] Successfully parsed file <https://builds.apache.org/job/apache-atlas-nightly/ws/catalog/target/findbugs.xml>
with 0 unique warnings and 0 duplicates.
[FINDBUGS] Successfully parsed file <https://builds.apache.org/job/apache-atlas-nightly/ws/client/target/findbugs.xml>
with 0 unique warnings and 0 duplicates.
[FINDBUGS] Successfully parsed file <https://builds.apache.org/job/apache-atlas-nightly/ws/common/target/findbugs.xml>
with 0 unique warnings and 0 duplicates.
[FINDBUGS] Successfully parsed file <https://builds.apache.org/job/apache-atlas-nightly/ws/graphdb/api/target/findbugs.xml>
with 0 unique warnings and 0 duplicates.
[FINDBUGS] Successfully parsed file <https://builds.apache.org/job/apache-atlas-nightly/ws/graphdb/common/target/findbugs.xml>
with 0 unique warnings and 0 duplicates.
[FINDBUGS] Successfully parsed file <https://builds.apache.org/job/apache-atlas-nightly/ws/graphdb/titan0/target/findbugs.xml>
with 0 unique warnings and 0 duplicates.
[FINDBUGS] Successfully parsed file <https://builds.apache.org/job/apache-atlas-nightly/ws/intg/target/findbugs.xml>
with 0 unique warnings and 0 duplicates.
[FINDBUGS] Successfully parsed file <https://builds.apache.org/job/apache-atlas-nightly/ws/notification/target/findbugs.xml>
with 0 unique warnings and 0 duplicates.
[FINDBUGS] Successfully parsed file <https://builds.apache.org/job/apache-atlas-nightly/ws/plugin-classloader/target/findbugs.xml>
with 0 unique warnings and 0 duplicates.
[FINDBUGS] Successfully parsed file <https://builds.apache.org/job/apache-atlas-nightly/ws/repository/target/findbugs.xml>
with 0 unique warnings and 0 duplicates.
[FINDBUGS] Successfully parsed file <https://builds.apache.org/job/apache-atlas-nightly/ws/server-api/target/findbugs.xml>
with 0 unique warnings and 0 duplicates.
[FINDBUGS] Successfully parsed file <https://builds.apache.org/job/apache-atlas-nightly/ws/titan/target/findbugs.xml>
with 0 unique warnings and 0 duplicates.
[FINDBUGS] Successfully parsed file <https://builds.apache.org/job/apache-atlas-nightly/ws/typesystem/target/findbugs.xml>
with 0 unique warnings and 0 duplicates.
[FINDBUGS] Computing warning deltas based on reference build #535
Archiving artifacts
Compressed 567.58 MB of artifacts by 64.6% relative to #535
TestNG Reports Processing: START
Looking for TestNG results report in workspace using pattern: **/target/surefire-reports/testng-results.xml,**/target/failsafe-reports/testng-results.xml
testng-results.xml was last modified before this build started. Ignoring it.
testng-results.xml was last modified before this build started. Ignoring it.
testng-results.xml was last modified before this build started. Ignoring it.
testng-results.xml was last modified before this build started. Ignoring it.
testng-results.xml was last modified before this build started. Ignoring it.
testng-results.xml was last modified before this build started. Ignoring it.
testng-results.xml was last modified before this build started. Ignoring it.
Saving reports...
Processing '/x1/jenkins/jenkins-home/jobs/apache-atlas-nightly/builds/632/testng/testng-results-1.xml'
Processing '/x1/jenkins/jenkins-home/jobs/apache-atlas-nightly/builds/632/testng/testng-results-10.xml'
Processing '/x1/jenkins/jenkins-home/jobs/apache-atlas-nightly/builds/632/testng/testng-results-2.xml'
Processing '/x1/jenkins/jenkins-home/jobs/apache-atlas-nightly/builds/632/testng/testng-results-3.xml'
Processing '/x1/jenkins/jenkins-home/jobs/apache-atlas-nightly/builds/632/testng/testng-results-4.xml'
Processing '/x1/jenkins/jenkins-home/jobs/apache-atlas-nightly/builds/632/testng/testng-results-5.xml'
Processing '/x1/jenkins/jenkins-home/jobs/apache-atlas-nightly/builds/632/testng/testng-results-6.xml'
Processing '/x1/jenkins/jenkins-home/jobs/apache-atlas-nightly/builds/632/testng/testng-results-7.xml'
Processing '/x1/jenkins/jenkins-home/jobs/apache-atlas-nightly/builds/632/testng/testng-results-8.xml'
Processing '/x1/jenkins/jenkins-home/jobs/apache-atlas-nightly/builds/632/testng/testng-results-9.xml'
Processing '/x1/jenkins/jenkins-home/jobs/apache-atlas-nightly/builds/632/testng/testng-results.xml'
3.571429% of tests failed, which exceeded threshold of 0%. Marking build as UNSTABLE
TestNG Reports Processing: FINISH

Mime
View raw message