atlas-dev mailing list archives

Site index · List index
Message view « Date » · « Thread »
Top « Date » · « Thread »
From Apache Jenkins Server <jenk...@builds.apache.org>
Subject Build failed in Jenkins: apache-atlas-nightly #565
Date Wed, 25 Jan 2017 20:09:48 GMT
See <https://builds.apache.org/job/apache-atlas-nightly/565/changes>

Changes:

[madhan] ATLAS-1403: Perf and stability improvements to DSL search and lineage

------------------------------------------
[...truncated 5607 lines...]

testOutputsGraphForEntity(org.apache.atlas.web.resources.EntityLineageJerseyResourceIT)  Time
elapsed: 0.019 sec  <<< FAILURE!
org.apache.atlas.AtlasServiceException: Metadata service API org.apache.atlas.AtlasBaseClient$APIInfo@27b599cd
failed with status 404 (Not Found) Response Body ({"error":"Could not find an entity in the
repository with Referenceable.qualifiedName = sales_factl7mdCoWp9A, __typeName = hive_table,
__state = ACTIVE, "})

testSchema(org.apache.atlas.web.resources.EntityLineageJerseyResourceIT)  Time elapsed: 0.008
sec  <<< FAILURE!
org.apache.atlas.AtlasServiceException: Metadata service API org.apache.atlas.AtlasBaseClient$APIInfo@6d65651c
failed with status 404 (Not Found) Response Body ({"error":"Dataset with name = sales_factl7mdCoWp9A
does not exist"})

testSchemaForEntity(org.apache.atlas.web.resources.EntityLineageJerseyResourceIT)  Time elapsed:
0.012 sec  <<< FAILURE!
org.apache.atlas.AtlasServiceException: Metadata service API org.apache.atlas.AtlasBaseClient$APIInfo@6afd9125
failed with status 404 (Not Found) Response Body ({"error":"Could not find an entity in the
repository with Referenceable.qualifiedName = sales_factl7mdCoWp9A, __typeName = hive_table,
__state = ACTIVE, "})

Running org.apache.atlas.CredentialProviderUtilityIT
Tests run: 4, Failures: 0, Errors: 0, Skipped: 0, Time elapsed: 9.04 sec - in org.apache.atlas.CredentialProviderUtilityIT
Running org.apache.atlas.notification.EntityNotificationIT
127.0.0.1 - - [25/Jan/2017:20:02:41 +0000] "GET /api/atlas/types/tableType HTTP/1.1" 200 -
"-" "Java/1.7.0_80"
127.0.0.1 - - [25/Jan/2017:20:02:42 +0000] "GET /api/atlas/types/serdeType HTTP/1.1" 200 -
"-" "Java/1.7.0_80"
127.0.0.1 - - [25/Jan/2017:20:02:42 +0000] "GET /api/atlas/types/classification HTTP/1.1"
200 - "-" "Java/1.7.0_80"
127.0.0.1 - - [25/Jan/2017:20:02:42 +0000] "GET /api/atlas/types/hive_db HTTP/1.1" 200 - "-"
"Java/1.7.0_80"
127.0.0.1 - - [25/Jan/2017:20:02:43 +0000] "POST /api/atlas/entities HTTP/1.1" 201 - "-" "Java/1.7.0_80"
127.0.0.1 - - [25/Jan/2017:20:02:46 +0000] "POST /api/atlas/entities HTTP/1.1" 201 - "-" "Java/1.7.0_80"
127.0.0.1 - - [25/Jan/2017:20:02:49 +0000] "POST /api/atlas/types HTTP/1.1" 201 - "-" "Java/1.7.0_80"
127.0.0.1 - - [25/Jan/2017:20:02:50 +0000] "POST /api/atlas/types HTTP/1.1" 201 - "-" "Java/1.7.0_80"
127.0.0.1 - - [25/Jan/2017:20:02:50 +0000] "POST /api/atlas/types HTTP/1.1" 201 - "-" "Java/1.7.0_80"
127.0.0.1 - - [25/Jan/2017:20:02:50 +0000] "POST /api/atlas/entities/0145227e-0b39-4ca7-b512-06e4d2d8d50a/traits
HTTP/1.1" 201 - "-" "Java/1.7.0_80"
127.0.0.1 - - [25/Jan/2017:20:02:50 +0000] "POST /api/atlas/types HTTP/1.1" 201 - "-" "Java/1.7.0_80"
127.0.0.1 - - [25/Jan/2017:20:02:50 +0000] "POST /api/atlas/entities/0145227e-0b39-4ca7-b512-06e4d2d8d50a/traits
HTTP/1.1" 201 - "-" "Java/1.7.0_80"
127.0.0.1 - - [25/Jan/2017:20:02:50 +0000] "DELETE /api/atlas/entities/0145227e-0b39-4ca7-b512-06e4d2d8d50a/traits/TraitQiIdevzl6l
HTTP/1.1" 200 - "-" "Java/1.7.0_80"
127.0.0.1 - - [25/Jan/2017:20:02:50 +0000] "POST /api/atlas/entities/0145227e-0b39-4ca7-b512-06e4d2d8d50a?property=description
HTTP/1.1" 200 - "-" "Java/1.7.0_80"
127.0.0.1 - - [25/Jan/2017:20:02:50 +0000] "POST /api/atlas/entities HTTP/1.1" 201 - "-" "Java/1.7.0_80"
127.0.0.1 - - [25/Jan/2017:20:02:50 +0000] "POST /api/atlas/entities HTTP/1.1" 201 - "-" "Java/1.7.0_80"
127.0.0.1 - - [25/Jan/2017:20:02:50 +0000] "DELETE /api/atlas/entities?type=hive_table&property=qualifiedName&value=table-VeTks9hYbd
HTTP/1.1" 200 - "-" "Java/1.7.0_80"
Tests run: 5, Failures: 0, Errors: 0, Skipped: 0, Time elapsed: 25.93 sec - in org.apache.atlas.notification.EntityNotificationIT
Running org.apache.atlas.notification.NotificationHookConsumerIT
127.0.0.1 - - [25/Jan/2017:20:03:08 +0000] "GET /api/atlas/types/tableType HTTP/1.1" 200 -
"-" "Java/1.7.0_80"
127.0.0.1 - - [25/Jan/2017:20:03:10 +0000] "GET /api/atlas/types/serdeType HTTP/1.1" 200 -
"-" "Java/1.7.0_80"
127.0.0.1 - - [25/Jan/2017:20:03:10 +0000] "GET /api/atlas/types/classification HTTP/1.1"
200 - "-" "Java/1.7.0_80"
127.0.0.1 - - [25/Jan/2017:20:03:10 +0000] "GET /api/atlas/types/hive_db HTTP/1.1" 200 - "-"
"Java/1.7.0_80"
127.0.0.1 - - [25/Jan/2017:20:03:15 +0000] "GET /api/atlas/discovery/search/dsl?query=hive_db+where+qualifiedName%3D'dbCYDwp2tyAE'&limit=10&offset=0
HTTP/1.1" 200 - "-" "Java/1.7.0_80"
127.0.0.1 - - [25/Jan/2017:20:03:16 +0000] "GET /api/atlas/entities?type=hive_db&property=qualifiedName&value=dbCYDwp2tyAE
HTTP/1.1" 200 - "-" "Java/1.7.0_80"
127.0.0.1 - - [25/Jan/2017:20:03:16 +0000] "GET /api/atlas/entities/99ee7395-21fc-447c-9b64-991953e972ac/audit?count=1
HTTP/1.1" 200 - "-" "Java/1.7.0_80"
127.0.0.1 - - [25/Jan/2017:20:03:16 +0000] "POST /api/atlas/entities HTTP/1.1" 201 - "-" "Java/1.7.0_80"
127.0.0.1 - - [25/Jan/2017:20:03:16 +0000] "GET /api/atlas/entities/d4db42fa-fa6e-443c-a597-c17939c581bb
HTTP/1.1" 200 - "-" "Java/1.7.0_80"
127.0.0.1 - - [25/Jan/2017:20:03:16 +0000] "GET /api/atlas/entities/d4db42fa-fa6e-443c-a597-c17939c581bb
HTTP/1.1" 200 - "-" "Java/1.7.0_80"
127.0.0.1 - - [25/Jan/2017:20:03:16 +0000] "GET /api/atlas/discovery/search/dsl?query=hive_db+where+name%3D'dbnBReVh60SH'&limit=10&offset=0
HTTP/1.1" 200 - "-" "Java/1.7.0_80"
127.0.0.1 - - [25/Jan/2017:20:03:18 +0000] "POST /api/atlas/entities HTTP/1.1" 201 - "-" "Java/1.7.0_80"
127.0.0.1 - - [25/Jan/2017:20:03:18 +0000] "GET /api/atlas/discovery/search/dsl?query=hive_db+where+qualifiedName%3D'dbumb33vHjtN'&limit=10&offset=0
HTTP/1.1" 200 - "-" "Java/1.7.0_80"
127.0.0.1 - - [25/Jan/2017:20:03:19 +0000] "GET /api/atlas/entities?type=hive_db&property=qualifiedName&value=dbumb33vHjtN
HTTP/1.1" 200 - "-" "Java/1.7.0_80"
127.0.0.1 - - [25/Jan/2017:20:03:19 +0000] "POST /api/atlas/entities HTTP/1.1" 201 - "-" "Java/1.7.0_80"
127.0.0.1 - - [25/Jan/2017:20:03:19 +0000] "GET /api/atlas/entities?type=hive_db&property=qualifiedName&value=dbDrZfBLDhwe
HTTP/1.1" 200 - "-" "Java/1.7.0_80"
127.0.0.1 - - [25/Jan/2017:20:03:19 +0000] "GET /api/atlas/entities?type=hive_db&property=qualifiedName&value=dbDrZfBLDhwe
HTTP/1.1" 200 - "-" "Java/1.7.0_80"
127.0.0.1 - - [25/Jan/2017:20:03:20 +0000] "GET /api/atlas/entities?type=hive_db&property=qualifiedName&value=dbDrZfBLDhwe
HTTP/1.1" 200 - "-" "Java/1.7.0_80"
127.0.0.1 - - [25/Jan/2017:20:03:20 +0000] "POST /api/atlas/entities HTTP/1.1" 201 - "-" "Java/1.7.0_80"
127.0.0.1 - - [25/Jan/2017:20:03:20 +0000] "GET /api/atlas/discovery/search/dsl?query=hive_db+where+qualifiedName%3D'dbtaSFOujVys'&limit=10&offset=0
HTTP/1.1" 200 - "-" "Java/1.7.0_80"
127.0.0.1 - - [25/Jan/2017:20:03:21 +0000] "GET /api/atlas/discovery/search/dsl?query=hive_db+where+qualifiedName%3D'dbB42luJl8dU'&limit=10&offset=0
HTTP/1.1" 200 - "-" "Java/1.7.0_80"
Tests run: 6, Failures: 1, Errors: 0, Skipped: 0, Time elapsed: 29.34 sec <<< FAILURE!
- in org.apache.atlas.notification.NotificationHookConsumerIT
testUpdatePartialUpdatingQualifiedName(org.apache.atlas.notification.NotificationHookConsumerIT)
 Time elapsed: 2.643 sec  <<< FAILURE!
java.lang.AssertionError: expected:<0> but was:<1>
	at org.apache.atlas.notification.NotificationHookConsumerIT.testUpdatePartialUpdatingQualifiedName(NotificationHookConsumerIT.java:170)


Results :

Failed tests: 
  QuickStartIT.testLineageIsMaintained:126 » AtlasService Metadata service API o...
  NotificationHookConsumerIT.testUpdatePartialUpdatingQualifiedName:170 expected:<0>
but was:<1>
  DataSetLineageJerseyResourceIT.setUp:57->setupInstances:208->table:277->BaseResourceIT.createInstance:191
» AtlasService
  EntityJerseyResourceIT.testCompleteUpdate:742 » AtlasService Metadata service ...
org.apache.atlas.web.resources.EntityJerseyResourceIT.testEntityInvalidValue(org.apache.atlas.web.resources.EntityJerseyResourceIT)
  Run 1: EntityJerseyResourceIT.testEntityInvalidValue:283 expected:<Bad Request> but
was:<Internal Server Error>
  Run 2: EntityJerseyResourceIT.testEntityInvalidValue:283 expected:<Bad Request> but
was:<Internal Server Error>

  EntityJerseyResourceIT.testPartialUpdate:676 » AtlasService Metadata service A...
  EntityJerseyResourceIT.testUTF8:643->BaseResourceIT.createType:177->BaseResourceIT.createType:182
» AtlasService
  EntityLineageJerseyResourceIT.setUp:61->DataSetLineageJerseyResourceIT.setUp:57->DataSetLineageJerseyResourceIT.setupInstances:208->DataSetLineageJerseyResourceIT.table:277->BaseResourceIT.createInstance:191
» AtlasService
  EntityLineageJerseyResourceIT>DataSetLineageJerseyResourceIT.testInputsGraph:62 »
IllegalArgument
  EntityLineageJerseyResourceIT>DataSetLineageJerseyResourceIT.testInputsGraphForEntity:81
» IllegalArgument
  EntityLineageJerseyResourceIT>DataSetLineageJerseyResourceIT.testOutputsGraph:98 »
AtlasService
  EntityLineageJerseyResourceIT>DataSetLineageJerseyResourceIT.testOutputsGraphForEntity:117
» AtlasService
  EntityLineageJerseyResourceIT>DataSetLineageJerseyResourceIT.testSchema:134 » AtlasService
  EntityLineageJerseyResourceIT>DataSetLineageJerseyResourceIT.testSchemaForEntity:159
» AtlasService
  EntityV2JerseyResourceIT.testAddNullPropertyValue:274 NullPointer
  EntityV2JerseyResourceIT.testDeleteEntities:643->BaseResourceIT.createEntity:238->BaseResourceIT.modifyEntity:228
expected object to not be null
  EntityV2JerseyResourceIT.testDeleteEntityByUniqAttribute:666->createHiveDB:368->BaseResourceIT.createEntity:238->BaseResourceIT.modifyEntity:228
expected object to not be null
  EntityV2JerseyResourceIT.testSubmitEntity:102->createDBAndTable:378->createHiveDB:368->BaseResourceIT.createEntity:238->BaseResourceIT.modifyEntity:228
expected object to not be null
  EntityV2JerseyResourceIT.testSubmitEntityWithBadDateFormat:230->BaseResourceIT.createEntity:238->BaseResourceIT.modifyEntity:228
expected object to not be null
  EntityV2JerseyResourceIT.testUTF8:552->BaseResourceIT.createEntity:238->BaseResourceIT.modifyEntity:228
expected object to not be null

Tests run: 129, Failures: 20, Errors: 0, Skipped: 21

[INFO] 
[INFO] --- jetty-maven-plugin:9.2.12.v20150709:stop (stop-jetty) @ atlas-webapp ---
[INFO] Waiting 10 seconds for jetty to stop
[INFO] Stopped ServerConnector@7c2a28a0{HTTP/1.1}{0.0.0.0:31000}
[INFO] Closing Spring root WebApplicationContext
[INFO] Shutting down log4j
[INFO] Stopped o.e.j.m.p.JettyWebAppContext@69840ca1{/,<https://builds.apache.org/job/apache-atlas-nightly/ws/webapp/target/atlas-webapp-0.8-incubating-SNAPSHOT/,UNAVAILABLE}{/home/jenkins/jenkins-slave/workspace/apache-atlas-nightly/webapp/target/atlas-webapp-0.8-incubating-SNAPSHOT.war}>
[INFO] Server reports itself as stopped
[INFO] 
[INFO] --- maven-source-plugin:2.4:jar-no-fork (attach-sources) @ atlas-webapp ---
[INFO] Building jar: <https://builds.apache.org/job/apache-atlas-nightly/ws/webapp/target/atlas-webapp-0.8-incubating-SNAPSHOT-sources.jar>
log4j:WARN No appenders could be found for logger (org.apache.zookeeper.ClientCnxn).
log4j:WARN Please initialize the log4j system properly.
log4j:WARN See http://logging.apache.org/log4j/1.2/faq.html#noconfig for more info.
[INFO] 
[INFO] --- maven-source-plugin:2.4:test-jar-no-fork (attach-sources) @ atlas-webapp ---
[INFO] Building jar: <https://builds.apache.org/job/apache-atlas-nightly/ws/webapp/target/atlas-webapp-0.8-incubating-SNAPSHOT-test-sources.jar>
[INFO] 
[INFO] --- maven-failsafe-plugin:2.19.1:verify (verify) @ atlas-webapp ---
[INFO] ------------------------------------------------------------------------
[INFO] Reactor Summary:
[INFO] 
[INFO] Apache Atlas Server Build Tools .................... SUCCESS [  1.508 s]
[INFO] apache-atlas ....................................... SUCCESS [ 10.171 s]
[INFO] Apache Atlas Integration ........................... SUCCESS [ 51.712 s]
[INFO] Apache Atlas Common ................................ SUCCESS [ 17.906 s]
[INFO] Apache Atlas Typesystem ............................ SUCCESS [01:35 min]
[INFO] Apache Atlas Client ................................ SUCCESS [ 22.252 s]
[INFO] Apache Atlas Server API ............................ SUCCESS [ 11.879 s]
[INFO] Apache Atlas Notification .......................... SUCCESS [ 46.112 s]
[INFO] Apache Atlas Graph Database Projects ............... SUCCESS [  0.667 s]
[INFO] Apache Atlas Graph Database API .................... SUCCESS [  7.773 s]
[INFO] Graph Database Common Code ......................... SUCCESS [  7.666 s]
[INFO] Shaded version of Apache hbase client .............. SUCCESS [ 11.113 s]
[INFO] Apache Atlas Titan 0.5.4 Graph DB Impl ............. SUCCESS [04:07 min]
[INFO] Apache Atlas Graph Database Implementation Dependencies SUCCESS [  2.207 s]
[INFO] Shaded version of Apache hbase server .............. SUCCESS [01:28 min]
[INFO] Apache Atlas Repository ............................ SUCCESS [25:11 min]
[INFO] Apache Atlas Authorization ......................... SUCCESS [ 16.674 s]
[INFO] Apache Atlas Business Catalog ...................... SUCCESS [ 36.424 s]
[INFO] Apache Atlas UI .................................... SUCCESS [ 58.909 s]
[INFO] Apache Atlas Web Application ....................... FAILURE [11:33 min]
[INFO] Apache Atlas Documentation ......................... SKIPPED
[INFO] Apache Atlas FileSystem Model ...................... SKIPPED
[INFO] Apache Atlas Plugin Classloader .................... SKIPPED
[INFO] Apache Atlas Hive Bridge Shim ...................... SKIPPED
[INFO] Apache Atlas Hive Bridge ........................... SKIPPED
[INFO] Apache Atlas Falcon Bridge Shim .................... SKIPPED
[INFO] Apache Atlas Falcon Bridge ......................... SKIPPED
[INFO] Apache Atlas Sqoop Bridge Shim ..................... SKIPPED
[INFO] Apache Atlas Sqoop Bridge .......................... SKIPPED
[INFO] Apache Atlas Storm Bridge Shim ..................... SKIPPED
[INFO] Apache Atlas Storm Bridge .......................... SKIPPED
[INFO] Apache Atlas Distribution .......................... SKIPPED
[INFO] ------------------------------------------------------------------------
[INFO] BUILD FAILURE
[INFO] ------------------------------------------------------------------------
[INFO] Total time: 49:01 min
[INFO] Finished at: 2017-01-25T20:03:31+00:00
[INFO] Final Memory: 333M/1623M
[INFO] ------------------------------------------------------------------------
[ERROR] Failed to execute goal org.apache.maven.plugins:maven-failsafe-plugin:2.19.1:verify
(verify) on project atlas-webapp: There are test failures.
[ERROR] 
[ERROR] Please refer to <https://builds.apache.org/job/apache-atlas-nightly/ws/webapp/target/failsafe-reports>
for the individual test results.
[ERROR] -> [Help 1]
[ERROR] 
[ERROR] To see the full stack trace of the errors, re-run Maven with the -e switch.
[ERROR] Re-run Maven using the -X switch to enable full debug logging.
[ERROR] 
[ERROR] For more information about the errors and possible solutions, please read the following
articles:
[ERROR] [Help 1] http://cwiki.apache.org/confluence/display/MAVEN/MojoFailureException
[ERROR] 
[ERROR] After correcting the problems, you can resume the build with the command
[ERROR]   mvn <goals> -rf :atlas-webapp
Build step 'Execute shell' marked build as failure
[CHECKSTYLE] Collecting checkstyle analysis files...
[CHECKSTYLE] Finding all files that match the pattern **/target/checkstyle-result.xml
[CHECKSTYLE] Parsing 31 files in <https://builds.apache.org/job/apache-atlas-nightly/ws/>
[CHECKSTYLE] Successfully parsed file <https://builds.apache.org/job/apache-atlas-nightly/ws/addons/falcon-bridge-shim/target/checkstyle-result.xml>
with 29 unique warnings and 0 duplicates.
[CHECKSTYLE] Successfully parsed file <https://builds.apache.org/job/apache-atlas-nightly/ws/addons/falcon-bridge/target/checkstyle-result.xml>
with 420 unique warnings and 0 duplicates.
[CHECKSTYLE] Successfully parsed file <https://builds.apache.org/job/apache-atlas-nightly/ws/addons/hdfs-model/target/checkstyle-result.xml>
with 420 unique warnings and 0 duplicates.
[CHECKSTYLE] Successfully parsed file <https://builds.apache.org/job/apache-atlas-nightly/ws/addons/hive-bridge-shim/target/checkstyle-result.xml>
with 435 unique warnings and 0 duplicates.
[CHECKSTYLE] Successfully parsed file <https://builds.apache.org/job/apache-atlas-nightly/ws/addons/hive-bridge/target/checkstyle-result.xml>
with 2228 unique warnings and 0 duplicates.
[CHECKSTYLE] Successfully parsed file <https://builds.apache.org/job/apache-atlas-nightly/ws/addons/sqoop-bridge-shim/target/checkstyle-result.xml>
with 2244 unique warnings and 0 duplicates.
[CHECKSTYLE] Successfully parsed file <https://builds.apache.org/job/apache-atlas-nightly/ws/addons/sqoop-bridge/target/checkstyle-result.xml>
with 2369 unique warnings and 0 duplicates.
[CHECKSTYLE] Successfully parsed file <https://builds.apache.org/job/apache-atlas-nightly/ws/addons/storm-bridge-shim/target/checkstyle-result.xml>
with 2390 unique warnings and 0 duplicates.
[CHECKSTYLE] Successfully parsed file <https://builds.apache.org/job/apache-atlas-nightly/ws/addons/storm-bridge/target/checkstyle-result.xml>
with 2659 unique warnings and 0 duplicates.
[CHECKSTYLE] Successfully parsed file <https://builds.apache.org/job/apache-atlas-nightly/ws/authorization/target/checkstyle-result.xml>
with 3116 unique warnings and 0 duplicates.
[CHECKSTYLE] Successfully parsed file <https://builds.apache.org/job/apache-atlas-nightly/ws/catalog/target/checkstyle-result.xml>
with 5248 unique warnings and 0 duplicates.
[CHECKSTYLE] Successfully parsed file <https://builds.apache.org/job/apache-atlas-nightly/ws/client/target/checkstyle-result.xml>
with 6853 unique warnings and 0 duplicates.
[CHECKSTYLE] Successfully parsed file <https://builds.apache.org/job/apache-atlas-nightly/ws/common/target/checkstyle-result.xml>
with 7678 unique warnings and 0 duplicates.
[CHECKSTYLE] Successfully parsed file <https://builds.apache.org/job/apache-atlas-nightly/ws/dashboardv2/target/checkstyle-result.xml>
with 7678 unique warnings and 0 duplicates.
[CHECKSTYLE] Successfully parsed file <https://builds.apache.org/job/apache-atlas-nightly/ws/distro/target/checkstyle-result.xml>
with 7678 unique warnings and 0 duplicates.
[CHECKSTYLE] Successfully parsed file <https://builds.apache.org/job/apache-atlas-nightly/ws/docs/target/checkstyle-result.xml>
with 7678 unique warnings and 0 duplicates.
[CHECKSTYLE] Successfully parsed file <https://builds.apache.org/job/apache-atlas-nightly/ws/graphdb/api/target/checkstyle-result.xml>
with 7906 unique warnings and 0 duplicates.
[CHECKSTYLE] Successfully parsed file <https://builds.apache.org/job/apache-atlas-nightly/ws/graphdb/common/target/checkstyle-result.xml>
with 8048 unique warnings and 0 duplicates.
[CHECKSTYLE] Successfully parsed file <https://builds.apache.org/job/apache-atlas-nightly/ws/graphdb/graphdb-impls/target/checkstyle-result.xml>
with 8048 unique warnings and 0 duplicates.
[CHECKSTYLE] Successfully parsed file <https://builds.apache.org/job/apache-atlas-nightly/ws/graphdb/target/checkstyle-result.xml>
with 8048 unique warnings and 0 duplicates.
[CHECKSTYLE] Successfully parsed file <https://builds.apache.org/job/apache-atlas-nightly/ws/graphdb/titan0/target/checkstyle-result.xml>
with 10261 unique warnings and 0 duplicates.
[CHECKSTYLE] Successfully parsed file <https://builds.apache.org/job/apache-atlas-nightly/ws/intg/target/checkstyle-result.xml>
with 15146 unique warnings and 0 duplicates.
[CHECKSTYLE] Successfully parsed file <https://builds.apache.org/job/apache-atlas-nightly/ws/notification/target/checkstyle-result.xml>
with 16307 unique warnings and 0 duplicates.
[CHECKSTYLE] Successfully parsed file <https://builds.apache.org/job/apache-atlas-nightly/ws/plugin-classloader/target/checkstyle-result.xml>
with 16415 unique warnings and 0 duplicates.
[CHECKSTYLE] Successfully parsed file <https://builds.apache.org/job/apache-atlas-nightly/ws/repository/target/checkstyle-result.xml>
with 26715 unique warnings and 0 duplicates.
[CHECKSTYLE] Successfully parsed file <https://builds.apache.org/job/apache-atlas-nightly/ws/server-api/target/checkstyle-result.xml>
with 27095 unique warnings and 0 duplicates.
[CHECKSTYLE] Successfully parsed file <https://builds.apache.org/job/apache-atlas-nightly/ws/shaded/hbase-client-shaded/target/checkstyle-result.xml>
with 27095 unique warnings and 0 duplicates.
[CHECKSTYLE] Successfully parsed file <https://builds.apache.org/job/apache-atlas-nightly/ws/shaded/hbase-server-shaded/target/checkstyle-result.xml>
with 27095 unique warnings and 0 duplicates.
[CHECKSTYLE] Successfully parsed file <https://builds.apache.org/job/apache-atlas-nightly/ws/target/checkstyle-result.xml>
with 27095 unique warnings and 0 duplicates.
[CHECKSTYLE] Successfully parsed file <https://builds.apache.org/job/apache-atlas-nightly/ws/titan/target/checkstyle-result.xml>
with 27557 unique warnings and 0 duplicates.
[CHECKSTYLE] Successfully parsed file <https://builds.apache.org/job/apache-atlas-nightly/ws/typesystem/target/checkstyle-result.xml>
with 31741 unique warnings and 0 duplicates.
[CHECKSTYLE] Computing warning deltas based on reference build #535
[FINDBUGS] Collecting findbugs analysis files...
[FINDBUGS] Finding all files that match the pattern **/target/findbugs.xml
[FINDBUGS] Parsing 22 files in <https://builds.apache.org/job/apache-atlas-nightly/ws/>
[FINDBUGS] Successfully parsed file <https://builds.apache.org/job/apache-atlas-nightly/ws/addons/falcon-bridge-shim/target/findbugs.xml>
with 0 unique warnings and 0 duplicates.
[FINDBUGS] Successfully parsed file <https://builds.apache.org/job/apache-atlas-nightly/ws/addons/falcon-bridge/target/findbugs.xml>
with 0 unique warnings and 0 duplicates.
[FINDBUGS] Successfully parsed file <https://builds.apache.org/job/apache-atlas-nightly/ws/addons/hive-bridge-shim/target/findbugs.xml>
with 0 unique warnings and 0 duplicates.
[FINDBUGS] Successfully parsed file <https://builds.apache.org/job/apache-atlas-nightly/ws/addons/hive-bridge/target/findbugs.xml>
with 0 unique warnings and 0 duplicates.
[FINDBUGS] Successfully parsed file <https://builds.apache.org/job/apache-atlas-nightly/ws/addons/sqoop-bridge-shim/target/findbugs.xml>
with 0 unique warnings and 0 duplicates.
[FINDBUGS] Successfully parsed file <https://builds.apache.org/job/apache-atlas-nightly/ws/addons/sqoop-bridge/target/findbugs.xml>
with 0 unique warnings and 0 duplicates.
[FINDBUGS] Successfully parsed file <https://builds.apache.org/job/apache-atlas-nightly/ws/addons/storm-bridge-shim/target/findbugs.xml>
with 0 unique warnings and 0 duplicates.
[FINDBUGS] Successfully parsed file <https://builds.apache.org/job/apache-atlas-nightly/ws/addons/storm-bridge/target/findbugs.xml>
with 0 unique warnings and 0 duplicates.
[FINDBUGS] Successfully parsed file <https://builds.apache.org/job/apache-atlas-nightly/ws/authorization/target/findbugs.xml>
with 0 unique warnings and 0 duplicates.
[FINDBUGS] Successfully parsed file <https://builds.apache.org/job/apache-atlas-nightly/ws/catalog/target/findbugs.xml>
with 0 unique warnings and 0 duplicates.
[FINDBUGS] Successfully parsed file <https://builds.apache.org/job/apache-atlas-nightly/ws/client/target/findbugs.xml>
with 0 unique warnings and 0 duplicates.
[FINDBUGS] Successfully parsed file <https://builds.apache.org/job/apache-atlas-nightly/ws/common/target/findbugs.xml>
with 0 unique warnings and 0 duplicates.
[FINDBUGS] Successfully parsed file <https://builds.apache.org/job/apache-atlas-nightly/ws/graphdb/api/target/findbugs.xml>
with 0 unique warnings and 0 duplicates.
[FINDBUGS] Successfully parsed file <https://builds.apache.org/job/apache-atlas-nightly/ws/graphdb/common/target/findbugs.xml>
with 0 unique warnings and 0 duplicates.
[FINDBUGS] Successfully parsed file <https://builds.apache.org/job/apache-atlas-nightly/ws/graphdb/titan0/target/findbugs.xml>
with 0 unique warnings and 0 duplicates.
[FINDBUGS] Successfully parsed file <https://builds.apache.org/job/apache-atlas-nightly/ws/intg/target/findbugs.xml>
with 0 unique warnings and 0 duplicates.
[FINDBUGS] Successfully parsed file <https://builds.apache.org/job/apache-atlas-nightly/ws/notification/target/findbugs.xml>
with 0 unique warnings and 0 duplicates.
[FINDBUGS] Successfully parsed file <https://builds.apache.org/job/apache-atlas-nightly/ws/plugin-classloader/target/findbugs.xml>
with 0 unique warnings and 0 duplicates.
[FINDBUGS] Successfully parsed file <https://builds.apache.org/job/apache-atlas-nightly/ws/repository/target/findbugs.xml>
with 0 unique warnings and 0 duplicates.
[FINDBUGS] Successfully parsed file <https://builds.apache.org/job/apache-atlas-nightly/ws/server-api/target/findbugs.xml>
with 0 unique warnings and 0 duplicates.
[FINDBUGS] Successfully parsed file <https://builds.apache.org/job/apache-atlas-nightly/ws/titan/target/findbugs.xml>
with 0 unique warnings and 0 duplicates.
[FINDBUGS] Successfully parsed file <https://builds.apache.org/job/apache-atlas-nightly/ws/typesystem/target/findbugs.xml>
with 0 unique warnings and 0 duplicates.
[FINDBUGS] Computing warning deltas based on reference build #535
Archiving artifacts
Compressed 586.05 MB of artifacts by 62.6% relative to #535
TestNG Reports Processing: START
Looking for TestNG results report in workspace using pattern: **/target/surefire-reports/testng-results.xml,**/target/failsafe-reports/testng-results.xml
testng-results.xml was last modified before this build started. Ignoring it.
testng-results.xml was last modified before this build started. Ignoring it.
testng-results.xml was last modified before this build started. Ignoring it.
testng-results.xml was last modified before this build started. Ignoring it.
testng-results.xml was last modified before this build started. Ignoring it.
testng-results.xml was last modified before this build started. Ignoring it.
testng-results.xml was last modified before this build started. Ignoring it.
Saving reports...
Processing '/x1/jenkins/jenkins-home/jobs/apache-atlas-nightly/builds/565/testng/testng-results-1.xml'
Processing '/x1/jenkins/jenkins-home/jobs/apache-atlas-nightly/builds/565/testng/testng-results-10.xml'
Processing '/x1/jenkins/jenkins-home/jobs/apache-atlas-nightly/builds/565/testng/testng-results-2.xml'
Processing '/x1/jenkins/jenkins-home/jobs/apache-atlas-nightly/builds/565/testng/testng-results-3.xml'
Processing '/x1/jenkins/jenkins-home/jobs/apache-atlas-nightly/builds/565/testng/testng-results-4.xml'
Processing '/x1/jenkins/jenkins-home/jobs/apache-atlas-nightly/builds/565/testng/testng-results-5.xml'
Processing '/x1/jenkins/jenkins-home/jobs/apache-atlas-nightly/builds/565/testng/testng-results-6.xml'
Processing '/x1/jenkins/jenkins-home/jobs/apache-atlas-nightly/builds/565/testng/testng-results-7.xml'
Processing '/x1/jenkins/jenkins-home/jobs/apache-atlas-nightly/builds/565/testng/testng-results-8.xml'
Processing '/x1/jenkins/jenkins-home/jobs/apache-atlas-nightly/builds/565/testng/testng-results-9.xml'
Processing '/x1/jenkins/jenkins-home/jobs/apache-atlas-nightly/builds/565/testng/testng-results.xml'
1.851852% of tests failed, which exceeded threshold of 0%. Marking build as UNSTABLE
TestNG Reports Processing: FINISH

Mime
View raw message