atlas-dev mailing list archives

Site index · List index
Message view « Date » · « Thread »
Top « Date » · « Thread »
From Apache Jenkins Server <jenk...@builds.apache.org>
Subject Build failed in Jenkins: apache-atlas-nightly #537
Date Thu, 05 Jan 2017 14:44:51 GMT
See <https://builds.apache.org/job/apache-atlas-nightly/537/changes>

Changes:

[dkantor] ATLAS-1379 Avoid object query overhead when report query selects class

------------------------------------------
[...truncated 5562 lines...]
127.0.0.1 - - [05/Jan/2017:14:41:32 +0000] "POST /api/atlas/entities HTTP/1.1" 201 - "-" "Java/1.7.0_80"
127.0.0.1 - - [05/Jan/2017:14:41:32 +0000] "POST /api/atlas/entities HTTP/1.1" 201 - "-" "Java/1.7.0_80"
127.0.0.1 - - [05/Jan/2017:14:41:32 +0000] "POST /api/atlas/entities HTTP/1.1" 201 - "-" "Java/1.7.0_80"
127.0.0.1 - - [05/Jan/2017:14:41:32 +0000] "GET /api/atlas/types/tableType HTTP/1.1" 200 -
"-" "Java/1.7.0_80"
127.0.0.1 - - [05/Jan/2017:14:41:32 +0000] "GET /api/atlas/types/serdeType HTTP/1.1" 200 -
"-" "Java/1.7.0_80"
127.0.0.1 - - [05/Jan/2017:14:41:32 +0000] "GET /api/atlas/types/classification HTTP/1.1"
200 - "-" "Java/1.7.0_80"
127.0.0.1 - - [05/Jan/2017:14:41:32 +0000] "GET /api/atlas/types/hive_db HTTP/1.1" 200 - "-"
"Java/1.7.0_80"
127.0.0.1 - - [05/Jan/2017:14:41:32 +0000] "POST /api/atlas/entities HTTP/1.1" 201 - "-" "Java/1.7.0_80"
127.0.0.1 - - [05/Jan/2017:14:41:32 +0000] "POST /api/atlas/entities HTTP/1.1" 201 - "-" "Java/1.7.0_80"
127.0.0.1 - - [05/Jan/2017:14:41:32 +0000] "POST /api/atlas/entities HTTP/1.1" 201 - "-" "Java/1.7.0_80"
127.0.0.1 - - [05/Jan/2017:14:41:32 +0000] "POST /api/atlas/entities HTTP/1.1" 201 - "-" "Java/1.7.0_80"
127.0.0.1 - - [05/Jan/2017:14:41:32 +0000] "POST /api/atlas/entities HTTP/1.1" 201 - "-" "Java/1.7.0_80"
127.0.0.1 - - [05/Jan/2017:14:41:33 +0000] "POST /api/atlas/entities HTTP/1.1" 201 - "-" "Java/1.7.0_80"
127.0.0.1 - - [05/Jan/2017:14:41:33 +0000] "POST /api/atlas/entities HTTP/1.1" 201 - "-" "Java/1.7.0_80"
127.0.0.1 - - [05/Jan/2017:14:41:33 +0000] "POST /api/atlas/entities HTTP/1.1" 201 - "-" "Java/1.7.0_80"
127.0.0.1 - - [05/Jan/2017:14:41:33 +0000] "GET /api/atlas/lineage/hive/table/sales_fact_monthly_mvxNXfqpGIJG/inputs/graph
HTTP/1.1" 200 - "-" "Java/1.7.0_80"
127.0.0.1 - - [05/Jan/2017:14:41:35 +0000] "GET /api/atlas/entities?type=hive_table&property=qualifiedName&value=sales_fact_monthly_mvxNXfqpGIJG
HTTP/1.1" 200 - "-" "Java/1.7.0_80"
127.0.0.1 - - [05/Jan/2017:14:41:35 +0000] "GET /api/atlas/lineage/205d21ee-136b-4890-adf2-328041c274e2/inputs/graph
HTTP/1.1" 200 - "-" "Java/1.7.0_80"
127.0.0.1 - - [05/Jan/2017:14:41:37 +0000] "GET /api/atlas/lineage/hive/table/sales_factG97z9LV89P/outputs/graph
HTTP/1.1" 200 - "-" "Java/1.7.0_80"
127.0.0.1 - - [05/Jan/2017:14:41:39 +0000] "GET /api/atlas/entities?type=hive_table&property=qualifiedName&value=sales_factG97z9LV89P
HTTP/1.1" 200 - "-" "Java/1.7.0_80"
127.0.0.1 - - [05/Jan/2017:14:41:39 +0000] "GET /api/atlas/lineage/4b1f4c1c-ed63-4813-9e57-19ddcdba73b9/outputs/graph
HTTP/1.1" 200 - "-" "Java/1.7.0_80"
127.0.0.1 - - [05/Jan/2017:14:41:40 +0000] "GET /api/atlas/lineage/hive/table/sales_factG97z9LV89P/schema
HTTP/1.1" 200 - "-" "Java/1.7.0_80"
127.0.0.1 - - [05/Jan/2017:14:41:41 +0000] "GET /api/atlas/lineage/hive/table/Sales4MaMEZUcFg/schema
HTTP/1.1" 404 - "-" "Java/1.7.0_80"
127.0.0.1 - - [05/Jan/2017:14:41:41 +0000] "GET /api/atlas/entities?type=hive_table&property=qualifiedName&value=sales_factG97z9LV89P
HTTP/1.1" 200 - "-" "Java/1.7.0_80"
127.0.0.1 - - [05/Jan/2017:14:41:41 +0000] "GET /api/atlas/lineage/4b1f4c1c-ed63-4813-9e57-19ddcdba73b9/schema
HTTP/1.1" 200 - "-" "Java/1.7.0_80"
127.0.0.1 - - [05/Jan/2017:14:41:42 +0000] "GET /api/atlas/lineage/hive/table/blah/schema
HTTP/1.1" 404 - "-" "Java/1.7.0_80"
127.0.0.1 - - [05/Jan/2017:14:41:42 +0000] "GET /api/atlas/entities?type=hive_table&property=qualifiedName&value=sales_fact_monthly_mvQhkq8xUHWz
HTTP/1.1" 200 - "-" "Java/1.7.0_80"
127.0.0.1 - - [05/Jan/2017:14:41:42 +0000] "GET /api/atlas/v2/lineage/73a92d7e-5a60-4db3-a24a-33c1a82a1423?direction=INPUT&depth=5
HTTP/1.1" 200 - "-" "Java/1.7.0_80"
127.0.0.1 - - [05/Jan/2017:14:41:43 +0000] "GET /api/atlas/entities?type=hive_table&property=qualifiedName&value=sales_fact_monthly_mvQhkq8xUHWz
HTTP/1.1" 200 - "-" "Java/1.7.0_80"
127.0.0.1 - - [05/Jan/2017:14:41:43 +0000] "GET /api/atlas/v2/lineage/73a92d7e-5a60-4db3-a24a-33c1a82a1423?direction=BOTH&depth=5
HTTP/1.1" 200 - "-" "Java/1.7.0_80"
127.0.0.1 - - [05/Jan/2017:14:41:45 +0000] "GET /api/atlas/entities?type=hive_table&property=qualifiedName&value=sales_factCMlCVG7rAt
HTTP/1.1" 200 - "-" "Java/1.7.0_80"
127.0.0.1 - - [05/Jan/2017:14:41:45 +0000] "GET /api/atlas/v2/lineage/c77420a4-c667-42f2-b6eb-28169ca115be?direction=OUTPUT&depth=5
HTTP/1.1" 200 - "-" "Java/1.7.0_80"
Tests run: 11, Failures: 0, Errors: 0, Skipped: 0, Time elapsed: 19.136 sec - in org.apache.atlas.web.resources.EntityLineageJerseyResourceIT
Running org.apache.atlas.CredentialProviderUtilityIT
Tests run: 4, Failures: 0, Errors: 0, Skipped: 0, Time elapsed: 1.896 sec - in org.apache.atlas.CredentialProviderUtilityIT
Running org.apache.atlas.notification.EntityNotificationIT
127.0.0.1 - - [05/Jan/2017:14:41:53 +0000] "GET /api/atlas/types/tableType HTTP/1.1" 200 -
"-" "Java/1.7.0_80"
127.0.0.1 - - [05/Jan/2017:14:41:53 +0000] "GET /api/atlas/types/serdeType HTTP/1.1" 200 -
"-" "Java/1.7.0_80"
127.0.0.1 - - [05/Jan/2017:14:41:53 +0000] "GET /api/atlas/types/classification HTTP/1.1"
200 - "-" "Java/1.7.0_80"
127.0.0.1 - - [05/Jan/2017:14:41:53 +0000] "GET /api/atlas/types/hive_db HTTP/1.1" 200 - "-"
"Java/1.7.0_80"
127.0.0.1 - - [05/Jan/2017:14:41:54 +0000] "POST /api/atlas/entities HTTP/1.1" 201 - "-" "Java/1.7.0_80"
127.0.0.1 - - [05/Jan/2017:14:41:55 +0000] "POST /api/atlas/entities HTTP/1.1" 201 - "-" "Java/1.7.0_80"
127.0.0.1 - - [05/Jan/2017:14:41:56 +0000] "POST /api/atlas/types HTTP/1.1" 201 - "-" "Java/1.7.0_80"
127.0.0.1 - - [05/Jan/2017:14:41:56 +0000] "POST /api/atlas/types HTTP/1.1" 201 - "-" "Java/1.7.0_80"
127.0.0.1 - - [05/Jan/2017:14:41:57 +0000] "POST /api/atlas/types HTTP/1.1" 201 - "-" "Java/1.7.0_80"
127.0.0.1 - - [05/Jan/2017:14:41:57 +0000] "POST /api/atlas/entities/b3fe4ba7-787b-4e6d-a4de-bcb7e5c93957/traits
HTTP/1.1" 201 - "-" "Java/1.7.0_80"
127.0.0.1 - - [05/Jan/2017:14:41:57 +0000] "POST /api/atlas/types HTTP/1.1" 201 - "-" "Java/1.7.0_80"
127.0.0.1 - - [05/Jan/2017:14:41:57 +0000] "POST /api/atlas/entities/b3fe4ba7-787b-4e6d-a4de-bcb7e5c93957/traits
HTTP/1.1" 201 - "-" "Java/1.7.0_80"
127.0.0.1 - - [05/Jan/2017:14:41:57 +0000] "DELETE /api/atlas/entities/b3fe4ba7-787b-4e6d-a4de-bcb7e5c93957/traits/TraitTNTiVzzsuc
HTTP/1.1" 200 - "-" "Java/1.7.0_80"
127.0.0.1 - - [05/Jan/2017:14:41:57 +0000] "POST /api/atlas/entities/b3fe4ba7-787b-4e6d-a4de-bcb7e5c93957?property=description
HTTP/1.1" 200 - "-" "Java/1.7.0_80"
127.0.0.1 - - [05/Jan/2017:14:41:57 +0000] "POST /api/atlas/entities HTTP/1.1" 201 - "-" "Java/1.7.0_80"
127.0.0.1 - - [05/Jan/2017:14:41:57 +0000] "POST /api/atlas/entities HTTP/1.1" 201 - "-" "Java/1.7.0_80"
127.0.0.1 - - [05/Jan/2017:14:41:57 +0000] "DELETE /api/atlas/entities?type=hive_table&property=qualifiedName&value=table-EbBovUz60a
HTTP/1.1" 200 - "-" "Java/1.7.0_80"
Tests run: 5, Failures: 0, Errors: 0, Skipped: 0, Time elapsed: 7.519 sec - in org.apache.atlas.notification.EntityNotificationIT
Running org.apache.atlas.notification.NotificationHookConsumerIT
127.0.0.1 - - [05/Jan/2017:14:42:01 +0000] "GET /api/atlas/types/tableType HTTP/1.1" 200 -
"-" "Java/1.7.0_80"
127.0.0.1 - - [05/Jan/2017:14:42:02 +0000] "GET /api/atlas/types/serdeType HTTP/1.1" 200 -
"-" "Java/1.7.0_80"
127.0.0.1 - - [05/Jan/2017:14:42:02 +0000] "GET /api/atlas/types/classification HTTP/1.1"
200 - "-" "Java/1.7.0_80"
127.0.0.1 - - [05/Jan/2017:14:42:02 +0000] "GET /api/atlas/types/hive_db HTTP/1.1" 200 - "-"
"Java/1.7.0_80"
127.0.0.1 - - [05/Jan/2017:14:42:03 +0000] "GET /api/atlas/discovery/search/dsl?query=hive_db+where+qualifiedName%3D'dbhEwhi5wUaN'&limit=10&offset=0
HTTP/1.1" 200 - "-" "Java/1.7.0_80"
127.0.0.1 - - [05/Jan/2017:14:42:04 +0000] "GET /api/atlas/entities?type=hive_db&property=qualifiedName&value=dbhEwhi5wUaN
HTTP/1.1" 200 - "-" "Java/1.7.0_80"
127.0.0.1 - - [05/Jan/2017:14:42:04 +0000] "GET /api/atlas/entities/b38df13e-5ae1-4550-94fa-afd0e71af702/audit?count=1
HTTP/1.1" 200 - "-" "Java/1.7.0_80"
127.0.0.1 - - [05/Jan/2017:14:42:04 +0000] "POST /api/atlas/entities HTTP/1.1" 201 - "-" "Java/1.7.0_80"
127.0.0.1 - - [05/Jan/2017:14:42:04 +0000] "GET /api/atlas/entities/9f3eff50-9023-40a7-8d85-903c689b6049
HTTP/1.1" 200 - "-" "Java/1.7.0_80"
127.0.0.1 - - [05/Jan/2017:14:42:04 +0000] "GET /api/atlas/entities/9f3eff50-9023-40a7-8d85-903c689b6049
HTTP/1.1" 200 - "-" "Java/1.7.0_80"
127.0.0.1 - - [05/Jan/2017:14:42:04 +0000] "GET /api/atlas/discovery/search/dsl?query=hive_db+where+name%3D'dbZfeUk30j0z'&limit=10&offset=0
HTTP/1.1" 200 - "-" "Java/1.7.0_80"
127.0.0.1 - - [05/Jan/2017:14:42:05 +0000] "GET /api/atlas/discovery/search/dsl?query=hive_db+where+name%3D'dbZfeUk30j0z'&limit=10&offset=0
HTTP/1.1" 200 - "-" "Java/1.7.0_80"
127.0.0.1 - - [05/Jan/2017:14:42:06 +0000] "POST /api/atlas/entities HTTP/1.1" 201 - "-" "Java/1.7.0_80"
127.0.0.1 - - [05/Jan/2017:14:42:06 +0000] "GET /api/atlas/discovery/search/dsl?query=hive_db+where+qualifiedName%3D'db9QUUhvedDj'&limit=10&offset=0
HTTP/1.1" 200 - "-" "Java/1.7.0_80"
127.0.0.1 - - [05/Jan/2017:14:42:06 +0000] "GET /api/atlas/entities?type=hive_db&property=qualifiedName&value=db9QUUhvedDj
HTTP/1.1" 200 - "-" "Java/1.7.0_80"
127.0.0.1 - - [05/Jan/2017:14:42:06 +0000] "POST /api/atlas/entities HTTP/1.1" 201 - "-" "Java/1.7.0_80"
127.0.0.1 - - [05/Jan/2017:14:42:07 +0000] "GET /api/atlas/entities?type=hive_db&property=qualifiedName&value=dbYP1DNVYfUz
HTTP/1.1" 200 - "-" "Java/1.7.0_80"
127.0.0.1 - - [05/Jan/2017:14:42:07 +0000] "GET /api/atlas/entities?type=hive_db&property=qualifiedName&value=dbYP1DNVYfUz
HTTP/1.1" 200 - "-" "Java/1.7.0_80"
127.0.0.1 - - [05/Jan/2017:14:42:07 +0000] "GET /api/atlas/entities?type=hive_db&property=qualifiedName&value=dbYP1DNVYfUz
HTTP/1.1" 200 - "-" "Java/1.7.0_80"
127.0.0.1 - - [05/Jan/2017:14:42:07 +0000] "POST /api/atlas/entities HTTP/1.1" 201 - "-" "Java/1.7.0_80"
127.0.0.1 - - [05/Jan/2017:14:42:07 +0000] "GET /api/atlas/discovery/search/dsl?query=hive_db+where+qualifiedName%3D'dbMecoWjzJ6V'&limit=10&offset=0
HTTP/1.1" 200 - "-" "Java/1.7.0_80"
127.0.0.1 - - [05/Jan/2017:14:42:07 +0000] "GET /api/atlas/discovery/search/dsl?query=hive_db+where+qualifiedName%3D'dbotUKO7n6AN'&limit=10&offset=0
HTTP/1.1" 200 - "-" "Java/1.7.0_80"
Tests run: 6, Failures: 0, Errors: 0, Skipped: 0, Time elapsed: 10.223 sec - in org.apache.atlas.notification.NotificationHookConsumerIT

Results :

Failed tests: 
org.apache.atlas.web.resources.EntityJerseyResourceIT.testEntityInvalidValue(org.apache.atlas.web.resources.EntityJerseyResourceIT)
  Run 1: EntityJerseyResourceIT.testEntityInvalidValue:283 expected:<Bad Request> but
was:<Internal Server Error>
  Run 2: EntityJerseyResourceIT.testEntityInvalidValue:283 expected:<Bad Request> but
was:<Internal Server Error>


Tests run: 120, Failures: 1, Errors: 0, Skipped: 0

[INFO] 
[INFO] --- jetty-maven-plugin:9.2.12.v20150709:stop (stop-jetty) @ atlas-webapp ---
[INFO] Waiting 10 seconds for jetty to stop
[INFO] Stopped ServerConnector@6fe177fc{HTTP/1.1}{0.0.0.0:31000}
[INFO] Closing Spring root WebApplicationContext
[INFO] Shutting down log4j
[INFO] Stopped o.e.j.m.p.JettyWebAppContext@7e5bcf9b{/,<https://builds.apache.org/job/apache-atlas-nightly/ws/webapp/target/atlas-webapp-0.8-incubating-SNAPSHOT/,UNAVAILABLE}{/home/jenkins/jenkins-slave/workspace/apache-atlas-nightly/webapp/target/atlas-webapp-0.8-incubating-SNAPSHOT.war}>
[INFO] Server reports itself as stopped
[INFO] 
[INFO] --- maven-source-plugin:2.4:jar-no-fork (attach-sources) @ atlas-webapp ---
[INFO] Building jar: <https://builds.apache.org/job/apache-atlas-nightly/ws/webapp/target/atlas-webapp-0.8-incubating-SNAPSHOT-sources.jar>
[INFO] 
[INFO] --- maven-source-plugin:2.4:test-jar-no-fork (attach-sources) @ atlas-webapp ---
[INFO] Building jar: <https://builds.apache.org/job/apache-atlas-nightly/ws/webapp/target/atlas-webapp-0.8-incubating-SNAPSHOT-test-sources.jar>
[INFO] 
[INFO] --- maven-failsafe-plugin:2.19.1:verify (verify) @ atlas-webapp ---
[INFO] ------------------------------------------------------------------------
[INFO] Reactor Summary:
[INFO] 
[INFO] Apache Atlas Server Build Tools .................... SUCCESS [  1.180 s]
[INFO] apache-atlas ....................................... SUCCESS [ 11.028 s]
[INFO] Apache Atlas Integration ........................... SUCCESS [ 50.091 s]
[INFO] Apache Atlas Common ................................ SUCCESS [ 18.268 s]
[INFO] Apache Atlas Typesystem ............................ SUCCESS [01:44 min]
[INFO] Apache Atlas Client ................................ SUCCESS [ 23.309 s]
[INFO] Apache Atlas Server API ............................ SUCCESS [ 13.309 s]
[INFO] Apache Atlas Notification .......................... SUCCESS [ 57.125 s]
[INFO] Apache Atlas Graph Database Projects ............... SUCCESS [  0.706 s]
[INFO] Apache Atlas Graph Database API .................... SUCCESS [  8.841 s]
[INFO] Graph Database Common Code ......................... SUCCESS [  8.215 s]
[INFO] Shaded version of Apache hbase client .............. SUCCESS [ 11.281 s]
[INFO] Apache Atlas Titan 0.5.4 Graph DB Impl ............. SUCCESS [02:11 min]
[INFO] Apache Atlas Graph Database Implementation Dependencies SUCCESS [  0.732 s]
[INFO] Shaded version of Apache hbase server .............. SUCCESS [ 34.948 s]
[INFO] Apache Atlas Repository ............................ SUCCESS [14:55 min]
[INFO] Apache Atlas Authorization ......................... SUCCESS [ 15.865 s]
[INFO] Apache Atlas Business Catalog ...................... SUCCESS [ 39.576 s]
[INFO] Apache Atlas UI .................................... SUCCESS [ 59.348 s]
[INFO] Apache Atlas Web Application ....................... FAILURE [09:43 min]
[INFO] Apache Atlas Documentation ......................... SKIPPED
[INFO] Apache Atlas FileSystem Model ...................... SKIPPED
[INFO] Apache Atlas Plugin Classloader .................... SKIPPED
[INFO] Apache Atlas Hive Bridge Shim ...................... SKIPPED
[INFO] Apache Atlas Hive Bridge ........................... SKIPPED
[INFO] Apache Atlas Falcon Bridge Shim .................... SKIPPED
[INFO] Apache Atlas Falcon Bridge ......................... SKIPPED
[INFO] Apache Atlas Sqoop Bridge Shim ..................... SKIPPED
[INFO] Apache Atlas Sqoop Bridge .......................... SKIPPED
[INFO] Apache Atlas Storm Bridge Shim ..................... SKIPPED
[INFO] Apache Atlas Storm Bridge .......................... SKIPPED
[INFO] Apache Atlas Distribution .......................... SKIPPED
[INFO] ------------------------------------------------------------------------
[INFO] BUILD FAILURE
[INFO] ------------------------------------------------------------------------
[INFO] Total time: 34:32 min
[INFO] Finished at: 2017-01-05T14:42:14+00:00
[INFO] Final Memory: 336M/1406M
[INFO] ------------------------------------------------------------------------
log4j:WARN No appenders could be found for logger (org.apache.zookeeper.ClientCnxn).
log4j:WARN Please initialize the log4j system properly.
log4j:WARN See http://logging.apache.org/log4j/1.2/faq.html#noconfig for more info.
[ERROR] Failed to execute goal org.apache.maven.plugins:maven-failsafe-plugin:2.19.1:verify
(verify) on project atlas-webapp: There are test failures.
[ERROR] 
[ERROR] Please refer to <https://builds.apache.org/job/apache-atlas-nightly/ws/webapp/target/failsafe-reports>
for the individual test results.
[ERROR] -> [Help 1]
[ERROR] 
[ERROR] To see the full stack trace of the errors, re-run Maven with the -e switch.
[ERROR] Re-run Maven using the -X switch to enable full debug logging.
[ERROR] 
[ERROR] For more information about the errors and possible solutions, please read the following
articles:
[ERROR] [Help 1] http://cwiki.apache.org/confluence/display/MAVEN/MojoFailureException
[ERROR] 
[ERROR] After correcting the problems, you can resume the build with the command
[ERROR]   mvn <goals> -rf :atlas-webapp
Build step 'Execute shell' marked build as failure
[CHECKSTYLE] Collecting checkstyle analysis files...
[CHECKSTYLE] Finding all files that match the pattern **/target/checkstyle-result.xml
[CHECKSTYLE] Parsing 31 files in <https://builds.apache.org/job/apache-atlas-nightly/ws/>
[CHECKSTYLE] Successfully parsed file <https://builds.apache.org/job/apache-atlas-nightly/ws/addons/falcon-bridge-shim/target/checkstyle-result.xml>
with 29 unique warnings and 0 duplicates.
[CHECKSTYLE] Successfully parsed file <https://builds.apache.org/job/apache-atlas-nightly/ws/addons/falcon-bridge/target/checkstyle-result.xml>
with 420 unique warnings and 0 duplicates.
[CHECKSTYLE] Successfully parsed file <https://builds.apache.org/job/apache-atlas-nightly/ws/addons/hdfs-model/target/checkstyle-result.xml>
with 420 unique warnings and 0 duplicates.
[CHECKSTYLE] Successfully parsed file <https://builds.apache.org/job/apache-atlas-nightly/ws/addons/hive-bridge-shim/target/checkstyle-result.xml>
with 435 unique warnings and 0 duplicates.
[CHECKSTYLE] Successfully parsed file <https://builds.apache.org/job/apache-atlas-nightly/ws/addons/hive-bridge/target/checkstyle-result.xml>
with 2228 unique warnings and 0 duplicates.
[CHECKSTYLE] Successfully parsed file <https://builds.apache.org/job/apache-atlas-nightly/ws/addons/sqoop-bridge-shim/target/checkstyle-result.xml>
with 2244 unique warnings and 0 duplicates.
[CHECKSTYLE] Successfully parsed file <https://builds.apache.org/job/apache-atlas-nightly/ws/addons/sqoop-bridge/target/checkstyle-result.xml>
with 2369 unique warnings and 0 duplicates.
[CHECKSTYLE] Successfully parsed file <https://builds.apache.org/job/apache-atlas-nightly/ws/addons/storm-bridge-shim/target/checkstyle-result.xml>
with 2390 unique warnings and 0 duplicates.
[CHECKSTYLE] Successfully parsed file <https://builds.apache.org/job/apache-atlas-nightly/ws/addons/storm-bridge/target/checkstyle-result.xml>
with 2659 unique warnings and 0 duplicates.
[CHECKSTYLE] Successfully parsed file <https://builds.apache.org/job/apache-atlas-nightly/ws/authorization/target/checkstyle-result.xml>
with 3108 unique warnings and 0 duplicates.
[CHECKSTYLE] Successfully parsed file <https://builds.apache.org/job/apache-atlas-nightly/ws/catalog/target/checkstyle-result.xml>
with 5240 unique warnings and 0 duplicates.
[CHECKSTYLE] Successfully parsed file <https://builds.apache.org/job/apache-atlas-nightly/ws/client/target/checkstyle-result.xml>
with 6800 unique warnings and 0 duplicates.
[CHECKSTYLE] Successfully parsed file <https://builds.apache.org/job/apache-atlas-nightly/ws/common/target/checkstyle-result.xml>
with 7620 unique warnings and 0 duplicates.
[CHECKSTYLE] Successfully parsed file <https://builds.apache.org/job/apache-atlas-nightly/ws/dashboardv2/target/checkstyle-result.xml>
with 7620 unique warnings and 0 duplicates.
[CHECKSTYLE] Successfully parsed file <https://builds.apache.org/job/apache-atlas-nightly/ws/distro/target/checkstyle-result.xml>
with 7620 unique warnings and 0 duplicates.
[CHECKSTYLE] Successfully parsed file <https://builds.apache.org/job/apache-atlas-nightly/ws/docs/target/checkstyle-result.xml>
with 7620 unique warnings and 0 duplicates.
[CHECKSTYLE] Successfully parsed file <https://builds.apache.org/job/apache-atlas-nightly/ws/graphdb/api/target/checkstyle-result.xml>
with 7848 unique warnings and 0 duplicates.
[CHECKSTYLE] Successfully parsed file <https://builds.apache.org/job/apache-atlas-nightly/ws/graphdb/common/target/checkstyle-result.xml>
with 7990 unique warnings and 0 duplicates.
[CHECKSTYLE] Successfully parsed file <https://builds.apache.org/job/apache-atlas-nightly/ws/graphdb/graphdb-impls/target/checkstyle-result.xml>
with 7990 unique warnings and 0 duplicates.
[CHECKSTYLE] Successfully parsed file <https://builds.apache.org/job/apache-atlas-nightly/ws/graphdb/target/checkstyle-result.xml>
with 7990 unique warnings and 0 duplicates.
[CHECKSTYLE] Successfully parsed file <https://builds.apache.org/job/apache-atlas-nightly/ws/graphdb/titan0/target/checkstyle-result.xml>
with 10203 unique warnings and 0 duplicates.
[CHECKSTYLE] Successfully parsed file <https://builds.apache.org/job/apache-atlas-nightly/ws/intg/target/checkstyle-result.xml>
with 14578 unique warnings and 0 duplicates.
[CHECKSTYLE] Successfully parsed file <https://builds.apache.org/job/apache-atlas-nightly/ws/notification/target/checkstyle-result.xml>
with 15739 unique warnings and 0 duplicates.
[CHECKSTYLE] Successfully parsed file <https://builds.apache.org/job/apache-atlas-nightly/ws/plugin-classloader/target/checkstyle-result.xml>
with 15847 unique warnings and 0 duplicates.
[CHECKSTYLE] Successfully parsed file <https://builds.apache.org/job/apache-atlas-nightly/ws/repository/target/checkstyle-result.xml>
with 24719 unique warnings and 0 duplicates.
[CHECKSTYLE] Successfully parsed file <https://builds.apache.org/job/apache-atlas-nightly/ws/server-api/target/checkstyle-result.xml>
with 25045 unique warnings and 0 duplicates.
[CHECKSTYLE] Successfully parsed file <https://builds.apache.org/job/apache-atlas-nightly/ws/shaded/hbase-client-shaded/target/checkstyle-result.xml>
with 25045 unique warnings and 0 duplicates.
[CHECKSTYLE] Successfully parsed file <https://builds.apache.org/job/apache-atlas-nightly/ws/shaded/hbase-server-shaded/target/checkstyle-result.xml>
with 25045 unique warnings and 0 duplicates.
[CHECKSTYLE] Successfully parsed file <https://builds.apache.org/job/apache-atlas-nightly/ws/target/checkstyle-result.xml>
with 25045 unique warnings and 0 duplicates.
[CHECKSTYLE] Successfully parsed file <https://builds.apache.org/job/apache-atlas-nightly/ws/titan/target/checkstyle-result.xml>
with 25507 unique warnings and 0 duplicates.
[CHECKSTYLE] Successfully parsed file <https://builds.apache.org/job/apache-atlas-nightly/ws/typesystem/target/checkstyle-result.xml>
with 29690 unique warnings and 0 duplicates.
[CHECKSTYLE] Computing warning deltas based on reference build #535
[FINDBUGS] Collecting findbugs analysis files...
[FINDBUGS] Finding all files that match the pattern **/target/findbugs.xml
[FINDBUGS] Parsing 22 files in <https://builds.apache.org/job/apache-atlas-nightly/ws/>
[FINDBUGS] Successfully parsed file <https://builds.apache.org/job/apache-atlas-nightly/ws/addons/falcon-bridge-shim/target/findbugs.xml>
with 0 unique warnings and 0 duplicates.
[FINDBUGS] Successfully parsed file <https://builds.apache.org/job/apache-atlas-nightly/ws/addons/falcon-bridge/target/findbugs.xml>
with 0 unique warnings and 0 duplicates.
[FINDBUGS] Successfully parsed file <https://builds.apache.org/job/apache-atlas-nightly/ws/addons/hive-bridge-shim/target/findbugs.xml>
with 0 unique warnings and 0 duplicates.
[FINDBUGS] Successfully parsed file <https://builds.apache.org/job/apache-atlas-nightly/ws/addons/hive-bridge/target/findbugs.xml>
with 0 unique warnings and 0 duplicates.
[FINDBUGS] Successfully parsed file <https://builds.apache.org/job/apache-atlas-nightly/ws/addons/sqoop-bridge-shim/target/findbugs.xml>
with 0 unique warnings and 0 duplicates.
[FINDBUGS] Successfully parsed file <https://builds.apache.org/job/apache-atlas-nightly/ws/addons/sqoop-bridge/target/findbugs.xml>
with 0 unique warnings and 0 duplicates.
[FINDBUGS] Successfully parsed file <https://builds.apache.org/job/apache-atlas-nightly/ws/addons/storm-bridge-shim/target/findbugs.xml>
with 0 unique warnings and 0 duplicates.
[FINDBUGS] Successfully parsed file <https://builds.apache.org/job/apache-atlas-nightly/ws/addons/storm-bridge/target/findbugs.xml>
with 0 unique warnings and 0 duplicates.
[FINDBUGS] Successfully parsed file <https://builds.apache.org/job/apache-atlas-nightly/ws/authorization/target/findbugs.xml>
with 0 unique warnings and 0 duplicates.
[FINDBUGS] Successfully parsed file <https://builds.apache.org/job/apache-atlas-nightly/ws/catalog/target/findbugs.xml>
with 0 unique warnings and 0 duplicates.
[FINDBUGS] Successfully parsed file <https://builds.apache.org/job/apache-atlas-nightly/ws/client/target/findbugs.xml>
with 0 unique warnings and 0 duplicates.
[FINDBUGS] Successfully parsed file <https://builds.apache.org/job/apache-atlas-nightly/ws/common/target/findbugs.xml>
with 0 unique warnings and 0 duplicates.
[FINDBUGS] Successfully parsed file <https://builds.apache.org/job/apache-atlas-nightly/ws/graphdb/api/target/findbugs.xml>
with 0 unique warnings and 0 duplicates.
[FINDBUGS] Successfully parsed file <https://builds.apache.org/job/apache-atlas-nightly/ws/graphdb/common/target/findbugs.xml>
with 0 unique warnings and 0 duplicates.
[FINDBUGS] Successfully parsed file <https://builds.apache.org/job/apache-atlas-nightly/ws/graphdb/titan0/target/findbugs.xml>
with 0 unique warnings and 0 duplicates.
[FINDBUGS] Successfully parsed file <https://builds.apache.org/job/apache-atlas-nightly/ws/intg/target/findbugs.xml>
with 0 unique warnings and 0 duplicates.
[FINDBUGS] Successfully parsed file <https://builds.apache.org/job/apache-atlas-nightly/ws/notification/target/findbugs.xml>
with 0 unique warnings and 0 duplicates.
[FINDBUGS] Successfully parsed file <https://builds.apache.org/job/apache-atlas-nightly/ws/plugin-classloader/target/findbugs.xml>
with 0 unique warnings and 0 duplicates.
[FINDBUGS] Successfully parsed file <https://builds.apache.org/job/apache-atlas-nightly/ws/repository/target/findbugs.xml>
with 0 unique warnings and 0 duplicates.
[FINDBUGS] Successfully parsed file <https://builds.apache.org/job/apache-atlas-nightly/ws/server-api/target/findbugs.xml>
with 0 unique warnings and 0 duplicates.
[FINDBUGS] Successfully parsed file <https://builds.apache.org/job/apache-atlas-nightly/ws/titan/target/findbugs.xml>
with 0 unique warnings and 0 duplicates.
[FINDBUGS] Successfully parsed file <https://builds.apache.org/job/apache-atlas-nightly/ws/typesystem/target/findbugs.xml>
with 0 unique warnings and 0 duplicates.
[FINDBUGS] Computing warning deltas based on reference build #535
Archiving artifacts
Compressed 590.02 MB of artifacts by 62.1% relative to #535
TestNG Reports Processing: START
Looking for TestNG results report in workspace using pattern: **/target/surefire-reports/testng-results.xml,**/target/failsafe-reports/testng-results.xml
testng-results.xml was last modified before this build started. Ignoring it.
testng-results.xml was last modified before this build started. Ignoring it.
testng-results.xml was last modified before this build started. Ignoring it.
testng-results.xml was last modified before this build started. Ignoring it.
testng-results.xml was last modified before this build started. Ignoring it.
testng-results.xml was last modified before this build started. Ignoring it.
testng-results.xml was last modified before this build started. Ignoring it.
Saving reports...
Processing '/x1/jenkins/jenkins-home/jobs/apache-atlas-nightly/builds/537/testng/testng-results-1.xml'
Processing '/x1/jenkins/jenkins-home/jobs/apache-atlas-nightly/builds/537/testng/testng-results-10.xml'
Processing '/x1/jenkins/jenkins-home/jobs/apache-atlas-nightly/builds/537/testng/testng-results-2.xml'
Processing '/x1/jenkins/jenkins-home/jobs/apache-atlas-nightly/builds/537/testng/testng-results-3.xml'
Processing '/x1/jenkins/jenkins-home/jobs/apache-atlas-nightly/builds/537/testng/testng-results-4.xml'
Processing '/x1/jenkins/jenkins-home/jobs/apache-atlas-nightly/builds/537/testng/testng-results-5.xml'
Processing '/x1/jenkins/jenkins-home/jobs/apache-atlas-nightly/builds/537/testng/testng-results-6.xml'
Processing '/x1/jenkins/jenkins-home/jobs/apache-atlas-nightly/builds/537/testng/testng-results-7.xml'
Processing '/x1/jenkins/jenkins-home/jobs/apache-atlas-nightly/builds/537/testng/testng-results-8.xml'
Processing '/x1/jenkins/jenkins-home/jobs/apache-atlas-nightly/builds/537/testng/testng-results-9.xml'
Processing '/x1/jenkins/jenkins-home/jobs/apache-atlas-nightly/builds/537/testng/testng-results.xml'
TestNG Reports Processing: FINISH

Mime
View raw message