atlas-dev mailing list archives

Site index · List index
Message view « Date » · « Thread »
Top « Date » · « Thread »
From Apache Jenkins Server <jenk...@builds.apache.org>
Subject Build failed in Jenkins: apache-atlas-nightly #567
Date Fri, 27 Jan 2017 00:15:00 GMT
See <https://builds.apache.org/job/apache-atlas-nightly/567/changes>

Changes:

[jnhagelberg] ATLAS-1114: Performance improvements for create/update entity

[jnhagelberg] ATLAS-1114: Performance improvements for create/update entity (2 of 2)

[madhan] ATLAS-1436: test fix to address NPE

------------------------------------------
[...truncated 5608 lines...]
127.0.0.1 - - [27/Jan/2017:00:12:06 +0000] "POST /api/atlas/entities HTTP/1.1" 201 - "-" "Java/1.7.0_80"
127.0.0.1 - - [27/Jan/2017:00:12:06 +0000] "POST /api/atlas/entities HTTP/1.1" 201 - "-" "Java/1.7.0_80"
127.0.0.1 - - [27/Jan/2017:00:12:06 +0000] "GET /api/atlas/lineage/hive/table/sales_fact_monthly_mvjEPJPwWYX8/inputs/graph
HTTP/1.1" 500 - "-" "Java/1.7.0_80"
127.0.0.1 - - [27/Jan/2017:00:12:06 +0000] "GET /api/atlas/entities?type=hive_table_v1&property=qualifiedName&value=sales_fact_monthly_mvjEPJPwWYX8
HTTP/1.1" 200 - "-" "Java/1.7.0_80"
127.0.0.1 - - [27/Jan/2017:00:12:06 +0000] "GET /api/atlas/lineage/57f51bdc-171c-4713-b950-0f79a149d888/inputs/graph
HTTP/1.1" 200 - "-" "Java/1.7.0_80"
127.0.0.1 - - [27/Jan/2017:00:12:08 +0000] "GET /api/atlas/lineage/hive/table/sales_factuv9haDXyLs/outputs/graph
HTTP/1.1" 500 - "-" "Java/1.7.0_80"
127.0.0.1 - - [27/Jan/2017:00:12:08 +0000] "GET /api/atlas/entities?type=hive_table_v1&property=qualifiedName&value=sales_factuv9haDXyLs
HTTP/1.1" 200 - "-" "Java/1.7.0_80"
127.0.0.1 - - [27/Jan/2017:00:12:08 +0000] "GET /api/atlas/lineage/810a9a3e-5f37-4337-a453-6eee7f59d4ce/outputs/graph
HTTP/1.1" 200 - "-" "Java/1.7.0_80"
127.0.0.1 - - [27/Jan/2017:00:12:09 +0000] "GET /api/atlas/lineage/hive/table/sales_factuv9haDXyLs/schema
HTTP/1.1" 200 - "-" "Java/1.7.0_80"
127.0.0.1 - - [27/Jan/2017:00:12:10 +0000] "GET /api/atlas/lineage/hive/table/SalesoqQ1WLUVXN/schema
HTTP/1.1" 404 - "-" "Java/1.7.0_80"
127.0.0.1 - - [27/Jan/2017:00:12:10 +0000] "GET /api/atlas/entities?type=hive_table_v1&property=qualifiedName&value=sales_factuv9haDXyLs
HTTP/1.1" 200 - "-" "Java/1.7.0_80"
127.0.0.1 - - [27/Jan/2017:00:12:10 +0000] "GET /api/atlas/lineage/810a9a3e-5f37-4337-a453-6eee7f59d4ce/schema
HTTP/1.1" 200 - "-" "Java/1.7.0_80"
127.0.0.1 - - [27/Jan/2017:00:12:11 +0000] "GET /api/atlas/lineage/hive/table/blah/schema
HTTP/1.1" 404 - "-" "Java/1.7.0_80"
127.0.0.1 - - [27/Jan/2017:00:12:11 +0000] "GET /api/atlas/entities?type=hive_table_v1&property=qualifiedName&value=sales_fact_monthly_mvYjeXhkbacX
HTTP/1.1" 200 - "-" "Java/1.7.0_80"
127.0.0.1 - - [27/Jan/2017:00:12:11 +0000] "GET /api/atlas/v2/lineage/2f5f03df-32c6-476a-bacb-6c1eea9fadc4?direction=INPUT&depth=5
HTTP/1.1" 200 - "-" "Java/1.7.0_80"
127.0.0.1 - - [27/Jan/2017:00:12:12 +0000] "GET /api/atlas/entities?type=hive_table_v1&property=qualifiedName&value=sales_fact_monthly_mvYjeXhkbacX
HTTP/1.1" 200 - "-" "Java/1.7.0_80"
127.0.0.1 - - [27/Jan/2017:00:12:12 +0000] "GET /api/atlas/v2/lineage/2f5f03df-32c6-476a-bacb-6c1eea9fadc4?direction=BOTH&depth=5
HTTP/1.1" 200 - "-" "Java/1.7.0_80"
127.0.0.1 - - [27/Jan/2017:00:12:14 +0000] "GET /api/atlas/entities?type=hive_table_v1&property=qualifiedName&value=sales_factNji5ryI4hX
HTTP/1.1" 200 - "-" "Java/1.7.0_80"
127.0.0.1 - - [27/Jan/2017:00:12:14 +0000] "GET /api/atlas/v2/lineage/e2f83a7d-32f3-43e1-a248-b2e44d2020f2?direction=OUTPUT&depth=5
HTTP/1.1" 200 - "-" "Java/1.7.0_80"
Tests run: 11, Failures: 2, Errors: 0, Skipped: 0, Time elapsed: 14.489 sec <<< FAILURE!
- in org.apache.atlas.web.resources.EntityLineageJerseyResourceIT
testInputsGraph(org.apache.atlas.web.resources.EntityLineageJerseyResourceIT)  Time elapsed:
0.028 sec  <<< FAILURE!
org.apache.atlas.AtlasServiceException: Metadata service API org.apache.atlas.AtlasBaseClient$APIInfo@63e71631
failed with status 500 (Internal Server Error) Response Body ({"error":"Failed with java.lang.NullPointerException"})

testOutputsGraph(org.apache.atlas.web.resources.EntityLineageJerseyResourceIT)  Time elapsed:
0.016 sec  <<< FAILURE!
org.apache.atlas.AtlasServiceException: Metadata service API org.apache.atlas.AtlasBaseClient$APIInfo@7e1e054a
failed with status 500 (Internal Server Error) Response Body ({"error":"Failed with java.lang.NullPointerException"})

Running org.apache.atlas.CredentialProviderUtilityIT
Tests run: 4, Failures: 0, Errors: 0, Skipped: 0, Time elapsed: 1.663 sec - in org.apache.atlas.CredentialProviderUtilityIT
Running org.apache.atlas.notification.EntityNotificationIT
127.0.0.1 - - [27/Jan/2017:00:12:21 +0000] "GET /api/atlas/types/tableType HTTP/1.1" 200 -
"-" "Java/1.7.0_80"
127.0.0.1 - - [27/Jan/2017:00:12:22 +0000] "GET /api/atlas/types/serdeType HTTP/1.1" 200 -
"-" "Java/1.7.0_80"
127.0.0.1 - - [27/Jan/2017:00:12:22 +0000] "GET /api/atlas/types/classification HTTP/1.1"
200 - "-" "Java/1.7.0_80"
127.0.0.1 - - [27/Jan/2017:00:12:22 +0000] "GET /api/atlas/types/hive_db_v1 HTTP/1.1" 200
- "-" "Java/1.7.0_80"
127.0.0.1 - - [27/Jan/2017:00:12:22 +0000] "POST /api/atlas/entities HTTP/1.1" 201 - "-" "Java/1.7.0_80"
127.0.0.1 - - [27/Jan/2017:00:12:24 +0000] "POST /api/atlas/entities HTTP/1.1" 201 - "-" "Java/1.7.0_80"
127.0.0.1 - - [27/Jan/2017:00:12:25 +0000] "POST /api/atlas/types HTTP/1.1" 201 - "-" "Java/1.7.0_80"
127.0.0.1 - - [27/Jan/2017:00:12:25 +0000] "POST /api/atlas/types HTTP/1.1" 201 - "-" "Java/1.7.0_80"
127.0.0.1 - - [27/Jan/2017:00:12:25 +0000] "POST /api/atlas/types HTTP/1.1" 201 - "-" "Java/1.7.0_80"
127.0.0.1 - - [27/Jan/2017:00:12:25 +0000] "POST /api/atlas/entities/ba4723ad-7947-44c6-8e0d-e43e1a872489/traits
HTTP/1.1" 201 - "-" "Java/1.7.0_80"
127.0.0.1 - - [27/Jan/2017:00:12:25 +0000] "POST /api/atlas/types HTTP/1.1" 201 - "-" "Java/1.7.0_80"
127.0.0.1 - - [27/Jan/2017:00:12:25 +0000] "POST /api/atlas/entities/ba4723ad-7947-44c6-8e0d-e43e1a872489/traits
HTTP/1.1" 201 - "-" "Java/1.7.0_80"
127.0.0.1 - - [27/Jan/2017:00:12:25 +0000] "DELETE /api/atlas/entities/ba4723ad-7947-44c6-8e0d-e43e1a872489/traits/TraitGvyy1Ygut7
HTTP/1.1" 200 - "-" "Java/1.7.0_80"
127.0.0.1 - - [27/Jan/2017:00:12:25 +0000] "POST /api/atlas/entities/ba4723ad-7947-44c6-8e0d-e43e1a872489?property=description
HTTP/1.1" 200 - "-" "Java/1.7.0_80"
127.0.0.1 - - [27/Jan/2017:00:12:25 +0000] "POST /api/atlas/entities HTTP/1.1" 201 - "-" "Java/1.7.0_80"
127.0.0.1 - - [27/Jan/2017:00:12:25 +0000] "POST /api/atlas/entities HTTP/1.1" 201 - "-" "Java/1.7.0_80"
127.0.0.1 - - [27/Jan/2017:00:12:25 +0000] "DELETE /api/atlas/entities?type=hive_table&property=qualifiedName&value=table-LEYHW8AE7d
HTTP/1.1" 200 - "-" "Java/1.7.0_80"
Tests run: 5, Failures: 0, Errors: 0, Skipped: 0, Time elapsed: 7.189 sec - in org.apache.atlas.notification.EntityNotificationIT
Running org.apache.atlas.notification.NotificationHookConsumerIT
127.0.0.1 - - [27/Jan/2017:00:12:29 +0000] "GET /api/atlas/types/tableType HTTP/1.1" 200 -
"-" "Java/1.7.0_80"
127.0.0.1 - - [27/Jan/2017:00:12:30 +0000] "GET /api/atlas/types/serdeType HTTP/1.1" 200 -
"-" "Java/1.7.0_80"
127.0.0.1 - - [27/Jan/2017:00:12:30 +0000] "GET /api/atlas/types/classification HTTP/1.1"
200 - "-" "Java/1.7.0_80"
127.0.0.1 - - [27/Jan/2017:00:12:30 +0000] "GET /api/atlas/types/hive_db_v1 HTTP/1.1" 200
- "-" "Java/1.7.0_80"
127.0.0.1 - - [27/Jan/2017:00:12:31 +0000] "GET /api/atlas/discovery/search/dsl?query=hive_db+where+qualifiedName%3D'dbLlsf8mJ2N9'&limit=10&offset=0
HTTP/1.1" 200 - "-" "Java/1.7.0_80"
127.0.0.1 - - [27/Jan/2017:00:12:32 +0000] "GET /api/atlas/entities?type=hive_db&property=qualifiedName&value=dbLlsf8mJ2N9
HTTP/1.1" 200 - "-" "Java/1.7.0_80"
127.0.0.1 - - [27/Jan/2017:00:12:32 +0000] "GET /api/atlas/entities/8f2f43ff-047b-4c72-a0f1-0376e3b2e0c1/audit?count=1
HTTP/1.1" 200 - "-" "Java/1.7.0_80"
127.0.0.1 - - [27/Jan/2017:00:12:32 +0000] "POST /api/atlas/entities HTTP/1.1" 201 - "-" "Java/1.7.0_80"
127.0.0.1 - - [27/Jan/2017:00:12:32 +0000] "GET /api/atlas/entities/3cbc6795-5f33-4e90-8d80-3526f7726a6a
HTTP/1.1" 200 - "-" "Java/1.7.0_80"
127.0.0.1 - - [27/Jan/2017:00:12:32 +0000] "GET /api/atlas/discovery/search/dsl?query=hive_db+where+name%3D'dbgYPO5WP9ZC'&limit=10&offset=0
HTTP/1.1" 200 - "-" "Java/1.7.0_80"
127.0.0.1 - - [27/Jan/2017:00:12:33 +0000] "GET /api/atlas/discovery/search/dsl?query=hive_db+where+name%3D'dbgYPO5WP9ZC'&limit=10&offset=0
HTTP/1.1" 200 - "-" "Java/1.7.0_80"
127.0.0.1 - - [27/Jan/2017:00:12:34 +0000] "POST /api/atlas/entities HTTP/1.1" 201 - "-" "Java/1.7.0_80"
127.0.0.1 - - [27/Jan/2017:00:12:34 +0000] "GET /api/atlas/discovery/search/dsl?query=hive_db+where+qualifiedName%3D'dbuAP3sxSWmU'&limit=10&offset=0
HTTP/1.1" 200 - "-" "Java/1.7.0_80"
127.0.0.1 - - [27/Jan/2017:00:12:35 +0000] "GET /api/atlas/entities?type=hive_db&property=qualifiedName&value=dbuAP3sxSWmU
HTTP/1.1" 200 - "-" "Java/1.7.0_80"
127.0.0.1 - - [27/Jan/2017:00:12:35 +0000] "POST /api/atlas/entities HTTP/1.1" 201 - "-" "Java/1.7.0_80"
127.0.0.1 - - [27/Jan/2017:00:12:35 +0000] "GET /api/atlas/entities?type=hive_db&property=qualifiedName&value=dbR8PWF7hoyE
HTTP/1.1" 200 - "-" "Java/1.7.0_80"
127.0.0.1 - - [27/Jan/2017:00:12:35 +0000] "GET /api/atlas/entities?type=hive_db&property=qualifiedName&value=dbR8PWF7hoyE
HTTP/1.1" 200 - "-" "Java/1.7.0_80"
127.0.0.1 - - [27/Jan/2017:00:12:35 +0000] "GET /api/atlas/entities?type=hive_db&property=qualifiedName&value=dbR8PWF7hoyE
HTTP/1.1" 200 - "-" "Java/1.7.0_80"
127.0.0.1 - - [27/Jan/2017:00:12:35 +0000] "POST /api/atlas/entities HTTP/1.1" 201 - "-" "Java/1.7.0_80"
127.0.0.1 - - [27/Jan/2017:00:12:35 +0000] "GET /api/atlas/discovery/search/dsl?query=hive_db+where+qualifiedName%3D'dbSAq74Nxipi'&limit=10&offset=0
HTTP/1.1" 200 - "-" "Java/1.7.0_80"
127.0.0.1 - - [27/Jan/2017:00:12:36 +0000] "GET /api/atlas/discovery/search/dsl?query=hive_db+where+qualifiedName%3D'dbUhFvfme46j'&limit=10&offset=0
HTTP/1.1" 200 - "-" "Java/1.7.0_80"
Tests run: 6, Failures: 1, Errors: 0, Skipped: 0, Time elapsed: 10.233 sec <<< FAILURE!
- in org.apache.atlas.notification.NotificationHookConsumerIT
testUpdatePartialUpdatingQualifiedName(org.apache.atlas.notification.NotificationHookConsumerIT)
 Time elapsed: 1.605 sec  <<< FAILURE!
java.lang.AssertionError: expected:<0> but was:<1>
	at org.apache.atlas.notification.NotificationHookConsumerIT.testUpdatePartialUpdatingQualifiedName(NotificationHookConsumerIT.java:170)


Results :

Failed tests: 
  QuickStartIT.testLineageIsMaintained:126 » AtlasService Metadata service API o...
  NotificationHookConsumerIT.testUpdatePartialUpdatingQualifiedName:170 expected:<0>
but was:<1>
  DataSetLineageJerseyResourceIT.testInputsGraph:62 » AtlasService Metadata serv...
  DataSetLineageJerseyResourceIT.testOutputsGraph:98 » AtlasService Metadata ser...
  EntityLineageJerseyResourceIT>DataSetLineageJerseyResourceIT.testInputsGraph:62 »
AtlasService
  EntityLineageJerseyResourceIT>DataSetLineageJerseyResourceIT.testOutputsGraph:98 »
AtlasService
  MetadataDiscoveryJerseyResourceIT.setUp:64->BaseResourceIT.createInstance:197 » AtlasService

Tests run: 129, Failures: 7, Errors: 0, Skipped: 7

[INFO] 
[INFO] --- jetty-maven-plugin:9.2.12.v20150709:stop (stop-jetty) @ atlas-webapp ---
[INFO] Waiting 10 seconds for jetty to stop
[INFO] Stopped ServerConnector@c274a74{HTTP/1.1}{0.0.0.0:31000}
[INFO] Closing Spring root WebApplicationContext
[INFO] Shutting down log4j
[INFO] Stopped o.e.j.m.p.JettyWebAppContext@4739a366{/,<https://builds.apache.org/job/apache-atlas-nightly/ws/webapp/target/atlas-webapp-0.8-incubating-SNAPSHOT/,UNAVAILABLE}{/home/jenkins/jenkins-slave/workspace/apache-atlas-nightly/webapp/target/atlas-webapp-0.8-incubating-SNAPSHOT.war}>
[INFO] Server reports itself as stopped
[INFO] 
[INFO] --- maven-source-plugin:2.4:jar-no-fork (attach-sources) @ atlas-webapp ---
[INFO] Building jar: <https://builds.apache.org/job/apache-atlas-nightly/ws/webapp/target/atlas-webapp-0.8-incubating-SNAPSHOT-sources.jar>
log4j:WARN No appenders could be found for logger (org.apache.zookeeper.ClientCnxn).
log4j:WARN Please initialize the log4j system properly.
log4j:WARN See http://logging.apache.org/log4j/1.2/faq.html#noconfig for more info.
[INFO] 
[INFO] --- maven-source-plugin:2.4:test-jar-no-fork (attach-sources) @ atlas-webapp ---
[INFO] Building jar: <https://builds.apache.org/job/apache-atlas-nightly/ws/webapp/target/atlas-webapp-0.8-incubating-SNAPSHOT-test-sources.jar>
[INFO] 
[INFO] --- maven-failsafe-plugin:2.19.1:verify (verify) @ atlas-webapp ---
[INFO] ------------------------------------------------------------------------
[INFO] Reactor Summary:
[INFO] 
[INFO] Apache Atlas Server Build Tools .................... SUCCESS [  1.348 s]
[INFO] apache-atlas ....................................... SUCCESS [ 17.023 s]
[INFO] Apache Atlas Integration ........................... SUCCESS [01:27 min]
[INFO] Apache Atlas Common ................................ SUCCESS [ 32.209 s]
[INFO] Apache Atlas Typesystem ............................ SUCCESS [02:22 min]
[INFO] Apache Atlas Client ................................ SUCCESS [ 29.418 s]
[INFO] Apache Atlas Server API ............................ SUCCESS [ 17.430 s]
[INFO] Apache Atlas Notification .......................... SUCCESS [01:11 min]
[INFO] Apache Atlas Graph Database Projects ............... SUCCESS [  1.508 s]
[INFO] Apache Atlas Graph Database API .................... SUCCESS [ 14.776 s]
[INFO] Graph Database Common Code ......................... SUCCESS [ 12.582 s]
[INFO] Shaded version of Apache hbase client .............. SUCCESS [ 17.934 s]
[INFO] Apache Atlas Titan 0.5.4 Graph DB Impl ............. SUCCESS [02:39 min]
[INFO] Apache Atlas Graph Database Implementation Dependencies SUCCESS [  1.155 s]
[INFO] Shaded version of Apache hbase server .............. SUCCESS [ 34.140 s]
[INFO] Apache Atlas Repository ............................ SUCCESS [13:53 min]
[INFO] Apache Atlas Authorization ......................... SUCCESS [ 17.090 s]
[INFO] Apache Atlas Business Catalog ...................... SUCCESS [ 36.461 s]
[INFO] Apache Atlas UI .................................... SUCCESS [01:01 min]
[INFO] Apache Atlas Web Application ....................... FAILURE [10:00 min]
[INFO] Apache Atlas Documentation ......................... SKIPPED
[INFO] Apache Atlas FileSystem Model ...................... SKIPPED
[INFO] Apache Atlas Plugin Classloader .................... SKIPPED
[INFO] Apache Atlas Hive Bridge Shim ...................... SKIPPED
[INFO] Apache Atlas Hive Bridge ........................... SKIPPED
[INFO] Apache Atlas Falcon Bridge Shim .................... SKIPPED
[INFO] Apache Atlas Falcon Bridge ......................... SKIPPED
[INFO] Apache Atlas Sqoop Bridge Shim ..................... SKIPPED
[INFO] Apache Atlas Sqoop Bridge .......................... SKIPPED
[INFO] Apache Atlas Storm Bridge Shim ..................... SKIPPED
[INFO] Apache Atlas Storm Bridge .......................... SKIPPED
[INFO] Apache Atlas Distribution .......................... SKIPPED
[INFO] ------------------------------------------------------------------------
[INFO] BUILD FAILURE
[INFO] ------------------------------------------------------------------------
[INFO] Total time: 36:33 min
[INFO] Finished at: 2017-01-27T00:12:43+00:00
[INFO] Final Memory: 344M/1930M
[INFO] ------------------------------------------------------------------------
[ERROR] Failed to execute goal org.apache.maven.plugins:maven-failsafe-plugin:2.19.1:verify
(verify) on project atlas-webapp: There are test failures.
[ERROR] 
[ERROR] Please refer to <https://builds.apache.org/job/apache-atlas-nightly/ws/webapp/target/failsafe-reports>
for the individual test results.
[ERROR] -> [Help 1]
[ERROR] 
[ERROR] To see the full stack trace of the errors, re-run Maven with the -e switch.
[ERROR] Re-run Maven using the -X switch to enable full debug logging.
[ERROR] 
[ERROR] For more information about the errors and possible solutions, please read the following
articles:
[ERROR] [Help 1] http://cwiki.apache.org/confluence/display/MAVEN/MojoFailureException
[ERROR] 
[ERROR] After correcting the problems, you can resume the build with the command
[ERROR]   mvn <goals> -rf :atlas-webapp
Build step 'Execute shell' marked build as failure
[CHECKSTYLE] Collecting checkstyle analysis files...
[CHECKSTYLE] Finding all files that match the pattern **/target/checkstyle-result.xml
[CHECKSTYLE] Parsing 31 files in <https://builds.apache.org/job/apache-atlas-nightly/ws/>
[CHECKSTYLE] Successfully parsed file <https://builds.apache.org/job/apache-atlas-nightly/ws/addons/falcon-bridge-shim/target/checkstyle-result.xml>
with 29 unique warnings and 0 duplicates.
[CHECKSTYLE] Successfully parsed file <https://builds.apache.org/job/apache-atlas-nightly/ws/addons/falcon-bridge/target/checkstyle-result.xml>
with 420 unique warnings and 0 duplicates.
[CHECKSTYLE] Successfully parsed file <https://builds.apache.org/job/apache-atlas-nightly/ws/addons/hdfs-model/target/checkstyle-result.xml>
with 420 unique warnings and 0 duplicates.
[CHECKSTYLE] Successfully parsed file <https://builds.apache.org/job/apache-atlas-nightly/ws/addons/hive-bridge-shim/target/checkstyle-result.xml>
with 435 unique warnings and 0 duplicates.
[CHECKSTYLE] Successfully parsed file <https://builds.apache.org/job/apache-atlas-nightly/ws/addons/hive-bridge/target/checkstyle-result.xml>
with 2228 unique warnings and 0 duplicates.
[CHECKSTYLE] Successfully parsed file <https://builds.apache.org/job/apache-atlas-nightly/ws/addons/sqoop-bridge-shim/target/checkstyle-result.xml>
with 2244 unique warnings and 0 duplicates.
[CHECKSTYLE] Successfully parsed file <https://builds.apache.org/job/apache-atlas-nightly/ws/addons/sqoop-bridge/target/checkstyle-result.xml>
with 2369 unique warnings and 0 duplicates.
[CHECKSTYLE] Successfully parsed file <https://builds.apache.org/job/apache-atlas-nightly/ws/addons/storm-bridge-shim/target/checkstyle-result.xml>
with 2390 unique warnings and 0 duplicates.
[CHECKSTYLE] Successfully parsed file <https://builds.apache.org/job/apache-atlas-nightly/ws/addons/storm-bridge/target/checkstyle-result.xml>
with 2659 unique warnings and 0 duplicates.
[CHECKSTYLE] Successfully parsed file <https://builds.apache.org/job/apache-atlas-nightly/ws/authorization/target/checkstyle-result.xml>
with 3116 unique warnings and 0 duplicates.
[CHECKSTYLE] Successfully parsed file <https://builds.apache.org/job/apache-atlas-nightly/ws/catalog/target/checkstyle-result.xml>
with 5248 unique warnings and 0 duplicates.
[CHECKSTYLE] Successfully parsed file <https://builds.apache.org/job/apache-atlas-nightly/ws/client/target/checkstyle-result.xml>
with 6853 unique warnings and 0 duplicates.
[CHECKSTYLE] Successfully parsed file <https://builds.apache.org/job/apache-atlas-nightly/ws/common/target/checkstyle-result.xml>
with 7678 unique warnings and 0 duplicates.
[CHECKSTYLE] Successfully parsed file <https://builds.apache.org/job/apache-atlas-nightly/ws/dashboardv2/target/checkstyle-result.xml>
with 7678 unique warnings and 0 duplicates.
[CHECKSTYLE] Successfully parsed file <https://builds.apache.org/job/apache-atlas-nightly/ws/distro/target/checkstyle-result.xml>
with 7678 unique warnings and 0 duplicates.
[CHECKSTYLE] Successfully parsed file <https://builds.apache.org/job/apache-atlas-nightly/ws/docs/target/checkstyle-result.xml>
with 7678 unique warnings and 0 duplicates.
[CHECKSTYLE] Successfully parsed file <https://builds.apache.org/job/apache-atlas-nightly/ws/graphdb/api/target/checkstyle-result.xml>
with 7906 unique warnings and 0 duplicates.
[CHECKSTYLE] Successfully parsed file <https://builds.apache.org/job/apache-atlas-nightly/ws/graphdb/common/target/checkstyle-result.xml>
with 8048 unique warnings and 0 duplicates.
[CHECKSTYLE] Successfully parsed file <https://builds.apache.org/job/apache-atlas-nightly/ws/graphdb/graphdb-impls/target/checkstyle-result.xml>
with 8048 unique warnings and 0 duplicates.
[CHECKSTYLE] Successfully parsed file <https://builds.apache.org/job/apache-atlas-nightly/ws/graphdb/target/checkstyle-result.xml>
with 8048 unique warnings and 0 duplicates.
[CHECKSTYLE] Successfully parsed file <https://builds.apache.org/job/apache-atlas-nightly/ws/graphdb/titan0/target/checkstyle-result.xml>
with 10261 unique warnings and 0 duplicates.
[CHECKSTYLE] Successfully parsed file <https://builds.apache.org/job/apache-atlas-nightly/ws/intg/target/checkstyle-result.xml>
with 15146 unique warnings and 0 duplicates.
[CHECKSTYLE] Successfully parsed file <https://builds.apache.org/job/apache-atlas-nightly/ws/notification/target/checkstyle-result.xml>
with 16307 unique warnings and 0 duplicates.
[CHECKSTYLE] Successfully parsed file <https://builds.apache.org/job/apache-atlas-nightly/ws/plugin-classloader/target/checkstyle-result.xml>
with 16415 unique warnings and 0 duplicates.
[CHECKSTYLE] Successfully parsed file <https://builds.apache.org/job/apache-atlas-nightly/ws/repository/target/checkstyle-result.xml>
with 26982 unique warnings and 0 duplicates.
[CHECKSTYLE] Successfully parsed file <https://builds.apache.org/job/apache-atlas-nightly/ws/server-api/target/checkstyle-result.xml>
with 27362 unique warnings and 0 duplicates.
[CHECKSTYLE] Successfully parsed file <https://builds.apache.org/job/apache-atlas-nightly/ws/shaded/hbase-client-shaded/target/checkstyle-result.xml>
with 27362 unique warnings and 0 duplicates.
[CHECKSTYLE] Successfully parsed file <https://builds.apache.org/job/apache-atlas-nightly/ws/shaded/hbase-server-shaded/target/checkstyle-result.xml>
with 27362 unique warnings and 0 duplicates.
[CHECKSTYLE] Successfully parsed file <https://builds.apache.org/job/apache-atlas-nightly/ws/target/checkstyle-result.xml>
with 27362 unique warnings and 0 duplicates.
[CHECKSTYLE] Successfully parsed file <https://builds.apache.org/job/apache-atlas-nightly/ws/titan/target/checkstyle-result.xml>
with 27824 unique warnings and 0 duplicates.
[CHECKSTYLE] Successfully parsed file <https://builds.apache.org/job/apache-atlas-nightly/ws/typesystem/target/checkstyle-result.xml>
with 32008 unique warnings and 0 duplicates.
[CHECKSTYLE] Computing warning deltas based on reference build #535
[FINDBUGS] Collecting findbugs analysis files...
[FINDBUGS] Finding all files that match the pattern **/target/findbugs.xml
[FINDBUGS] Parsing 22 files in <https://builds.apache.org/job/apache-atlas-nightly/ws/>
[FINDBUGS] Successfully parsed file <https://builds.apache.org/job/apache-atlas-nightly/ws/addons/falcon-bridge-shim/target/findbugs.xml>
with 0 unique warnings and 0 duplicates.
[FINDBUGS] Successfully parsed file <https://builds.apache.org/job/apache-atlas-nightly/ws/addons/falcon-bridge/target/findbugs.xml>
with 0 unique warnings and 0 duplicates.
[FINDBUGS] Successfully parsed file <https://builds.apache.org/job/apache-atlas-nightly/ws/addons/hive-bridge-shim/target/findbugs.xml>
with 0 unique warnings and 0 duplicates.
[FINDBUGS] Successfully parsed file <https://builds.apache.org/job/apache-atlas-nightly/ws/addons/hive-bridge/target/findbugs.xml>
with 0 unique warnings and 0 duplicates.
[FINDBUGS] Successfully parsed file <https://builds.apache.org/job/apache-atlas-nightly/ws/addons/sqoop-bridge-shim/target/findbugs.xml>
with 0 unique warnings and 0 duplicates.
[FINDBUGS] Successfully parsed file <https://builds.apache.org/job/apache-atlas-nightly/ws/addons/sqoop-bridge/target/findbugs.xml>
with 0 unique warnings and 0 duplicates.
[FINDBUGS] Successfully parsed file <https://builds.apache.org/job/apache-atlas-nightly/ws/addons/storm-bridge-shim/target/findbugs.xml>
with 0 unique warnings and 0 duplicates.
[FINDBUGS] Successfully parsed file <https://builds.apache.org/job/apache-atlas-nightly/ws/addons/storm-bridge/target/findbugs.xml>
with 0 unique warnings and 0 duplicates.
[FINDBUGS] Successfully parsed file <https://builds.apache.org/job/apache-atlas-nightly/ws/authorization/target/findbugs.xml>
with 0 unique warnings and 0 duplicates.
[FINDBUGS] Successfully parsed file <https://builds.apache.org/job/apache-atlas-nightly/ws/catalog/target/findbugs.xml>
with 0 unique warnings and 0 duplicates.
[FINDBUGS] Successfully parsed file <https://builds.apache.org/job/apache-atlas-nightly/ws/client/target/findbugs.xml>
with 0 unique warnings and 0 duplicates.
[FINDBUGS] Successfully parsed file <https://builds.apache.org/job/apache-atlas-nightly/ws/common/target/findbugs.xml>
with 0 unique warnings and 0 duplicates.
[FINDBUGS] Successfully parsed file <https://builds.apache.org/job/apache-atlas-nightly/ws/graphdb/api/target/findbugs.xml>
with 0 unique warnings and 0 duplicates.
[FINDBUGS] Successfully parsed file <https://builds.apache.org/job/apache-atlas-nightly/ws/graphdb/common/target/findbugs.xml>
with 0 unique warnings and 0 duplicates.
[FINDBUGS] Successfully parsed file <https://builds.apache.org/job/apache-atlas-nightly/ws/graphdb/titan0/target/findbugs.xml>
with 0 unique warnings and 0 duplicates.
[FINDBUGS] Successfully parsed file <https://builds.apache.org/job/apache-atlas-nightly/ws/intg/target/findbugs.xml>
with 0 unique warnings and 0 duplicates.
[FINDBUGS] Successfully parsed file <https://builds.apache.org/job/apache-atlas-nightly/ws/notification/target/findbugs.xml>
with 0 unique warnings and 0 duplicates.
[FINDBUGS] Successfully parsed file <https://builds.apache.org/job/apache-atlas-nightly/ws/plugin-classloader/target/findbugs.xml>
with 0 unique warnings and 0 duplicates.
[FINDBUGS] Successfully parsed file <https://builds.apache.org/job/apache-atlas-nightly/ws/repository/target/findbugs.xml>
with 0 unique warnings and 0 duplicates.
[FINDBUGS] Successfully parsed file <https://builds.apache.org/job/apache-atlas-nightly/ws/server-api/target/findbugs.xml>
with 0 unique warnings and 0 duplicates.
[FINDBUGS] Successfully parsed file <https://builds.apache.org/job/apache-atlas-nightly/ws/titan/target/findbugs.xml>
with 0 unique warnings and 0 duplicates.
[FINDBUGS] Successfully parsed file <https://builds.apache.org/job/apache-atlas-nightly/ws/typesystem/target/findbugs.xml>
with 0 unique warnings and 0 duplicates.
[FINDBUGS] Computing warning deltas based on reference build #535
Archiving artifacts
Compressed 580.63 MB of artifacts by 63.2% relative to #535
TestNG Reports Processing: START
Looking for TestNG results report in workspace using pattern: **/target/surefire-reports/testng-results.xml,**/target/failsafe-reports/testng-results.xml
testng-results.xml was last modified before this build started. Ignoring it.
testng-results.xml was last modified before this build started. Ignoring it.
testng-results.xml was last modified before this build started. Ignoring it.
testng-results.xml was last modified before this build started. Ignoring it.
testng-results.xml was last modified before this build started. Ignoring it.
testng-results.xml was last modified before this build started. Ignoring it.
testng-results.xml was last modified before this build started. Ignoring it.
Saving reports...
Processing '/x1/jenkins/jenkins-home/jobs/apache-atlas-nightly/builds/567/testng/testng-results-1.xml'
Processing '/x1/jenkins/jenkins-home/jobs/apache-atlas-nightly/builds/567/testng/testng-results-10.xml'
Processing '/x1/jenkins/jenkins-home/jobs/apache-atlas-nightly/builds/567/testng/testng-results-2.xml'
Processing '/x1/jenkins/jenkins-home/jobs/apache-atlas-nightly/builds/567/testng/testng-results-3.xml'
Processing '/x1/jenkins/jenkins-home/jobs/apache-atlas-nightly/builds/567/testng/testng-results-4.xml'
Processing '/x1/jenkins/jenkins-home/jobs/apache-atlas-nightly/builds/567/testng/testng-results-5.xml'
Processing '/x1/jenkins/jenkins-home/jobs/apache-atlas-nightly/builds/567/testng/testng-results-6.xml'
Processing '/x1/jenkins/jenkins-home/jobs/apache-atlas-nightly/builds/567/testng/testng-results-7.xml'
Processing '/x1/jenkins/jenkins-home/jobs/apache-atlas-nightly/builds/567/testng/testng-results-8.xml'
Processing '/x1/jenkins/jenkins-home/jobs/apache-atlas-nightly/builds/567/testng/testng-results-9.xml'
Processing '/x1/jenkins/jenkins-home/jobs/apache-atlas-nightly/builds/567/testng/testng-results.xml'
1.851852% of tests failed, which exceeded threshold of 0%. Marking build as UNSTABLE
TestNG Reports Processing: FINISH

Mime
View raw message