atlas-dev mailing list archives

Site index · List index
Message view « Date » · « Thread »
Top « Date » · « Thread »
From "Apoorv Naik (JIRA)" <j...@apache.org>
Subject [jira] [Commented] (ATLAS-1374) Tests are failing in the build
Date Fri, 16 Dec 2016 03:04:58 GMT

    [ https://issues.apache.org/jira/browse/ATLAS-1374?page=com.atlassian.jira.plugin.system.issuetabpanels:comment-tabpanel&focusedCommentId=15753267#comment-15753267
] 

Apoorv Naik commented on ATLAS-1374:
------------------------------------

The HBase errors are intermittent and the Store related errors will be fixed under ATLAS-1394

> Tests are failing in the build 
> -------------------------------
>
>                 Key: ATLAS-1374
>                 URL: https://issues.apache.org/jira/browse/ATLAS-1374
>             Project: Atlas
>          Issue Type: Bug
>            Reporter: David Radley
>
> I have just grabbed the latest build and am getting unit test errors in the build :
> tSpot(TM) 64-Bit Server VM warning: ignoring option MaxPermSize=512m; support was removed
in 8.0
> Running org.apache.atlas.query.GremlinTest
> Tests run: 21, Failures: 0, Errors: 0, Skipped: 0, Time elapsed: 16.946 sec - in org.apache.atlas.query.GremlinTest
> Java HotSpot(TM) 64-Bit Server VM warning: ignoring option MaxPermSize=512m; support
was removed in 8.0
> Running org.apache.atlas.query.LexerTest
> Tests run: 1, Failures: 0, Errors: 0, Skipped: 0, Time elapsed: 0.469 sec - in org.apache.atlas.query.LexerTest
> Java HotSpot(TM) 64-Bit Server VM warning: ignoring option MaxPermSize=512m; support
was removed in 8.0
> Running org.apache.atlas.query.LineageQueryTest
> Tests run: 5, Failures: 0, Errors: 0, Skipped: 0, Time elapsed: 16.756 sec - in org.apache.atlas.query.LineageQueryTest
> Java HotSpot(TM) 64-Bit Server VM warning: ignoring option MaxPermSize=512m; support
was removed in 8.0
> Running org.apache.atlas.query.ParserTest
> Tests run: 13, Failures: 0, Errors: 0, Skipped: 0, Time elapsed: 0.923 sec - in org.apache.atlas.query.ParserTest
> Java HotSpot(TM) 64-Bit Server VM warning: ignoring option MaxPermSize=512m; support
was removed in 8.0
> Running org.apache.atlas.repository.audit.HBaseBasedAuditRepositoryHATest
> Tests run: 2, Failures: 0, Errors: 0, Skipped: 0, Time elapsed: 0.767 sec - in org.apache.atlas.repository.audit.HBaseBasedAuditRepositoryHATest
> Java HotSpot(TM) 64-Bit Server VM warning: ignoring option MaxPermSize=512m; support
was removed in 8.0
> Running org.apache.atlas.repository.audit.HBaseBasedAuditRepositoryTest
> Tests run: 6, Failures: 4, Errors: 0, Skipped: 2, Time elapsed: 1.355 sec <<<
FAILURE! - in org.apache.atlas.repository.audit.HBaseBasedAuditRepositoryTest
> setup(org.apache.atlas.repository.audit.HBaseBasedAuditRepositoryTest)  Time elapsed:
1.277 sec  <<< FAILURE!
> java.lang.RuntimeException: Failed construction of Master: class org.apache.hadoop.hbase.master.HMasterCan't
assign requested address
> 	at sun.nio.ch.Net.bind0(Native Method)
> 	at sun.nio.ch.Net.bind(Net.java:433)
> 	at sun.nio.ch.Net.bind(Net.java:425)
> 	at sun.nio.ch.ServerSocketChannelImpl.bind(ServerSocketChannelImpl.java:223)
> 	at sun.nio.ch.ServerSocketAdaptor.bind(ServerSocketAdaptor.java:74)
> 	at org.apache.hadoop.hbase.ipc.RpcServer.bind(RpcServer.java:2495)
> 	at org.apache.hadoop.hbase.ipc.RpcServer$Listener.<init>(RpcServer.java:580)
> 	at org.apache.hadoop.hbase.ipc.RpcServer.<init>(RpcServer.java:1982)
> 	at org.apache.hadoop.hbase.regionserver.RSRpcServices.<init>(RSRpcServices.java:863)
> 	at org.apache.hadoop.hbase.master.MasterRpcServices.<init>(MasterRpcServices.java:210)
> 	at org.apache.hadoop.hbase.master.HMaster.createRpcServices(HMaster.java:532)
> 	at org.apache.hadoop.hbase.regionserver.HRegionServer.<init>(HRegionServer.java:532)
> 	at org.apache.hadoop.hbase.master.HMaster.<init>(HMaster.java:364)
> 	at sun.reflect.NativeConstructorAccessorImpl.newInstance0(Native Method)
> 	at sun.reflect.NativeConstructorAccessorImpl.newInstance(NativeConstructorAccessorImpl.java:62)
> 	at sun.reflect.DelegatingConstructorAccessorImpl.newInstance(DelegatingConstructorAccessorImpl.java:45)
> 	at java.lang.reflect.Constructor.newInstance(Constructor.java:423)
> 	at org.apache.hadoop.hbase.util.JVMClusterUtil.createMasterThread(JVMClusterUtil.java:139)
> 	at org.apache.hadoop.hbase.LocalHBaseCluster.addMaster(LocalHBaseCluster.java:217)
> 	at org.apache.hadoop.hbase.LocalHBaseCluster.<init>(LocalHBaseCluster.java:153)
> 	at org.apache.hadoop.hbase.LocalHBaseCluster.<init>(LocalHBaseCluster.java:95)
> 	at org.apache.hadoop.hbase.LocalHBaseCluster.<init>(LocalHBaseCluster.java:83)
> 	at org.apache.atlas.repository.audit.HBaseTestUtils.startCluster(HBaseTestUtils.java:40)
> 	at org.apache.atlas.repository.audit.HBaseBasedAuditRepositoryTest.setup(HBaseBasedAuditRepositoryTest.java:40)
> testAddEvents(org.apache.atlas.repository.audit.HBaseBasedAuditRepositoryTest)  Time
elapsed: 0.04 sec  <<< FAILURE!
> java.lang.NullPointerException: null
> 	at org.apache.atlas.repository.audit.HBaseBasedAuditRepository.putEvents(HBaseBasedAuditRepository.java:120)
> 	at org.apache.atlas.repository.audit.HBaseBasedAuditRepository.putEvents(HBaseBasedAuditRepository.java:107)
> 	at org.apache.atlas.repository.audit.AuditRepositoryTestBase.testAddEvents(AuditRepositoryTestBase.java:45)
> 	at sun.reflect.NativeMethodAccessorImpl.invoke0(Native Method)
> 	at sun.reflect.NativeMethodAccessorImpl.invoke(NativeMethodAccessorImpl.java:62)
> 	at sun.reflect.DelegatingMethodAccessorImpl.invoke(DelegatingMethodAccessorImpl.java:43)
> 	at java.lang.reflect.Method.invoke(Method.java:498)
> 	at org.testng.internal.MethodInvocationHelper.invokeMethod(MethodInvocationHelper.java:80)
> 	at org.testng.internal.Invoker.invokeMethod(Invoker.java:673)
> 	at org.testng.internal.Invoker.invokeTestMethod(Invoker.java:842)
> 	at org.testng.internal.Invoker.invokeTestMethods(Invoker.java:1166)
> 	at org.testng.internal.TestMethodWorker.invokeTestMethods(TestMethodWorker.java:125)
> 	at org.testng.internal.TestMethodWorker.run(TestMethodWorker.java:109)
> 	at org.testng.TestRunner.runWorkers(TestRunner.java:1178)
> 	at org.testng.TestRunner.privateRun(TestRunner.java:757)
> 	at org.testng.TestRunner.run(TestRunner.java:608)
> 	at org.testng.SuiteRunner.runTest(SuiteRunner.java:334)
> 	at org.testng.SuiteRunner.runSequentially(SuiteRunner.java:329)
> 	at org.testng.SuiteRunner.privateRun(SuiteRunner.java:291)
> 	at org.testng.SuiteRunner.run(SuiteRunner.java:240)
> 	at org.testng.SuiteRunnerWorker.runSuite(SuiteRunnerWorker.java:52)
> 	at org.testng.SuiteRunnerWorker.run(SuiteRunnerWorker.java:86)
> 	at org.testng.TestNG.runSuitesSequentially(TestNG.java:1158)
> 	at org.testng.TestNG.runSuitesLocally(TestNG.java:1083)
> 	at org.testng.TestNG.run(TestNG.java:999)
> 	at org.apache.maven.surefire.testng.TestNGExecutor.run(TestNGExecutor.java:115)
> 	at org.apache.maven.surefire.testng.TestNGDirectoryTestSuite.executeSingleClass(TestNGDirectoryTestSuite.java:129)
> 	at org.apache.maven.surefire.testng.TestNGDirectoryTestSuite.execute(TestNGDirectoryTestSuite.java:113)
> 	at org.apache.maven.surefire.testng.TestNGProvider.invoke(TestNGProvider.java:111)
> 	at org.apache.maven.surefire.booter.ForkedBooter.invokeProviderInSameClassLoader(ForkedBooter.java:203)
> 	at org.apache.maven.surefire.booter.ForkedBooter.runSuitesInProcess(ForkedBooter.java:155)
> 	at org.apache.maven.surefire.booter.ForkedBooter.main(ForkedBooter.java:103)
> testInvalidEntityId(org.apache.atlas.repository.audit.HBaseBasedAuditRepositoryTest)
 Time elapsed: 0.001 sec  <<< FAILURE!
> java.lang.NullPointerException: null
> 	at org.apache.atlas.repository.audit.HBaseBasedAuditRepository.listEvents(HBaseBasedAuditRepository.java:168)
> 	at org.apache.atlas.repository.audit.AuditRepositoryTestBase.testInvalidEntityId(AuditRepositoryTestBase.java:88)
> 	at sun.reflect.NativeMethodAccessorImpl.invoke0(Native Method)
> 	at sun.reflect.NativeMethodAccessorImpl.invoke(NativeMethodAccessorImpl.java:62)
> 	at sun.reflect.DelegatingMethodAccessorImpl.invoke(DelegatingMethodAccessorImpl.java:43)
> 	at java.lang.reflect.Method.invoke(Method.java:498)
> 	at org.testng.internal.MethodInvocationHelper.invokeMethod(MethodInvocationHelper.java:80)
> 	at org.testng.internal.Invoker.invokeMethod(Invoker.java:673)
> 	at org.testng.internal.Invoker.invokeTestMethod(Invoker.java:842)
> 	at org.testng.internal.Invoker.invokeTestMethods(Invoker.java:1166)
> 	at org.testng.internal.TestMethodWorker.invokeTestMethods(TestMethodWorker.java:125)
> 	at org.testng.internal.TestMethodWorker.run(TestMethodWorker.java:109)
> 	at org.testng.TestRunner.runWorkers(TestRunner.java:1178)
> 	at org.testng.TestRunner.privateRun(TestRunner.java:757)
> 	at org.testng.TestRunner.run(TestRunner.java:608)
> 	at org.testng.SuiteRunner.runTest(SuiteRunner.java:334)
> 	at org.testng.SuiteRunner.runSequentially(SuiteRunner.java:329)
> 	at org.testng.SuiteRunner.privateRun(SuiteRunner.java:291)
> 	at org.testng.SuiteRunner.run(SuiteRunner.java:240)
> 	at org.testng.SuiteRunnerWorker.runSuite(SuiteRunnerWorker.java:52)
> 	at org.testng.SuiteRunnerWorker.run(SuiteRunnerWorker.java:86)
> 	at org.testng.TestNG.runSuitesSequentially(TestNG.java:1158)
> 	at org.testng.TestNG.runSuitesLocally(TestNG.java:1083)
> 	at org.testng.TestNG.run(TestNG.java:999)
> 	at org.apache.maven.surefire.testng.TestNGExecutor.run(TestNGExecutor.java:115)
> 	at org.apache.maven.surefire.testng.TestNGDirectoryTestSuite.executeSingleClass(TestNGDirectoryTestSuite.java:129)
> 	at org.apache.maven.surefire.testng.TestNGDirectoryTestSuite.execute(TestNGDirectoryTestSuite.java:113)
> 	at org.apache.maven.surefire.testng.TestNGProvider.invoke(TestNGProvider.java:111)
> 	at org.apache.maven.surefire.booter.ForkedBooter.invokeProviderInSameClassLoader(ForkedBooter.java:203)
> 	at org.apache.maven.surefire.booter.ForkedBooter.runSuitesInProcess(ForkedBooter.java:155)
> 	at org.apache.maven.surefire.booter.ForkedBooter.main(ForkedBooter.java:103)
> testListPagination(org.apache.atlas.repository.audit.HBaseBasedAuditRepositoryTest) 
Time elapsed: 0.001 sec  <<< FAILURE!
> java.lang.NullPointerException: null
> 	at org.apache.atlas.repository.audit.HBaseBasedAuditRepository.putEvents(HBaseBasedAuditRepository.java:120)
> 	at org.apache.atlas.repository.audit.HBaseBasedAuditRepository.putEvents(HBaseBasedAuditRepository.java:107)
> 	at org.apache.atlas.repository.audit.AuditRepositoryTestBase.testListPagination(AuditRepositoryTestBase.java:65)
> 	at sun.reflect.NativeMethodAccessorImpl.invoke0(Native Method)
> 	at sun.reflect.NativeMethodAccessorImpl.invoke(NativeMethodAccessorImpl.java:62)
> 	at sun.reflect.DelegatingMethodAccessorImpl.invoke(DelegatingMethodAccessorImpl.java:43)
> 	at java.lang.reflect.Method.invoke(Method.java:498)
> 	at org.testng.internal.MethodInvocationHelper.invokeMethod(MethodInvocationHelper.java:80)
> 	at org.testng.internal.Invoker.invokeMethod(Invoker.java:673)
> 	at org.testng.internal.Invoker.invokeTestMethod(Invoker.java:842)
> 	at org.testng.internal.Invoker.invokeTestMethods(Invoker.java:1166)
> 	at org.testng.internal.TestMethodWorker.invokeTestMethods(TestMethodWorker.java:125)
> 	at org.testng.internal.TestMethodWorker.run(TestMethodWorker.java:109)
> 	at org.testng.TestRunner.runWorkers(TestRunner.java:1178)
> 	at org.testng.TestRunner.privateRun(TestRunner.java:757)
> 	at org.testng.TestRunner.run(TestRunner.java:608)
> 	at org.testng.SuiteRunner.runTest(SuiteRunner.java:334)
> 	at org.testng.SuiteRunner.runSequentially(SuiteRunner.java:329)
> 	at org.testng.SuiteRunner.privateRun(SuiteRunner.java:291)
> 	at org.testng.SuiteRunner.run(SuiteRunner.java:240)
> 	at org.testng.SuiteRunnerWorker.runSuite(SuiteRunnerWorker.java:52)
> 	at org.testng.SuiteRunnerWorker.run(SuiteRunnerWorker.java:86)
> 	at org.testng.TestNG.runSuitesSequentially(TestNG.java:1158)
> 	at org.testng.TestNG.runSuitesLocally(TestNG.java:1083)
> 	at org.testng.TestNG.run(TestNG.java:999)
> 	at org.apache.maven.surefire.testng.TestNGExecutor.run(TestNGExecutor.java:115)
> 	at org.apache.maven.surefire.testng.TestNGDirectoryTestSuite.executeSingleClass(TestNGDirectoryTestSuite.java:129)
> 	at org.apache.maven.surefire.testng.TestNGDirectoryTestSuite.execute(TestNGDirectoryTestSuite.java:113)
> 	at org.apache.maven.surefire.testng.TestNGProvider.invoke(TestNGProvider.java:111)
> 	at org.apache.maven.surefire.booter.ForkedBooter.invokeProviderInSameClassLoader(ForkedBooter.java:203)
> 	at org.apache.maven.surefire.booter.ForkedBooter.runSuitesInProcess(ForkedBooter.java:155)
> 	at org.apache.maven.surefire.booter.ForkedBooter.main(ForkedBooter.java:103)
> Java HotSpot(TM) 64-Bit Server VM warning: ignoring option MaxPermSize=512m; support
was removed in 8.0
> Running org.apache.atlas.repository.audit.InMemoryAuditRepositoryTest
> Tests run: 3, Failures: 0, Errors: 0, Skipped: 0, Time elapsed: 0.454 sec - in org.apache.atlas.repository.audit.InMemoryAuditRepositoryTest
> Java HotSpot(TM) 64-Bit Server VM warning: ignoring option MaxPermSize=512m; support
was removed in 8.0
> Running org.apache.atlas.repository.BaseTest
> Tests run: 0, Failures: 0, Errors: 0, Skipped: 0, Time elapsed: 0.168 sec - in org.apache.atlas.repository.BaseTest
> Java HotSpot(TM) 64-Bit Server VM warning: ignoring option MaxPermSize=512m; support
was removed in 8.0
> Running org.apache.atlas.repository.graph.GraphBackedMetadataRepositoryTest
> Tests run: 27, Failures: 0, Errors: 0, Skipped: 0, Time elapsed: 14.414 sec - in org.apache.atlas.repository.graph.GraphBackedMetadataRepositoryTest
> Java HotSpot(TM) 64-Bit Server VM warning: ignoring option MaxPermSize=512m; support
was removed in 8.0
> Running org.apache.atlas.repository.graph.GraphBackedRepositoryHardDeleteTest
> Tests run: 17, Failures: 0, Errors: 0, Skipped: 0, Time elapsed: 16.334 sec - in org.apache.atlas.repository.graph.GraphBackedRepositoryHardDeleteTest
> Java HotSpot(TM) 64-Bit Server VM warning: ignoring option MaxPermSize=512m; support
was removed in 8.0
> Running org.apache.atlas.repository.graph.GraphBackedRepositorySoftDeleteTest
> Tests run: 17, Failures: 0, Errors: 0, Skipped: 0, Time elapsed: 13.828 sec - in org.apache.atlas.repository.graph.GraphBackedRepositorySoftDeleteTest
> Java HotSpot(TM) 64-Bit Server VM warning: ignoring option MaxPermSize=512m; support
was removed in 8.0
> Running org.apache.atlas.repository.graph.GraphBackedSearchIndexerMockTest
> Tests run: 3, Failures: 0, Errors: 0, Skipped: 0, Time elapsed: 0.534 sec - in org.apache.atlas.repository.graph.GraphBackedSearchIndexerMockTest
> Java HotSpot(TM) 64-Bit Server VM warning: ignoring option MaxPermSize=512m; support
was removed in 8.0
> Running org.apache.atlas.repository.graph.GraphBackedSearchIndexerTest
> Tests run: 5, Failures: 0, Errors: 0, Skipped: 0, Time elapsed: 7.398 sec - in org.apache.atlas.repository.graph.GraphBackedSearchIndexerTest
> Java HotSpot(TM) 64-Bit Server VM warning: ignoring option MaxPermSize=512m; support
was removed in 8.0
> Running org.apache.atlas.repository.graph.GraphHelperMockTest
> Tests run: 2, Failures: 0, Errors: 0, Skipped: 0, Time elapsed: 3.785 sec - in org.apache.atlas.repository.graph.GraphHelperMockTest
> Java HotSpot(TM) 64-Bit Server VM warning: ignoring option MaxPermSize=512m; support
was removed in 8.0
> Running org.apache.atlas.repository.graph.GraphHelperTest
> Tests run: 12, Failures: 0, Errors: 0, Skipped: 0, Time elapsed: 8.224 sec - in org.apache.atlas.repository.graph.GraphHelperTest
> Java HotSpot(TM) 64-Bit Server VM warning: ignoring option MaxPermSize=512m; support
was removed in 8.0
> Running org.apache.atlas.repository.graph.GraphRepoMapperScaleTest
> Tests run: 2, Failures: 0, Errors: 0, Skipped: 0, Time elapsed: 109.801 sec - in org.apache.atlas.repository.graph.GraphRepoMapperScaleTest
> Java HotSpot(TM) 64-Bit Server VM warning: ignoring option MaxPermSize=512m; support
was removed in 8.0
> Running org.apache.atlas.repository.store.graph.AtlasTypeDefGraphStoreTest
> Tests run: 10, Failures: 0, Errors: 0, Skipped: 0, Time elapsed: 11.543 sec - in org.apache.atlas.repository.store.graph.AtlasTypeDefGraphStoreTest
> Java HotSpot(TM) 64-Bit Server VM warning: ignoring option MaxPermSize=512m; support
was removed in 8.0
> Running org.apache.atlas.repository.typestore.GraphBackedTypeStoreTest
> Tests run: 4, Failures: 1, Errors: 0, Skipped: 0, Time elapsed: 9.417 sec <<<
FAILURE! - in org.apache.atlas.repository.typestore.GraphBackedTypeStoreTest
> testTypeUpdate(org.apache.atlas.repository.typestore.GraphBackedTypeStoreTest)  Time
elapsed: 0.005 sec  <<< FAILURE!
> org.apache.atlas.typesystem.types.TypeUpdateException: Department can't be updated -
Attribute employees can't be updated
> 	at org.apache.atlas.typesystem.types.TypeUtils.validateUpdate(TypeUtils.java:104)
> 	at org.apache.atlas.typesystem.types.HierarchicalType.validateUpdate(HierarchicalType.java:145)
> 	at org.apache.atlas.typesystem.types.TypeSystem$TransientTypeSystem.validateUpdateIsPossible(TypeSystem.java:618)
> 	at org.apache.atlas.typesystem.types.TypeSystem$TransientTypeSystem.verifyTypes(TypeSystem.java:712)
> 	at org.apache.atlas.typesystem.types.TypeSystem$TransientTypeSystem.defineTypes(TypeSystem.java:624)
> 	at org.apache.atlas.typesystem.types.TypeSystem.updateTypes(TypeSystem.java:267)
> 	at org.apache.atlas.repository.typestore.GraphBackedTypeStoreTest.testTypeUpdate(GraphBackedTypeStoreTest.java:171)
> Java HotSpot(TM) 64-Bit Server VM warning: ignoring option MaxPermSize=512m; support
was removed in 8.0
> Running org.apache.atlas.repository.typestore.StoreBackedTypeCacheConfigurationTest
> Tests run: 1, Failures: 0, Errors: 0, Skipped: 0, Time elapsed: 7.113 sec - in org.apache.atlas.repository.typestore.StoreBackedTypeCacheConfigurationTest
> Java HotSpot(TM) 64-Bit Server VM warning: ignoring option MaxPermSize=512m; support
was removed in 8.0
> Running org.apache.atlas.repository.typestore.StoreBackedTypeCacheTest
> Tests run: 2, Failures: 0, Errors: 0, Skipped: 0, Time elapsed: 7.755 sec - in org.apache.atlas.repository.typestore.StoreBackedTypeCacheTest
> Java HotSpot(TM) 64-Bit Server VM warning: ignoring option MaxPermSize=512m; support
was removed in 8.0
> Running org.apache.atlas.RepositoryServiceLoadingTest
> Tests run: 1, Failures: 0, Errors: 0, Skipped: 0, Time elapsed: 7.119 sec - in org.apache.atlas.RepositoryServiceLoadingTest
> Java HotSpot(TM) 64-Bit Server VM warning: ignoring option MaxPermSize=512m; support
was removed in 8.0
> Running org.apache.atlas.service.DefaultMetadataServiceTest
> Tests run: 23, Failures: 0, Errors: 0, Skipped: 0, Time elapsed: 13.728 sec - in org.apache.atlas.service.DefaultMetadataServiceTest
> Java HotSpot(TM) 64-Bit Server VM warning: ignoring option MaxPermSize=512m; support
was removed in 8.0
> Running org.apache.atlas.service.StoreBackedTypeCacheMetadataServiceTest
> Tests run: 3, Failures: 1, Errors: 0, Skipped: 0, Time elapsed: 10.19 sec <<<
FAILURE! - in org.apache.atlas.service.StoreBackedTypeCacheMetadataServiceTest
> testValidUpdateType(org.apache.atlas.service.StoreBackedTypeCacheMetadataServiceTest)
 Time elapsed: 0.077 sec  <<< FAILURE!
> org.apache.atlas.typesystem.types.TypeUpdateException: hive_table can't be updated -
Attribute tableType can't be updated
> 	at org.apache.atlas.typesystem.types.TypeUtils.validateUpdate(TypeUtils.java:104)
> 	at org.apache.atlas.typesystem.types.HierarchicalType.validateUpdate(HierarchicalType.java:145)
> 	at org.apache.atlas.typesystem.types.TypeSystem$TransientTypeSystem.validateUpdateIsPossible(TypeSystem.java:618)
> 	at org.apache.atlas.typesystem.types.TypeSystem$TransientTypeSystem.verifyTypes(TypeSystem.java:712)
> 	at org.apache.atlas.typesystem.types.TypeSystem.createTransientTypeSystem(TypeSystem.java:346)
> 	at org.apache.atlas.services.DefaultMetadataService.createOrUpdateTypes(DefaultMetadataService.java:189)
> 	at org.apache.atlas.services.DefaultMetadataService.updateType(DefaultMetadataService.java:217)
> 	at org.apache.atlas.service.StoreBackedTypeCacheMetadataServiceTest.testValidUpdateType(StoreBackedTypeCacheMetadataServiceTest.java:116)
> Java HotSpot(TM) 64-Bit Server VM warning: ignoring option MaxPermSize=512m; support
was removed in 8.0
> Running org.apache.atlas.TestUtils
> Tests run: 0, Failures: 0, Errors: 0, Skipped: 0, Time elapsed: 0.162 sec - in org.apache.atlas.TestUtils
> Results :
> Failed tests: 
>   HBaseBasedAuditRepositoryTest.setup:40 » Runtime Failed construction of Master...
>   HBaseBasedAuditRepositoryTest>AuditRepositoryTestBase.testAddEvents:45 » NullPointer
>   HBaseBasedAuditRepositoryTest>AuditRepositoryTestBase.testInvalidEntityId:88 »
NullPointer
>   HBaseBasedAuditRepositoryTest>AuditRepositoryTestBase.testListPagination:65 » NullPointer
>   GraphBackedTypeStoreTest.testTypeUpdate:171 » TypeUpdate Department can't be u...
>   StoreBackedTypeCacheMetadataServiceTest.testValidUpdateType:116 » TypeUpdate h...
> Tests run: 601, Failures: 6, Errors: 0, Skipped: 2
> [INFO] ------------------------------------------------------------------------
> [INFO] Reactor Summary:
> [INFO] 
> [INFO] Apache Atlas Server Build Tools .................... SUCCESS [  0.420 s]
> [INFO] apache-atlas ....................................... SUCCESS [  0.883 s]
> [INFO] Apache Atlas Integration ........................... SUCCESS [ 13.901 s]
> [INFO] Apache Atlas Common ................................ SUCCESS [  1.720 s]
> [INFO] Apache Atlas Typesystem ............................ SUCCESS [ 31.931 s]
> [INFO] Apache Atlas Client ................................ SUCCESS [  3.042 s]
> [INFO] Apache Atlas Server API ............................ SUCCESS [  0.626 s]
> [INFO] Apache Atlas Notification .......................... SUCCESS [ 16.948 s]
> [INFO] Apache Atlas Graph Database Projects ............... SUCCESS [  0.042 s]
> [INFO] Apache Atlas Graph Database API .................... SUCCESS [  0.340 s]
> [INFO] Graph Database Common Code ......................... SUCCESS [  0.325 s]
> [INFO] Shaded version of Apache hbase client .............. SUCCESS [  5.387 s]
> [INFO] Apache Atlas Titan 0.5.4 Graph DB Impl ............. SUCCESS [01:12 min]
> [INFO] Apache Atlas Graph Database Implementation Dependencies SUCCESS [  0.082 s]
> [INFO] Shaded version of Apache hbase server .............. SUCCESS [ 12.934 s]
> [INFO] Apache Atlas Repository ............................ FAILURE [07:49 min]
> [INFO] Apache Atlas Authorization ......................... SKIPPED
> [INFO] Apache Atlas Business Catalog ...................... SKIPPED
> [INFO] Apache Atlas UI .................................... SKIPPED
> [INFO] Apache Atlas Web Application ....................... SKIPPED
> [INFO] Apache Atlas Documentation ......................... SKIPPED
> [INFO] Apache Atlas FileSystem Model ...................... SKIPPED
> [INFO] Apache Atlas Plugin Classloader .................... SKIPPED
> [INFO] Apache Atlas Hive Bridge Shim ...................... SKIPPED
> [INFO] Apache Atlas Hive Bridge ........................... SKIPPED
> [INFO] Apache Atlas Falcon Bridge Shim .................... SKIPPED
> [INFO] Apache Atlas Falcon Bridge ......................... SKIPPED
> [INFO] Apache Atlas Sqoop Bridge Shim ..................... SKIPPED
> [INFO] Apache Atlas Sqoop Bridge .......................... SKIPPED
> [INFO] Apache Atlas Storm Bridge Shim ..................... SKIPPED
> [INFO] Apache Atlas Storm Bridge .......................... SKIPPED
> [INFO] Apache Atlas Distribution .......................... SKIPPED
> [INFO] ------------------------------------------------------------------------
> [INFO] BUILD FAILURE
> [INFO] ------------------------------------------------------------------------
> [INFO] Total time: 10:31 min
> [INFO] Finished at: 2016-12-13T17:30:14+00:00
> [INFO] Final Memory: 127M/943M
> [INFO] ------------------------------------------------------------------------
> [ERROR] Failed to execute goal org.apache.maven.plugins:maven-surefire-plugin:2.18.1:test
(default-test) on project atlas-repository: There are test failures.
> [ERROR] 
> [ERROR] Please refer to /Users/david/atlas/repository/target/surefire-reports for the
individual test results.
> [ERROR] -> [Help 1]
> org.apache.maven.lifecycle.LifecycleExecutionException: Failed to execute goal org.apache.maven.plugins:maven-surefire-plugin:2.18.1:test
(default-test) on project atlas-repository: There are test failures.
> Please refer to /Users/david/atlas/repository/target/surefire-reports for the individual
test results.
> 	at org.apache.maven.lifecycle.internal.MojoExecutor.execute(MojoExecutor.java:212)
> 	at org.apache.maven.lifecycle.internal.MojoExecutor.execute(MojoExecutor.java:153)
> 	at org.apache.maven.lifecycle.internal.MojoExecutor.execute(MojoExecutor.java:145)
> 	at org.apache.maven.lifecycle.internal.LifecycleModuleBuilder.buildProject(LifecycleModuleBuilder.java:116)
> 	at org.apache.maven.lifecycle.internal.LifecycleModuleBuilder.buildProject(LifecycleModuleBuilder.java:80)
> 	at org.apache.maven.lifecycle.internal.builder.singlethreaded.SingleThreadedBuilder.build(SingleThreadedBuilder.java:51)
> 	at org.apache.maven.lifecycle.internal.LifecycleStarter.execute(LifecycleStarter.java:128)
> 	at org.apache.maven.DefaultMaven.doExecute(DefaultMaven.java:307)
> 	at org.apache.maven.DefaultMaven.doExecute(DefaultMaven.java:193)
> 	at org.apache.maven.DefaultMaven.execute(DefaultMaven.java:106)
> 	at org.apache.maven.cli.MavenCli.execute(MavenCli.java:863)
> 	at org.apache.maven.cli.MavenCli.doMain(MavenCli.java:288)
> 	at org.apache.maven.cli.MavenCli.main(MavenCli.java:199)
> 	at sun.reflect.NativeMethodAccessorImpl.invoke0(Native Method)
> 	at sun.reflect.NativeMethodAccessorImpl.invoke(NativeMethodAccessorImpl.java:62)
> 	at sun.reflect.DelegatingMethodAccessorImpl.invoke(DelegatingMethodAccessorImpl.java:43)
> 	at java.lang.reflect.Method.invoke(Method.java:498)
> 	at org.codehaus.plexus.classworlds.launcher.Launcher.launchEnhanced(Launcher.java:289)
> 	at org.codehaus.plexus.classworlds.launcher.Launcher.launch(Launcher.java:229)
> 	at org.codehaus.plexus.classworlds.launcher.Launcher.mainWithExitCode(Launcher.java:415)
> 	at org.codehaus.plexus.classworlds.launcher.Launcher.main(Launcher.java:356)
> Caused by: org.apache.maven.plugin.MojoFailureException: There are test failures.
> Please refer to /Users/david/atlas/repository/target/surefire-reports for the individual
test results.
> 	at org.apache.maven.plugin.surefire.SurefireHelper.reportExecution(SurefireHelper.java:82)
> 	at org.apache.maven.plugin.surefire.SurefirePlugin.handleSummary(SurefirePlugin.java:254)
> 	at org.apache.maven.plugin.surefire.AbstractSurefireMojo.executeAfterPreconditionsChecked(AbstractSurefireMojo.java:854)
> 	at org.apache.maven.plugin.surefire.AbstractSurefireMojo.execute(AbstractSurefireMojo.java:722)
> 	at org.apache.maven.plugin.DefaultBuildPluginManager.executeMojo(DefaultBuildPluginManager.java:134)
> 	at org.apache.maven.lifecycle.internal.MojoExecutor.execute(MojoExecutor.java:207)
> 	... 20 more
> [ERROR] 
> [ERROR] Re-run Maven using the -X switch to enable full debug logging.
> [ERROR] 
> [ERROR] For more information about the errors and possible solutions, please read the
following articles:
> [ERROR] [Help 1] http://cwiki.apache.org/confluence/display/MAVEN/MojoFailureException
> [ERROR] 
> [ERROR] After correcting the problems, you can resume the build with the command
> [ERROR]   mvn <goals> -rf :atlas-repository
>  



--
This message was sent by Atlassian JIRA
(v6.3.4#6332)

Mime
View raw message