atlas-dev mailing list archives

Site index · List index
Message view « Date » · « Thread »
Top « Date » · « Thread »
From Apache Jenkins Server <jenk...@builds.apache.org>
Subject Build failed in Jenkins: apache-atlas-nightly #492
Date Wed, 23 Nov 2016 08:16:59 GMT
See <https://builds.apache.org/job/apache-atlas-nightly/492/changes>

Changes:

[visharma] ATLAS-1315 Fix webapp Integration tests (ayubkhan,apoorvnaik via

------------------------------------------
[...truncated 8583 lines...]
127.0.0.1 - - [23/Nov/2016:08:10:26 +0000] "POST /api/atlas/entities HTTP/1.1" 201 - "-" "Java/1.7.0_80"
127.0.0.1 - - [23/Nov/2016:08:10:26 +0000] "POST /api/atlas/entities HTTP/1.1" 201 - "-" "Java/1.7.0_80"
127.0.0.1 - - [23/Nov/2016:08:10:26 +0000] "POST /api/atlas/entities HTTP/1.1" 201 - "-" "Java/1.7.0_80"
127.0.0.1 - - [23/Nov/2016:08:10:26 +0000] "POST /api/atlas/entities HTTP/1.1" 201 - "-" "Java/1.7.0_80"
127.0.0.1 - - [23/Nov/2016:08:10:26 +0000] "GET /api/atlas/lineage/hive/table/sales_fact_monthly_mv9B86Z3yAFK/inputs/graph
HTTP/1.1" 200 - "-" "Java/1.7.0_80"
127.0.0.1 - - [23/Nov/2016:08:10:28 +0000] "GET /api/atlas/entities?type=hive_table&property=qualifiedName&value=sales_fact_monthly_mv9B86Z3yAFK
HTTP/1.1" 200 - "-" "Java/1.7.0_80"
127.0.0.1 - - [23/Nov/2016:08:10:28 +0000] "GET /api/atlas/lineage/96413699-cb08-4a2e-8f71-9a0b6aeb8ed4/inputs/graph
HTTP/1.1" 200 - "-" "Java/1.7.0_80"
127.0.0.1 - - [23/Nov/2016:08:10:30 +0000] "GET /api/atlas/lineage/hive/table/sales_fact8MZuM5xfbr/outputs/graph
HTTP/1.1" 200 - "-" "Java/1.7.0_80"
127.0.0.1 - - [23/Nov/2016:08:10:32 +0000] "GET /api/atlas/entities?type=hive_table&property=qualifiedName&value=sales_fact8MZuM5xfbr
HTTP/1.1" 200 - "-" "Java/1.7.0_80"
127.0.0.1 - - [23/Nov/2016:08:10:32 +0000] "GET /api/atlas/lineage/d1d2dd67-0bd7-41fc-8161-22bb629aa0f3/outputs/graph
HTTP/1.1" 200 - "-" "Java/1.7.0_80"
127.0.0.1 - - [23/Nov/2016:08:10:34 +0000] "GET /api/atlas/lineage/hive/table/sales_fact8MZuM5xfbr/schema
HTTP/1.1" 200 - "-" "Java/1.7.0_80"
127.0.0.1 - - [23/Nov/2016:08:10:35 +0000] "GET /api/atlas/lineage/hive/table/Sales1ekzKRxOM4/schema
HTTP/1.1" 404 - "-" "Java/1.7.0_80"
127.0.0.1 - - [23/Nov/2016:08:10:35 +0000] "GET /api/atlas/entities?type=hive_table&property=qualifiedName&value=sales_fact8MZuM5xfbr
HTTP/1.1" 200 - "-" "Java/1.7.0_80"
127.0.0.1 - - [23/Nov/2016:08:10:35 +0000] "GET /api/atlas/lineage/d1d2dd67-0bd7-41fc-8161-22bb629aa0f3/schema
HTTP/1.1" 200 - "-" "Java/1.7.0_80"
127.0.0.1 - - [23/Nov/2016:08:10:36 +0000] "GET /api/atlas/lineage/hive/table/blah/schema
HTTP/1.1" 404 - "-" "Java/1.7.0_80"
127.0.0.1 - - [23/Nov/2016:08:10:36 +0000] "GET /api/atlas/entities?type=hive_table&property=qualifiedName&value=sales_fact_monthly_mvba5VoDYgy9
HTTP/1.1" 200 - "-" "Java/1.7.0_80"
127.0.0.1 - - [23/Nov/2016:08:10:36 +0000] "GET /api/atlas/v2/lineage/fefcf208-7a0f-4f95-916e-a36bc517f379?direction=INPUT&depth=5
HTTP/1.1" 404 - "-" "Java/1.7.0_80"
127.0.0.1 - - [23/Nov/2016:08:10:36 +0000] "GET /api/atlas/entities?type=hive_table&property=qualifiedName&value=sales_fact_monthly_mvba5VoDYgy9
HTTP/1.1" 200 - "-" "Java/1.7.0_80"
127.0.0.1 - - [23/Nov/2016:08:10:36 +0000] "GET /api/atlas/v2/lineage/fefcf208-7a0f-4f95-916e-a36bc517f379?direction=BOTH&depth=5
HTTP/1.1" 404 - "-" "Java/1.7.0_80"
127.0.0.1 - - [23/Nov/2016:08:10:36 +0000] "GET /api/atlas/entities?type=hive_table&property=qualifiedName&value=sales_factCIER00sZGE
HTTP/1.1" 200 - "-" "Java/1.7.0_80"
127.0.0.1 - - [23/Nov/2016:08:10:36 +0000] "GET /api/atlas/v2/lineage/d534a665-bccf-4b88-b2b9-a1c1070e74eb?direction=OUTPUT&depth=5
HTTP/1.1" 404 - "-" "Java/1.7.0_80"
Tests run: 11, Failures: 3, Errors: 0, Skipped: 0, Time elapsed: 13.95 sec <<< FAILURE!
- in org.apache.atlas.web.resources.EntityLineageJerseyResourceIT
testInputLineageInfo(org.apache.atlas.web.resources.EntityLineageJerseyResourceIT)  Time elapsed:
0.047 sec  <<< FAILURE!
java.lang.AssertionError: expected:<200> but was:<404>
	at org.apache.atlas.web.resources.EntityLineageJerseyResourceIT.testInputLineageInfo(EntityLineageJerseyResourceIT.java:74)

testLineageInfo(org.apache.atlas.web.resources.EntityLineageJerseyResourceIT)  Time elapsed:
0.029 sec  <<< FAILURE!
java.lang.AssertionError: expected:<200> but was:<404>
	at org.apache.atlas.web.resources.EntityLineageJerseyResourceIT.testLineageInfo(EntityLineageJerseyResourceIT.java:134)

testOutputLineageInfo(org.apache.atlas.web.resources.EntityLineageJerseyResourceIT)  Time
elapsed: 0.028 sec  <<< FAILURE!
java.lang.AssertionError: expected:<200> but was:<404>
	at org.apache.atlas.web.resources.EntityLineageJerseyResourceIT.testOutputLineageInfo(EntityLineageJerseyResourceIT.java:104)

Running org.apache.atlas.CredentialProviderUtilityIT
Tests run: 4, Failures: 0, Errors: 0, Skipped: 0, Time elapsed: 1.546 sec - in org.apache.atlas.CredentialProviderUtilityIT
Running org.apache.atlas.notification.EntityNotificationIT
127.0.0.1 - - [23/Nov/2016:08:10:41 +0000] "GET /api/atlas/types/tableType HTTP/1.1" 200 -
"-" "Java/1.7.0_80"
127.0.0.1 - - [23/Nov/2016:08:10:41 +0000] "GET /api/atlas/types/serdeType HTTP/1.1" 200 -
"-" "Java/1.7.0_80"
127.0.0.1 - - [23/Nov/2016:08:10:41 +0000] "GET /api/atlas/types/classification HTTP/1.1"
200 - "-" "Java/1.7.0_80"
127.0.0.1 - - [23/Nov/2016:08:10:41 +0000] "GET /api/atlas/types/hive_db HTTP/1.1" 200 - "-"
"Java/1.7.0_80"
127.0.0.1 - - [23/Nov/2016:08:10:42 +0000] "POST /api/atlas/entities HTTP/1.1" 201 - "-" "Java/1.7.0_80"
127.0.0.1 - - [23/Nov/2016:08:10:43 +0000] "POST /api/atlas/entities HTTP/1.1" 201 - "-" "Java/1.7.0_80"
127.0.0.1 - - [23/Nov/2016:08:10:44 +0000] "POST /api/atlas/types HTTP/1.1" 201 - "-" "Java/1.7.0_80"
127.0.0.1 - - [23/Nov/2016:08:10:44 +0000] "POST /api/atlas/types HTTP/1.1" 201 - "-" "Java/1.7.0_80"
127.0.0.1 - - [23/Nov/2016:08:10:44 +0000] "POST /api/atlas/types HTTP/1.1" 201 - "-" "Java/1.7.0_80"
127.0.0.1 - - [23/Nov/2016:08:10:44 +0000] "POST /api/atlas/entities/e2b0be01-d52b-46cf-a22f-30308b444af8/traits
HTTP/1.1" 201 - "-" "Java/1.7.0_80"
127.0.0.1 - - [23/Nov/2016:08:10:44 +0000] "POST /api/atlas/types HTTP/1.1" 201 - "-" "Java/1.7.0_80"
127.0.0.1 - - [23/Nov/2016:08:10:44 +0000] "POST /api/atlas/entities/e2b0be01-d52b-46cf-a22f-30308b444af8/traits
HTTP/1.1" 201 - "-" "Java/1.7.0_80"
127.0.0.1 - - [23/Nov/2016:08:10:44 +0000] "DELETE /api/atlas/entities/e2b0be01-d52b-46cf-a22f-30308b444af8/traits/Traitfbmkh4gRx5
HTTP/1.1" 200 - "-" "Java/1.7.0_80"
127.0.0.1 - - [23/Nov/2016:08:10:44 +0000] "POST /api/atlas/entities/e2b0be01-d52b-46cf-a22f-30308b444af8?property=description
HTTP/1.1" 200 - "-" "Java/1.7.0_80"
127.0.0.1 - - [23/Nov/2016:08:10:44 +0000] "POST /api/atlas/entities HTTP/1.1" 201 - "-" "Java/1.7.0_80"
127.0.0.1 - - [23/Nov/2016:08:10:44 +0000] "POST /api/atlas/entities HTTP/1.1" 201 - "-" "Java/1.7.0_80"
127.0.0.1 - - [23/Nov/2016:08:10:44 +0000] "DELETE /api/atlas/entities?type=hive_table&property=qualifiedName&value=table-yRv90Hbb4I
HTTP/1.1" 200 - "-" "Java/1.7.0_80"
Tests run: 5, Failures: 0, Errors: 0, Skipped: 0, Time elapsed: 5.56 sec - in org.apache.atlas.notification.EntityNotificationIT
Running org.apache.atlas.notification.NotificationHookConsumerIT
127.0.0.1 - - [23/Nov/2016:08:10:47 +0000] "GET /api/atlas/types/tableType HTTP/1.1" 200 -
"-" "Java/1.7.0_80"
127.0.0.1 - - [23/Nov/2016:08:10:47 +0000] "GET /api/atlas/types/serdeType HTTP/1.1" 200 -
"-" "Java/1.7.0_80"
127.0.0.1 - - [23/Nov/2016:08:10:48 +0000] "GET /api/atlas/types/classification HTTP/1.1"
200 - "-" "Java/1.7.0_80"
127.0.0.1 - - [23/Nov/2016:08:10:48 +0000] "GET /api/atlas/types/hive_db HTTP/1.1" 200 - "-"
"Java/1.7.0_80"
127.0.0.1 - - [23/Nov/2016:08:10:48 +0000] "GET /api/atlas/discovery/search/dsl?query=hive_db+where+qualifiedName%3D'db1JobAkmfyw'&limit=10&offset=0
HTTP/1.1" 200 - "-" "Java/1.7.0_80"
127.0.0.1 - - [23/Nov/2016:08:10:49 +0000] "GET /api/atlas/entities?type=hive_db&property=qualifiedName&value=db1JobAkmfyw
HTTP/1.1" 200 - "-" "Java/1.7.0_80"
127.0.0.1 - - [23/Nov/2016:08:10:49 +0000] "GET /api/atlas/entities/4ca7ef6a-6703-4efa-bc1b-7363aaa62bb7/audit?count=1
HTTP/1.1" 200 - "-" "Java/1.7.0_80"
127.0.0.1 - - [23/Nov/2016:08:10:49 +0000] "POST /api/atlas/entities HTTP/1.1" 201 - "-" "Java/1.7.0_80"
127.0.0.1 - - [23/Nov/2016:08:10:49 +0000] "GET /api/atlas/entities/1e696a1e-98e6-4184-907b-e441b9ff3f33
HTTP/1.1" 200 - "-" "Java/1.7.0_80"
127.0.0.1 - - [23/Nov/2016:08:10:49 +0000] "GET /api/atlas/entities/1e696a1e-98e6-4184-907b-e441b9ff3f33
HTTP/1.1" 200 - "-" "Java/1.7.0_80"
127.0.0.1 - - [23/Nov/2016:08:10:50 +0000] "GET /api/atlas/discovery/search/dsl?query=hive_db+where+name%3D'dbdHpnmmVYWE'&limit=10&offset=0
HTTP/1.1" 200 - "-" "Java/1.7.0_80"
127.0.0.1 - - [23/Nov/2016:08:10:50 +0000] "GET /api/atlas/discovery/search/dsl?query=hive_db+where+name%3D'dbdHpnmmVYWE'&limit=10&offset=0
HTTP/1.1" 200 - "-" "Java/1.7.0_80"
127.0.0.1 - - [23/Nov/2016:08:10:51 +0000] "GET /api/atlas/discovery/search/dsl?query=hive_db+where+name%3D'dbdHpnmmVYWE'&limit=10&offset=0
HTTP/1.1" 200 - "-" "Java/1.7.0_80"
127.0.0.1 - - [23/Nov/2016:08:10:52 +0000] "POST /api/atlas/entities HTTP/1.1" 201 - "-" "Java/1.7.0_80"
127.0.0.1 - - [23/Nov/2016:08:10:52 +0000] "GET /api/atlas/discovery/search/dsl?query=hive_db+where+qualifiedName%3D'dbelYn4b7sPw'&limit=10&offset=0
HTTP/1.1" 200 - "-" "Java/1.7.0_80"
127.0.0.1 - - [23/Nov/2016:08:10:53 +0000] "GET /api/atlas/entities?type=hive_db&property=qualifiedName&value=dbelYn4b7sPw
HTTP/1.1" 200 - "-" "Java/1.7.0_80"
127.0.0.1 - - [23/Nov/2016:08:10:53 +0000] "POST /api/atlas/entities HTTP/1.1" 201 - "-" "Java/1.7.0_80"
127.0.0.1 - - [23/Nov/2016:08:10:53 +0000] "GET /api/atlas/entities?type=hive_db&property=qualifiedName&value=dbkjgssD81Hq
HTTP/1.1" 200 - "-" "Java/1.7.0_80"
127.0.0.1 - - [23/Nov/2016:08:10:53 +0000] "GET /api/atlas/entities?type=hive_db&property=qualifiedName&value=dbkjgssD81Hq
HTTP/1.1" 200 - "-" "Java/1.7.0_80"
127.0.0.1 - - [23/Nov/2016:08:10:53 +0000] "GET /api/atlas/entities?type=hive_db&property=qualifiedName&value=dbkjgssD81Hq
HTTP/1.1" 200 - "-" "Java/1.7.0_80"
127.0.0.1 - - [23/Nov/2016:08:10:53 +0000] "POST /api/atlas/entities HTTP/1.1" 201 - "-" "Java/1.7.0_80"
127.0.0.1 - - [23/Nov/2016:08:10:53 +0000] "GET /api/atlas/discovery/search/dsl?query=hive_db+where+qualifiedName%3D'dbxot197jHiP'&limit=10&offset=0
HTTP/1.1" 200 - "-" "Java/1.7.0_80"
127.0.0.1 - - [23/Nov/2016:08:10:54 +0000] "GET /api/atlas/discovery/search/dsl?query=hive_db+where+qualifiedName%3D'db04UQ1D9ApC'&limit=10&offset=0
HTTP/1.1" 200 - "-" "Java/1.7.0_80"
Tests run: 6, Failures: 0, Errors: 0, Skipped: 0, Time elapsed: 9.276 sec - in org.apache.atlas.notification.NotificationHookConsumerIT

Results :

Failed tests: 
  EntityJerseyResourceIT.testUTF8:751->BaseResourceIT.createType:121->BaseResourceIT.createType:126
» AtlasService
  EntityLineageJerseyResourceIT.testInputLineageInfo:74 expected:<200> but was:<404>
  EntityLineageJerseyResourceIT.testLineageInfo:134 expected:<200> but was:<404>
  EntityLineageJerseyResourceIT.testOutputLineageInfo:104 expected:<200> but was:<404>

Tests run: 76, Failures: 4, Errors: 0, Skipped: 0

[INFO] 
[INFO] --- jetty-maven-plugin:9.2.12.v20150709:stop (stop-jetty) @ atlas-webapp ---
[INFO] Waiting 10 seconds for jetty to stop
[INFO] Stopped ServerConnector@696cc73b{HTTP/1.1}{0.0.0.0:31000}
[INFO] Closing Spring root WebApplicationContext
[INFO] Shutting down log4j
log4j:WARN No appenders could be found for logger (org.apache.atlas.web.listeners.GuiceServletConfig).
log4j:WARN Please initialize the log4j system properly.
log4j:WARN See http://logging.apache.org/log4j/1.2/faq.html#noconfig for more info.
[INFO] Stopped o.e.j.m.p.JettyWebAppContext@23f3dc0f{/,<https://builds.apache.org/job/apache-atlas-nightly/ws/webapp/target/atlas-webapp-0.8-incubating-SNAPSHOT/,UNAVAILABLE}{/home/jenkins/jenkins-slave/workspace/apache-atlas-nightly/webapp/target/atlas-webapp-0.8-incubating-SNAPSHOT.war}>
[INFO] Server reports itself as stopped
[INFO] 
[INFO] --- maven-source-plugin:2.4:jar-no-fork (attach-sources) @ atlas-webapp ---
[INFO] Building jar: <https://builds.apache.org/job/apache-atlas-nightly/ws/webapp/target/atlas-webapp-0.8-incubating-SNAPSHOT-sources.jar>
[INFO] 
[INFO] --- maven-source-plugin:2.4:test-jar-no-fork (attach-sources) @ atlas-webapp ---
[INFO] Building jar: <https://builds.apache.org/job/apache-atlas-nightly/ws/webapp/target/atlas-webapp-0.8-incubating-SNAPSHOT-test-sources.jar>
[INFO] 
[INFO] --- maven-failsafe-plugin:2.19.1:verify (verify) @ atlas-webapp ---
[INFO] ------------------------------------------------------------------------
[INFO] Reactor Summary:
[INFO] 
[INFO] apache-atlas ....................................... SUCCESS [  8.484 s]
[INFO] Apache Atlas Integration ........................... SUCCESS [ 43.560 s]
[INFO] Apache Atlas Common ................................ SUCCESS [ 15.886 s]
[INFO] Apache Atlas Typesystem ............................ SUCCESS [01:30 min]
[INFO] Apache Atlas Client ................................ SUCCESS [ 18.951 s]
[INFO] Apache Atlas Server API ............................ SUCCESS [ 10.933 s]
[INFO] Apache Atlas Notification .......................... SUCCESS [ 40.349 s]
[INFO] Apache Atlas Graph Database Projects ............... SUCCESS [  0.664 s]
[INFO] Apache Atlas Graph Database API .................... SUCCESS [  7.475 s]
[INFO] Graph Database Common Code ......................... SUCCESS [  7.440 s]
[INFO] Shaded version of Apache hbase client .............. SUCCESS [ 10.343 s]
[INFO] Apache Atlas Titan 0.5.4 Graph DB Impl ............. SUCCESS [02:04 min]
[INFO] Apache Atlas Graph Database Implementation Dependencies SUCCESS [  0.716 s]
[INFO] Shaded version of Apache hbase server .............. SUCCESS [ 24.000 s]
[INFO] Apache Atlas Repository ............................ SUCCESS [13:03 min]
[INFO] Apache Atlas Authorization ......................... SUCCESS [ 15.925 s]
[INFO] Apache Atlas Business Catalog ...................... SUCCESS [ 34.594 s]
[INFO] Apache Atlas UI .................................... SUCCESS [ 52.805 s]
[INFO] Apache Atlas Web Application ....................... FAILURE [09:57 min]
[INFO] Apache Atlas Documentation ......................... SKIPPED
[INFO] Apache Atlas FileSystem Model ...................... SKIPPED
[INFO] Apache Atlas Plugin Classloader .................... SKIPPED
[INFO] Apache Atlas Hive Bridge Shim ...................... SKIPPED
[INFO] Apache Atlas Hive Bridge ........................... SKIPPED
[INFO] Apache Atlas Falcon Bridge Shim .................... SKIPPED
[INFO] Apache Atlas Falcon Bridge ......................... SKIPPED
[INFO] Apache Atlas Sqoop Bridge Shim ..................... SKIPPED
[INFO] Apache Atlas Sqoop Bridge .......................... SKIPPED
[INFO] Apache Atlas Storm Bridge Shim ..................... SKIPPED
[INFO] Apache Atlas Storm Bridge .......................... SKIPPED
[INFO] Apache Atlas Distribution .......................... SKIPPED
[INFO] ------------------------------------------------------------------------
[INFO] BUILD FAILURE
[INFO] ------------------------------------------------------------------------
[INFO] Total time: 31:30 min
[INFO] Finished at: 2016-11-23T08:10:59+00:00
[INFO] Final Memory: 337M/1899M
[INFO] ------------------------------------------------------------------------
[ERROR] Failed to execute goal org.apache.maven.plugins:maven-failsafe-plugin:2.19.1:verify
(verify) on project atlas-webapp: There are test failures.
[ERROR] 
[ERROR] Please refer to <https://builds.apache.org/job/apache-atlas-nightly/ws/webapp/target/failsafe-reports>
for the individual test results.
[ERROR] -> [Help 1]
[ERROR] 
[ERROR] To see the full stack trace of the errors, re-run Maven with the -e switch.
[ERROR] Re-run Maven using the -X switch to enable full debug logging.
[ERROR] 
[ERROR] For more information about the errors and possible solutions, please read the following
articles:
[ERROR] [Help 1] http://cwiki.apache.org/confluence/display/MAVEN/MojoFailureException
[ERROR] 
[ERROR] After correcting the problems, you can resume the build with the command
[ERROR]   mvn <goals> -rf :atlas-webapp
Build step 'Execute shell' marked build as failure
[CHECKSTYLE] Collecting checkstyle analysis files...
[CHECKSTYLE] Finding all files that match the pattern **/target/checkstyle-result.xml
[CHECKSTYLE] Parsing 30 files in <https://builds.apache.org/job/apache-atlas-nightly/ws/>
[CHECKSTYLE] Successfully parsed file <https://builds.apache.org/job/apache-atlas-nightly/ws/addons/falcon-bridge-shim/target/checkstyle-result.xml>
with 0 unique warnings and 0 duplicates.
[CHECKSTYLE] Successfully parsed file <https://builds.apache.org/job/apache-atlas-nightly/ws/addons/falcon-bridge/target/checkstyle-result.xml>
with 59 unique warnings and 0 duplicates.
[CHECKSTYLE] Successfully parsed file <https://builds.apache.org/job/apache-atlas-nightly/ws/addons/hdfs-model/target/checkstyle-result.xml>
with 77 unique warnings and 0 duplicates.
[CHECKSTYLE] Successfully parsed file <https://builds.apache.org/job/apache-atlas-nightly/ws/addons/hive-bridge-shim/target/checkstyle-result.xml>
with 77 unique warnings and 0 duplicates.
[CHECKSTYLE] Successfully parsed file <https://builds.apache.org/job/apache-atlas-nightly/ws/addons/sqoop-bridge-shim/target/checkstyle-result.xml>
with 77 unique warnings and 0 duplicates.
[CHECKSTYLE] Successfully parsed file <https://builds.apache.org/job/apache-atlas-nightly/ws/addons/sqoop-bridge/target/checkstyle-result.xml>
with 95 unique warnings and 0 duplicates.
[CHECKSTYLE] Successfully parsed file <https://builds.apache.org/job/apache-atlas-nightly/ws/addons/storm-bridge-shim/target/checkstyle-result.xml>
with 95 unique warnings and 0 duplicates.
[CHECKSTYLE] Successfully parsed file <https://builds.apache.org/job/apache-atlas-nightly/ws/addons/storm-bridge/target/checkstyle-result.xml>
with 175 unique warnings and 0 duplicates.
[CHECKSTYLE] Successfully parsed file <https://builds.apache.org/job/apache-atlas-nightly/ws/authorization/target/checkstyle-result.xml>
with 313 unique warnings and 0 duplicates.
[CHECKSTYLE] Successfully parsed file <https://builds.apache.org/job/apache-atlas-nightly/ws/catalog/target/checkstyle-result.xml>
with 618 unique warnings and 0 duplicates.
[CHECKSTYLE] Successfully parsed file <https://builds.apache.org/job/apache-atlas-nightly/ws/client/target/checkstyle-result.xml>
with 748 unique warnings and 0 duplicates.
[CHECKSTYLE] Successfully parsed file <https://builds.apache.org/job/apache-atlas-nightly/ws/common/target/checkstyle-result.xml>
with 748 unique warnings and 0 duplicates.
[CHECKSTYLE] Successfully parsed file <https://builds.apache.org/job/apache-atlas-nightly/ws/dashboardv2/target/checkstyle-result.xml>
with 748 unique warnings and 0 duplicates.
[CHECKSTYLE] Successfully parsed file <https://builds.apache.org/job/apache-atlas-nightly/ws/distro/target/checkstyle-result.xml>
with 748 unique warnings and 0 duplicates.
[CHECKSTYLE] Successfully parsed file <https://builds.apache.org/job/apache-atlas-nightly/ws/docs/target/checkstyle-result.xml>
with 748 unique warnings and 0 duplicates.
[CHECKSTYLE] Successfully parsed file <https://builds.apache.org/job/apache-atlas-nightly/ws/graphdb/api/target/checkstyle-result.xml>
with 748 unique warnings and 0 duplicates.
[CHECKSTYLE] Successfully parsed file <https://builds.apache.org/job/apache-atlas-nightly/ws/graphdb/common/target/checkstyle-result.xml>
with 748 unique warnings and 0 duplicates.
[CHECKSTYLE] Successfully parsed file <https://builds.apache.org/job/apache-atlas-nightly/ws/graphdb/graphdb-impls/target/checkstyle-result.xml>
with 748 unique warnings and 0 duplicates.
[CHECKSTYLE] Successfully parsed file <https://builds.apache.org/job/apache-atlas-nightly/ws/graphdb/target/checkstyle-result.xml>
with 748 unique warnings and 0 duplicates.
[CHECKSTYLE] Successfully parsed file <https://builds.apache.org/job/apache-atlas-nightly/ws/graphdb/titan0/target/checkstyle-result.xml>
with 748 unique warnings and 0 duplicates.
[CHECKSTYLE] Successfully parsed file <https://builds.apache.org/job/apache-atlas-nightly/ws/intg/target/checkstyle-result.xml>
with 948 unique warnings and 0 duplicates.
[CHECKSTYLE] Successfully parsed file <https://builds.apache.org/job/apache-atlas-nightly/ws/notification/target/checkstyle-result.xml>
with 948 unique warnings and 0 duplicates.
[CHECKSTYLE] Successfully parsed file <https://builds.apache.org/job/apache-atlas-nightly/ws/plugin-classloader/target/checkstyle-result.xml>
with 948 unique warnings and 0 duplicates.
[CHECKSTYLE] Successfully parsed file <https://builds.apache.org/job/apache-atlas-nightly/ws/repository/target/checkstyle-result.xml>
with 2445 unique warnings and 0 duplicates.
[CHECKSTYLE] Successfully parsed file <https://builds.apache.org/job/apache-atlas-nightly/ws/server-api/target/checkstyle-result.xml>
with 2491 unique warnings and 0 duplicates.
[CHECKSTYLE] Successfully parsed file <https://builds.apache.org/job/apache-atlas-nightly/ws/shaded/hbase-client-shaded/target/checkstyle-result.xml>
with 2491 unique warnings and 0 duplicates.
[CHECKSTYLE] Successfully parsed file <https://builds.apache.org/job/apache-atlas-nightly/ws/shaded/hbase-server-shaded/target/checkstyle-result.xml>
with 2491 unique warnings and 0 duplicates.
[CHECKSTYLE] Successfully parsed file <https://builds.apache.org/job/apache-atlas-nightly/ws/target/checkstyle-result.xml>
with 2491 unique warnings and 0 duplicates.
[CHECKSTYLE] Successfully parsed file <https://builds.apache.org/job/apache-atlas-nightly/ws/titan/target/checkstyle-result.xml>
with 2953 unique warnings and 0 duplicates.
[CHECKSTYLE] Successfully parsed file <https://builds.apache.org/job/apache-atlas-nightly/ws/typesystem/target/checkstyle-result.xml>
with 3764 unique warnings and 0 duplicates.
[CHECKSTYLE] Computing warning deltas based on reference build #270
[FINDBUGS] Collecting findbugs analysis files...
[FINDBUGS] Finding all files that match the pattern **/target/findbugs.xml
[FINDBUGS] Parsing 22 files in <https://builds.apache.org/job/apache-atlas-nightly/ws/>
[FINDBUGS] Successfully parsed file <https://builds.apache.org/job/apache-atlas-nightly/ws/addons/falcon-bridge-shim/target/findbugs.xml>
with 0 unique warnings and 0 duplicates.
[FINDBUGS] Successfully parsed file <https://builds.apache.org/job/apache-atlas-nightly/ws/addons/falcon-bridge/target/findbugs.xml>
with 0 unique warnings and 0 duplicates.
[FINDBUGS] Successfully parsed file <https://builds.apache.org/job/apache-atlas-nightly/ws/addons/hdfs-model/target/findbugs.xml>
with 0 unique warnings and 0 duplicates.
[FINDBUGS] Successfully parsed file <https://builds.apache.org/job/apache-atlas-nightly/ws/addons/hive-bridge-shim/target/findbugs.xml>
with 0 unique warnings and 0 duplicates.
[FINDBUGS] Successfully parsed file <https://builds.apache.org/job/apache-atlas-nightly/ws/addons/sqoop-bridge-shim/target/findbugs.xml>
with 0 unique warnings and 0 duplicates.
[FINDBUGS] Successfully parsed file <https://builds.apache.org/job/apache-atlas-nightly/ws/addons/sqoop-bridge/target/findbugs.xml>
with 0 unique warnings and 0 duplicates.
[FINDBUGS] Successfully parsed file <https://builds.apache.org/job/apache-atlas-nightly/ws/addons/storm-bridge-shim/target/findbugs.xml>
with 0 unique warnings and 0 duplicates.
[FINDBUGS] Successfully parsed file <https://builds.apache.org/job/apache-atlas-nightly/ws/addons/storm-bridge/target/findbugs.xml>
with 0 unique warnings and 0 duplicates.
[FINDBUGS] Successfully parsed file <https://builds.apache.org/job/apache-atlas-nightly/ws/authorization/target/findbugs.xml>
with 0 unique warnings and 0 duplicates.
[FINDBUGS] Successfully parsed file <https://builds.apache.org/job/apache-atlas-nightly/ws/catalog/target/findbugs.xml>
with 0 unique warnings and 0 duplicates.
[FINDBUGS] Successfully parsed file <https://builds.apache.org/job/apache-atlas-nightly/ws/client/target/findbugs.xml>
with 0 unique warnings and 0 duplicates.
[FINDBUGS] Successfully parsed file <https://builds.apache.org/job/apache-atlas-nightly/ws/common/target/findbugs.xml>
with 0 unique warnings and 0 duplicates.
[FINDBUGS] Successfully parsed file <https://builds.apache.org/job/apache-atlas-nightly/ws/graphdb/api/target/findbugs.xml>
with 0 unique warnings and 0 duplicates.
[FINDBUGS] Successfully parsed file <https://builds.apache.org/job/apache-atlas-nightly/ws/graphdb/common/target/findbugs.xml>
with 0 unique warnings and 0 duplicates.
[FINDBUGS] Successfully parsed file <https://builds.apache.org/job/apache-atlas-nightly/ws/graphdb/titan0/target/findbugs.xml>
with 0 unique warnings and 0 duplicates.
[FINDBUGS] Successfully parsed file <https://builds.apache.org/job/apache-atlas-nightly/ws/intg/target/findbugs.xml>
with 0 unique warnings and 0 duplicates.
[FINDBUGS] Successfully parsed file <https://builds.apache.org/job/apache-atlas-nightly/ws/notification/target/findbugs.xml>
with 0 unique warnings and 0 duplicates.
[FINDBUGS] Successfully parsed file <https://builds.apache.org/job/apache-atlas-nightly/ws/plugin-classloader/target/findbugs.xml>
with 0 unique warnings and 0 duplicates.
[FINDBUGS] Successfully parsed file <https://builds.apache.org/job/apache-atlas-nightly/ws/repository/target/findbugs.xml>
with 0 unique warnings and 0 duplicates.
[FINDBUGS] Successfully parsed file <https://builds.apache.org/job/apache-atlas-nightly/ws/server-api/target/findbugs.xml>
with 0 unique warnings and 0 duplicates.
[FINDBUGS] Successfully parsed file <https://builds.apache.org/job/apache-atlas-nightly/ws/titan/target/findbugs.xml>
with 0 unique warnings and 0 duplicates.
[FINDBUGS] Successfully parsed file <https://builds.apache.org/job/apache-atlas-nightly/ws/typesystem/target/findbugs.xml>
with 0 unique warnings and 0 duplicates.
[FINDBUGS] Computing warning deltas based on reference build #270
Archiving artifacts
TestNG Reports Processing: START
Looking for TestNG results report in workspace using pattern: **/target/surefire-reports/testng-results.xml,**/target/failsafe-reports/testng-results.xml
testng-results.xml was last modified before this build started. Ignoring it.
testng-results.xml was last modified before this build started. Ignoring it.
testng-results.xml was last modified before this build started. Ignoring it.
testng-results.xml was last modified before this build started. Ignoring it.
testng-results.xml was last modified before this build started. Ignoring it.
testng-results.xml was last modified before this build started. Ignoring it.
testng-results.xml was last modified before this build started. Ignoring it.
testng-results.xml was last modified before this build started. Ignoring it.
testng-results.xml was last modified before this build started. Ignoring it.
testng-results.xml was last modified before this build started. Ignoring it.
testng-results.xml was last modified before this build started. Ignoring it.
Saving reports...
Processing '/x1/jenkins/jenkins-home/jobs/apache-atlas-nightly/builds/492/testng/testng-results-1.xml'
Processing '/x1/jenkins/jenkins-home/jobs/apache-atlas-nightly/builds/492/testng/testng-results-2.xml'
Processing '/x1/jenkins/jenkins-home/jobs/apache-atlas-nightly/builds/492/testng/testng-results-3.xml'
Processing '/x1/jenkins/jenkins-home/jobs/apache-atlas-nightly/builds/492/testng/testng-results-4.xml'
Processing '/x1/jenkins/jenkins-home/jobs/apache-atlas-nightly/builds/492/testng/testng-results-5.xml'
Processing '/x1/jenkins/jenkins-home/jobs/apache-atlas-nightly/builds/492/testng/testng-results-6.xml'
Processing '/x1/jenkins/jenkins-home/jobs/apache-atlas-nightly/builds/492/testng/testng-results-7.xml'
Processing '/x1/jenkins/jenkins-home/jobs/apache-atlas-nightly/builds/492/testng/testng-results.xml'
TestNG Reports Processing: FINISH

Mime
View raw message