atlas-dev mailing list archives

Site index · List index
Message view « Date » · « Thread »
Top « Date » · « Thread »
From Apache Jenkins Server <jenk...@builds.apache.org>
Subject Build failed in Jenkins: apache-atlas-nightly #485
Date Sat, 19 Nov 2016 01:28:42 GMT
See <https://builds.apache.org/job/apache-atlas-nightly/485/changes>

Changes:

[madhan] ATLAS-916: Return System Attributes in get entity definition

------------------------------------------
[...truncated 8208 lines...]
[INFO] Copying webapp resources [<https://builds.apache.org/job/apache-atlas-nightly/ws/webapp/src/main/webapp]>
[INFO] Building jar: <https://builds.apache.org/job/apache-atlas-nightly/ws/webapp/target/atlas-webapp-0.8-incubating-SNAPSHOT/WEB-INF/lib/atlas-webapp-0.8-incubating-SNAPSHOT.jar>
[INFO] Webapp assembled in [703 msecs]
[INFO] Building war: <https://builds.apache.org/job/apache-atlas-nightly/ws/webapp/target/atlas-webapp-0.8-incubating-SNAPSHOT.war>
[INFO] 
[INFO] --- maven-site-plugin:3.4:attach-descriptor (attach-descriptor) @ atlas-webapp ---
[INFO] 
[INFO] --- maven-surefire-plugin:2.18.1:test (default-test) @ atlas-webapp ---
[WARNING] The parameter forkMode is deprecated since version 2.14. Use forkCount and reuseForks
instead.
[INFO] Surefire report directory: <https://builds.apache.org/job/apache-atlas-nightly/ws/webapp/target/surefire-reports>
[INFO] Using configured provider org.apache.maven.surefire.testng.TestNGProvider
[WARNING] file.encoding cannot be set as system property, use <argLine>-Dfile.encoding=...<argLine>
instead

-------------------------------------------------------
 T E S T S
-------------------------------------------------------
Running org.apache.atlas.web.adapters.TestEntitiesREST
Tests run: 4, Failures: 0, Errors: 0, Skipped: 0, Time elapsed: 17.22 sec - in org.apache.atlas.web.adapters.TestEntitiesREST
Running org.apache.atlas.web.adapters.TestEntityREST$2
Tests run: 0, Failures: 0, Errors: 0, Skipped: 0, Time elapsed: 0.283 sec - in org.apache.atlas.web.adapters.TestEntityREST$2
Running org.apache.atlas.web.adapters.TestEntityREST
Tests run: 7, Failures: 0, Errors: 0, Skipped: 0, Time elapsed: 16.723 sec - in org.apache.atlas.web.adapters.TestEntityREST
Running org.apache.atlas.web.adapters.TestEntitiesREST$2
Tests run: 0, Failures: 0, Errors: 0, Skipped: 0, Time elapsed: 0.305 sec - in org.apache.atlas.web.adapters.TestEntitiesREST$2
Running org.apache.atlas.web.adapters.TestEntityREST$1
Tests run: 0, Failures: 0, Errors: 0, Skipped: 0, Time elapsed: 0.272 sec - in org.apache.atlas.web.adapters.TestEntityREST$1
Running org.apache.atlas.web.adapters.TestEntitiesREST$1
Tests run: 0, Failures: 0, Errors: 0, Skipped: 0, Time elapsed: 0.274 sec - in org.apache.atlas.web.adapters.TestEntitiesREST$1
Running org.apache.atlas.web.service.ActiveInstanceElectorServiceTest
Tests run: 14, Failures: 0, Errors: 0, Skipped: 0, Time elapsed: 1.308 sec - in org.apache.atlas.web.service.ActiveInstanceElectorServiceTest
Running org.apache.atlas.web.service.CuratorFactoryTest
Tests run: 3, Failures: 0, Errors: 0, Skipped: 0, Time elapsed: 1.387 sec - in org.apache.atlas.web.service.CuratorFactoryTest
Running org.apache.atlas.web.service.AtlasZookeeperSecurityPropertiesTest
Tests run: 6, Failures: 0, Errors: 0, Skipped: 0, Time elapsed: 0.387 sec - in org.apache.atlas.web.service.AtlasZookeeperSecurityPropertiesTest
Running org.apache.atlas.web.service.ServiceStateTest
Tests run: 3, Failures: 0, Errors: 0, Skipped: 0, Time elapsed: 0.874 sec - in org.apache.atlas.web.service.ServiceStateTest
Running org.apache.atlas.web.service.SecureEmbeddedServerTest
Tests run: 4, Failures: 0, Errors: 0, Skipped: 0, Time elapsed: 129.031 sec - in org.apache.atlas.web.service.SecureEmbeddedServerTest
Running org.apache.atlas.web.service.ActiveInstanceStateTest
Tests run: 5, Failures: 0, Errors: 0, Skipped: 0, Time elapsed: 1.083 sec - in org.apache.atlas.web.service.ActiveInstanceStateTest
Running org.apache.atlas.web.setup.SetupStepsTest
Tests run: 6, Failures: 0, Errors: 0, Skipped: 0, Time elapsed: 1.316 sec - in org.apache.atlas.web.setup.SetupStepsTest
Running org.apache.atlas.web.security.SSLAndKerberosTest
Tests run: 1, Failures: 1, Errors: 0, Skipped: 0, Time elapsed: 30.07 sec <<< FAILURE!
- in org.apache.atlas.web.security.SSLAndKerberosTest
testService(org.apache.atlas.web.security.SSLAndKerberosTest)  Time elapsed: 0.6 sec  <<<
FAILURE!
org.apache.atlas.AtlasServiceException: Metadata service API org.apache.atlas.AtlasBaseClient$APIInfo@891fb39
failed with status 400 (Bad Request) Response Body ({"error":"Given search filter did not
yield any results ","stackTrace":"java.lang.Exception: Given search filter did not yield any
results \n\tat org.apache.atlas.web.resources.TypesResource.getTypesByFilter(TypesResource.java:289)\n\tat
sun.reflect.NativeMethodAccessorImpl.invoke0(Native Method)\n\tat sun.reflect.NativeMethodAccessorImpl.invoke(NativeMethodAccessorImpl.java:57)\n\tat
sun.reflect.DelegatingMethodAccessorImpl.invoke(DelegatingMethodAccessorImpl.java:43)\n\tat
java.lang.reflect.Method.invoke(Method.java:606)\n\tat com.sun.jersey.spi.container.JavaMethodInvokerFactory$1.invoke(JavaMethodInvokerFactory.java:60)\n\tat
com.sun.jersey.server.impl.model.method.dispatch.AbstractResourceMethodDispatchProvider$ResponseOutInvoker._dispatch(AbstractResourceMethodDispatchProvider.java:205)\n\tat
com.sun.jersey.server.impl.model.method.dispatch.ResourceJavaMethodDispatcher.dispatch(ResourceJavaMethodDispatcher.java:75)\n\tat
com.sun.jersey.server.impl.uri.rules.HttpMethodRule.accept(HttpMethodRule.java:302)\n\tat
com.sun.jersey.server.impl.uri.rules.ResourceClassRule.accept(ResourceClassRule.java:108)\n\tat
com.sun.jersey.server.impl.uri.rules.RightHandPathRule.accept(RightHandPathRule.java:147)\n\tat
com.sun.jersey.server.impl.uri.rules.RootResourceClassesRule.accept(RootResourceClassesRule.java:84)\n\tat
com.sun.jersey.server.impl.application.WebApplicationImpl._handleRequest(WebApplicationImpl.java:1542)\n\tat
com.sun.jersey.server.impl.application.WebApplicationImpl._handleRequest(WebApplicationImpl.java:1473)\n\tat
com.sun.jersey.server.impl.application.WebApplicationImpl.handleRequest(WebApplicationImpl.java:1419)\n\tat
com.sun.jersey.server.impl.application.WebApplicationImpl.handleRequest(WebApplicationImpl.java:1409)\n\tat
com.sun.jersey.spi.container.servlet.WebComponent.service(WebComponent.java:409)\n\tat com.sun.jersey.spi.container.servlet.ServletContainer.service(ServletContainer.java:558)\n\tat
com.sun.jersey.spi.container.servlet.ServletContainer.service(ServletContainer.java:733)\n\tat
javax.servlet.http.HttpServlet.service(HttpServlet.java:790)\n\tat com.google.inject.servlet.ServletDefinition.doServiceImpl(ServletDefinition.java:286)\n\tat
com.google.inject.servlet.ServletDefinition.doService(ServletDefinition.java:276)\n\tat com.google.inject.servlet.ServletDefinition.service(ServletDefinition.java:181)\n\tat
com.google.inject.servlet.ManagedServletPipeline.service(ManagedServletPipeline.java:91)\n\tat
com.google.inject.servlet.FilterChainInvocation.doFilter(FilterChainInvocation.java:85)\n\tat
org.apache.atlas.web.filters.AuditFilter.doFilter(AuditFilter.java:71)\n\tat com.google.inject.servlet.FilterChainInvocation.doFilter(FilterChainInvocation.java:82)\n\tat
com.google.inject.servlet.ManagedFilterPipeline.dispatch(ManagedFilterPipeline.java:120)\n\tat
com.google.inject.servlet.GuiceFilter.doFilter(GuiceFilter.java:135)\n\tat org.eclipse.jetty.servlet.ServletHandler$CachedChain.doFilter(ServletHandler.java:1652)\n\tat
org.springframework.security.web.FilterChainProxy$VirtualFilterChain.doFilter(FilterChainProxy.java:330)\n\tat
org.apache.atlas.web.filters.AtlasAuthorizationFilter.doFilter(AtlasAuthorizationFilter.java:154)\n\tat
org.springframework.security.web.FilterChainProxy$VirtualFilterChain.doFilter(FilterChainProxy.java:342)\n\tat
org.springframework.security.web.access.intercept.FilterSecurityInterceptor.invoke(FilterSecurityInterceptor.java:118)\n\tat
org.springframework.security.web.access.intercept.FilterSecurityInterceptor.doFilter(FilterSecurityInterceptor.java:84)\n\tat
org.springframework.security.web.FilterChainProxy$VirtualFilterChain.doFilter(FilterChainProxy.java:342)\n\tat
org.springframework.security.web.access.ExceptionTranslationFilter.doFilter(ExceptionTranslationFilter.java:113)\n\tat
org.springframework.security.web.FilterChainProxy$VirtualFilterChain.doFilter(FilterChainProxy.java:342)\n\tat
org.springframework.security.web.session.SessionManagementFilter.doFilter(SessionManagementFilter.java:103)\n\tat
org.springframework.security.web.FilterChainProxy$VirtualFilterChain.doFilter(FilterChainProxy.java:342)\n\tat
org.springframework.security.web.authentication.AnonymousAuthenticationFilter.doFilter(AnonymousAuthenticationFilter.java:113)\n\tat
org.springframework.security.web.FilterChainProxy$VirtualFilterChain.doFilter(FilterChainProxy.java:342)\n\tat
org.apache.atlas.web.filters.AtlasCSRFPreventionFilter$ServletFilterHttpInteraction.proceed(AtlasCSRFPreventionFilter.java:232)\n\tat
org.apache.atlas.web.filters.AtlasCSRFPreventionFilter.handleHttpInteraction(AtlasCSRFPreventionFilter.java:177)\n\tat
org.apache.atlas.web.filters.AtlasCSRFPreventionFilter.doFilter(AtlasCSRFPreventionFilter.java:187)\n\tat
org.springframework.security.web.FilterChainProxy$VirtualFilterChain.doFilter(FilterChainProxy.java:342)\n\tat
org.apache.atlas.web.filters.AtlasAuthenticationFilter$3.doFilter(AtlasAuthenticationFilter.java:300)\n\tat
org.apache.atlas.web.filters.AtlasAuthenticationFilter.doKerberosAuth(AtlasAuthenticationFilter.java:408)\n\tat
org.apache.atlas.web.filters.AtlasAuthenticationFilter.doFilter(AtlasAuthenticationFilter.java:316)\n\tat
org.springframework.security.web.FilterChainProxy$VirtualFilterChain.doFilter(FilterChainProxy.java:342)\n\tat
org.springframework.security.web.servletapi.SecurityContextHolderAwareRequestFilter.doFilter(SecurityContextHolderAwareRequestFilter.java:54)\n\tat
org.springframework.security.web.FilterChainProxy$VirtualFilterChain.doFilter(FilterChainProxy.java:342)\n\tat
org.springframework.security.web.savedrequest.RequestCacheAwareFilter.doFilter(RequestCacheAwareFilter.java:45)\n\tat
org.springframework.security.web.FilterChainProxy$VirtualFilterChain.doFilter(FilterChainProxy.java:342)\n\tat
org.apache.atlas.web.filters.AtlasKnoxSSOAuthenticationFilter.doFilter(AtlasKnoxSSOAuthenticationFilter.java:113)\n\tat
org.springframework.security.web.FilterChainProxy$VirtualFilterChain.doFilter(FilterChainProxy.java:342)\n\tat
org.springframework.security.web.authentication.www.BasicAuthenticationFilter.doFilter(BasicAuthenticationFilter.java:150)\n\tat
org.springframework.security.web.FilterChainProxy$VirtualFilterChain.doFilter(FilterChainProxy.java:342)\n\tat
org.springframework.security.web.authentication.AbstractAuthenticationProcessingFilter.doFilter(AbstractAuthenticationProcessingFilter.java:183)\n\tat
org.springframework.security.web.FilterChainProxy$VirtualFilterChain.doFilter(FilterChainProxy.java:342)\n\tat
org.springframework.security.web.authentication.logout.LogoutFilter.doFilter(LogoutFilter.java:105)\n\tat
org.springframework.security.web.FilterChainProxy$VirtualFilterChain.doFilter(FilterChainProxy.java:342)\n\tat
org.springframework.security.web.context.SecurityContextPersistenceFilter.doFilter(SecurityContextPersistenceFilter.java:87)\n\tat
org.springframework.security.web.FilterChainProxy$VirtualFilterChain.doFilter(FilterChainProxy.java:342)\n\tat
org.springframework.security.web.FilterChainProxy.doFilterInternal(FilterChainProxy.java:192)\n\tat
org.springframework.security.web.FilterChainProxy.doFilter(FilterChainProxy.java:160)\n\tat
org.springframework.web.filter.DelegatingFilterProxy.invokeDelegate(DelegatingFilterProxy.java:346)\n\tat
org.springframework.web.filter.DelegatingFilterProxy.doFilter(DelegatingFilterProxy.java:259)\n\tat
org.eclipse.jetty.servlet.ServletHandler$CachedChain.doFilter(ServletHandler.java:1652)\n\tat
org.eclipse.jetty.servlet.ServletHandler.doHandle(ServletHandler.java:585)\n\tat org.eclipse.jetty.server.handler.ScopedHandler.handle(ScopedHandler.java:143)\n\tat
org.eclipse.jetty.security.SecurityHandler.handle(SecurityHandler.java:577)\n\tat org.eclipse.jetty.server.session.SessionHandler.doHandle(SessionHandler.java:223)\n\tat
org.eclipse.jetty.server.handler.ContextHandler.doHandle(ContextHandler.java:1127)\n\tat org.eclipse.jetty.servlet.ServletHandler.doScope(ServletHandler.java:515)\n\tat
org.eclipse.jetty.server.session.SessionHandler.doScope(SessionHandler.java:185)\n\tat org.eclipse.jetty.server.handler.ContextHandler.doScope(ContextHandler.java:1061)\n\tat
org.eclipse.jetty.server.handler.ScopedHandler.handle(ScopedHandler.java:141)\n\tat org.eclipse.jetty.server.handler.HandlerWrapper.handle(HandlerWrapper.java:97)\n\tat
org.eclipse.jetty.server.Server.handle(Server.java:499)\n\tat org.eclipse.jetty.server.HttpChannel.handle(HttpChannel.java:310)\n\tat
org.eclipse.jetty.server.HttpConnection.onFillable(HttpConnection.java:257)\n\tat org.eclipse.jetty.io.AbstractConnection$2.run(AbstractConnection.java:540)\n\tat
java.util.concurrent.ThreadPoolExecutor.runWorker(ThreadPoolExecutor.java:1145)\n\tat java.util.concurrent.ThreadPoolExecutor$Worker.run(ThreadPoolExecutor.java:615)\n\tat
java.lang.Thread.run(Thread.java:745)\n"})
	at org.apache.atlas.AtlasBaseClient.callAPIWithResource(AtlasBaseClient.java:313)
	at org.apache.atlas.AtlasBaseClient.callAPIWithResource(AtlasBaseClient.java:414)
	at org.apache.atlas.AtlasBaseClient.callAPIWithRetries(AtlasBaseClient.java:398)
	at org.apache.atlas.AtlasBaseClient.callAPI(AtlasBaseClient.java:419)
	at org.apache.atlas.AtlasClient.callAPI(AtlasClient.java:958)
	at org.apache.atlas.AtlasClient.listTypes(AtlasClient.java:388)
	at org.apache.atlas.web.security.SSLAndKerberosTest.testService(SSLAndKerberosTest.java:177)

Running org.apache.atlas.web.security.NegativeSSLAndKerberosTest
Tests run: 1, Failures: 0, Errors: 0, Skipped: 0, Time elapsed: 46.104 sec - in org.apache.atlas.web.security.NegativeSSLAndKerberosTest
Running org.apache.atlas.web.security.FileAuthenticationTest
Tests run: 6, Failures: 0, Errors: 0, Skipped: 0, Time elapsed: 3.145 sec - in org.apache.atlas.web.security.FileAuthenticationTest
Running org.apache.atlas.web.security.UserDaoTest
Tests run: 2, Failures: 0, Errors: 0, Skipped: 0, Time elapsed: 0.633 sec - in org.apache.atlas.web.security.UserDaoTest
Running org.apache.atlas.web.security.SSLTest
Tests run: 1, Failures: 1, Errors: 0, Skipped: 0, Time elapsed: 25.714 sec <<< FAILURE!
- in org.apache.atlas.web.security.SSLTest
testService(org.apache.atlas.web.security.SSLTest)  Time elapsed: 0.592 sec  <<<
FAILURE!
org.apache.atlas.AtlasServiceException: Metadata service API org.apache.atlas.AtlasBaseClient$APIInfo@2ef642af
failed with status 400 (Bad Request) Response Body ({"error":"Given search filter did not
yield any results ","stackTrace":"java.lang.Exception: Given search filter did not yield any
results \n\tat org.apache.atlas.web.resources.TypesResource.getTypesByFilter(TypesResource.java:289)\n\tat
sun.reflect.NativeMethodAccessorImpl.invoke0(Native Method)\n\tat sun.reflect.NativeMethodAccessorImpl.invoke(NativeMethodAccessorImpl.java:57)\n\tat
sun.reflect.DelegatingMethodAccessorImpl.invoke(DelegatingMethodAccessorImpl.java:43)\n\tat
java.lang.reflect.Method.invoke(Method.java:606)\n\tat com.sun.jersey.spi.container.JavaMethodInvokerFactory$1.invoke(JavaMethodInvokerFactory.java:60)\n\tat
com.sun.jersey.server.impl.model.method.dispatch.AbstractResourceMethodDispatchProvider$ResponseOutInvoker._dispatch(AbstractResourceMethodDispatchProvider.java:205)\n\tat
com.sun.jersey.server.impl.model.method.dispatch.ResourceJavaMethodDispatcher.dispatch(ResourceJavaMethodDispatcher.java:75)\n\tat
com.sun.jersey.server.impl.uri.rules.HttpMethodRule.accept(HttpMethodRule.java:302)\n\tat
com.sun.jersey.server.impl.uri.rules.ResourceClassRule.accept(ResourceClassRule.java:108)\n\tat
com.sun.jersey.server.impl.uri.rules.RightHandPathRule.accept(RightHandPathRule.java:147)\n\tat
com.sun.jersey.server.impl.uri.rules.RootResourceClassesRule.accept(RootResourceClassesRule.java:84)\n\tat
com.sun.jersey.server.impl.application.WebApplicationImpl._handleRequest(WebApplicationImpl.java:1542)\n\tat
com.sun.jersey.server.impl.application.WebApplicationImpl._handleRequest(WebApplicationImpl.java:1473)\n\tat
com.sun.jersey.server.impl.application.WebApplicationImpl.handleRequest(WebApplicationImpl.java:1419)\n\tat
com.sun.jersey.server.impl.application.WebApplicationImpl.handleRequest(WebApplicationImpl.java:1409)\n\tat
com.sun.jersey.spi.container.servlet.WebComponent.service(WebComponent.java:409)\n\tat com.sun.jersey.spi.container.servlet.ServletContainer.service(ServletContainer.java:558)\n\tat
com.sun.jersey.spi.container.servlet.ServletContainer.service(ServletContainer.java:733)\n\tat
javax.servlet.http.HttpServlet.service(HttpServlet.java:790)\n\tat com.google.inject.servlet.ServletDefinition.doServiceImpl(ServletDefinition.java:286)\n\tat
com.google.inject.servlet.ServletDefinition.doService(ServletDefinition.java:276)\n\tat com.google.inject.servlet.ServletDefinition.service(ServletDefinition.java:181)\n\tat
com.google.inject.servlet.ManagedServletPipeline.service(ManagedServletPipeline.java:91)\n\tat
com.google.inject.servlet.FilterChainInvocation.doFilter(FilterChainInvocation.java:85)\n\tat
org.apache.atlas.web.filters.AuditFilter.doFilter(AuditFilter.java:71)\n\tat com.google.inject.servlet.FilterChainInvocation.doFilter(FilterChainInvocation.java:82)\n\tat
com.google.inject.servlet.ManagedFilterPipeline.dispatch(ManagedFilterPipeline.java:120)\n\tat
com.google.inject.servlet.GuiceFilter.doFilter(GuiceFilter.java:135)\n\tat org.eclipse.jetty.servlet.ServletHandler$CachedChain.doFilter(ServletHandler.java:1652)\n\tat
org.springframework.security.web.FilterChainProxy$VirtualFilterChain.doFilter(FilterChainProxy.java:330)\n\tat
org.apache.atlas.web.filters.AtlasAuthorizationFilter.doFilter(AtlasAuthorizationFilter.java:154)\n\tat
org.springframework.security.web.FilterChainProxy$VirtualFilterChain.doFilter(FilterChainProxy.java:342)\n\tat
org.springframework.security.web.access.intercept.FilterSecurityInterceptor.invoke(FilterSecurityInterceptor.java:118)\n\tat
org.springframework.security.web.access.intercept.FilterSecurityInterceptor.doFilter(FilterSecurityInterceptor.java:84)\n\tat
org.springframework.security.web.FilterChainProxy$VirtualFilterChain.doFilter(FilterChainProxy.java:342)\n\tat
org.springframework.security.web.access.ExceptionTranslationFilter.doFilter(ExceptionTranslationFilter.java:113)\n\tat
org.springframework.security.web.FilterChainProxy$VirtualFilterChain.doFilter(FilterChainProxy.java:342)\n\tat
org.springframework.security.web.session.SessionManagementFilter.doFilter(SessionManagementFilter.java:103)\n\tat
org.springframework.security.web.FilterChainProxy$VirtualFilterChain.doFilter(FilterChainProxy.java:342)\n\tat
org.springframework.security.web.authentication.AnonymousAuthenticationFilter.doFilter(AnonymousAuthenticationFilter.java:113)\n\tat
org.springframework.security.web.FilterChainProxy$VirtualFilterChain.doFilter(FilterChainProxy.java:342)\n\tat
org.apache.atlas.web.filters.AtlasCSRFPreventionFilter$ServletFilterHttpInteraction.proceed(AtlasCSRFPreventionFilter.java:232)\n\tat
org.apache.atlas.web.filters.AtlasCSRFPreventionFilter.handleHttpInteraction(AtlasCSRFPreventionFilter.java:177)\n\tat
org.apache.atlas.web.filters.AtlasCSRFPreventionFilter.doFilter(AtlasCSRFPreventionFilter.java:187)\n\tat
org.springframework.security.web.FilterChainProxy$VirtualFilterChain.doFilter(FilterChainProxy.java:342)\n\tat
org.apache.atlas.web.filters.AtlasAuthenticationFilter.doFilter(AtlasAuthenticationFilter.java:321)\n\tat
org.springframework.security.web.FilterChainProxy$VirtualFilterChain.doFilter(FilterChainProxy.java:342)\n\tat
org.springframework.security.web.servletapi.SecurityContextHolderAwareRequestFilter.doFilter(SecurityContextHolderAwareRequestFilter.java:54)\n\tat
org.springframework.security.web.FilterChainProxy$VirtualFilterChain.doFilter(FilterChainProxy.java:342)\n\tat
org.springframework.security.web.savedrequest.RequestCacheAwareFilter.doFilter(RequestCacheAwareFilter.java:45)\n\tat
org.springframework.security.web.FilterChainProxy$VirtualFilterChain.doFilter(FilterChainProxy.java:342)\n\tat
org.apache.atlas.web.filters.AtlasKnoxSSOAuthenticationFilter.doFilter(AtlasKnoxSSOAuthenticationFilter.java:113)\n\tat
org.springframework.security.web.FilterChainProxy$VirtualFilterChain.doFilter(FilterChainProxy.java:342)\n\tat
org.springframework.security.web.authentication.www.BasicAuthenticationFilter.doFilter(BasicAuthenticationFilter.java:201)\n\tat
org.springframework.security.web.FilterChainProxy$VirtualFilterChain.doFilter(FilterChainProxy.java:342)\n\tat
org.springframework.security.web.authentication.AbstractAuthenticationProcessingFilter.doFilter(AbstractAuthenticationProcessingFilter.java:183)\n\tat
org.springframework.security.web.FilterChainProxy$VirtualFilterChain.doFilter(FilterChainProxy.java:342)\n\tat
org.springframework.security.web.authentication.logout.LogoutFilter.doFilter(LogoutFilter.java:105)\n\tat
org.springframework.security.web.FilterChainProxy$VirtualFilterChain.doFilter(FilterChainProxy.java:342)\n\tat
org.springframework.security.web.context.SecurityContextPersistenceFilter.doFilter(SecurityContextPersistenceFilter.java:87)\n\tat
org.springframework.security.web.FilterChainProxy$VirtualFilterChain.doFilter(FilterChainProxy.java:342)\n\tat
org.springframework.security.web.FilterChainProxy.doFilterInternal(FilterChainProxy.java:192)\n\tat
org.springframework.security.web.FilterChainProxy.doFilter(FilterChainProxy.java:160)\n\tat
org.springframework.web.filter.DelegatingFilterProxy.invokeDelegate(DelegatingFilterProxy.java:346)\n\tat
org.springframework.web.filter.DelegatingFilterProxy.doFilter(DelegatingFilterProxy.java:259)\n\tat
org.eclipse.jetty.servlet.ServletHandler$CachedChain.doFilter(ServletHandler.java:1652)\n\tat
org.eclipse.jetty.servlet.ServletHandler.doHandle(ServletHandler.java:585)\n\tat org.eclipse.jetty.server.handler.ScopedHandler.handle(ScopedHandler.java:143)\n\tat
org.eclipse.jetty.security.SecurityHandler.handle(SecurityHandler.java:577)\n\tat org.eclipse.jetty.server.session.SessionHandler.doHandle(SessionHandler.java:223)\n\tat
org.eclipse.jetty.server.handler.ContextHandler.doHandle(ContextHandler.java:1127)\n\tat org.eclipse.jetty.servlet.ServletHandler.doScope(ServletHandler.java:515)\n\tat
org.eclipse.jetty.server.session.SessionHandler.doScope(SessionHandler.java:185)\n\tat org.eclipse.jetty.server.handler.ContextHandler.doScope(ContextHandler.java:1061)\n\tat
org.eclipse.jetty.server.handler.ScopedHandler.handle(ScopedHandler.java:141)\n\tat org.eclipse.jetty.server.handler.HandlerWrapper.handle(HandlerWrapper.java:97)\n\tat
org.eclipse.jetty.server.Server.handle(Server.java:499)\n\tat org.eclipse.jetty.server.HttpChannel.handle(HttpChannel.java:310)\n\tat
org.eclipse.jetty.server.HttpConnection.onFillable(HttpConnection.java:257)\n\tat org.eclipse.jetty.io.AbstractConnection$2.run(AbstractConnection.java:540)\n\tat
java.util.concurrent.ThreadPoolExecutor.runWorker(ThreadPoolExecutor.java:1145)\n\tat java.util.concurrent.ThreadPoolExecutor$Worker.run(ThreadPoolExecutor.java:615)\n\tat
java.lang.Thread.run(Thread.java:745)\n"})
	at org.apache.atlas.AtlasBaseClient.callAPIWithResource(AtlasBaseClient.java:313)
	at org.apache.atlas.AtlasBaseClient.callAPIWithResource(AtlasBaseClient.java:414)
	at org.apache.atlas.AtlasBaseClient.callAPIWithRetries(AtlasBaseClient.java:398)
	at org.apache.atlas.AtlasBaseClient.callAPI(AtlasBaseClient.java:419)
	at org.apache.atlas.AtlasClient.callAPI(AtlasClient.java:958)
	at org.apache.atlas.AtlasClient.listTypes(AtlasClient.java:388)
	at org.apache.atlas.web.security.SSLTest.testService(SSLTest.java:138)

Running org.apache.atlas.web.util.ServletsTest
Tests run: 1, Failures: 0, Errors: 0, Skipped: 0, Time elapsed: 0.904 sec - in org.apache.atlas.web.util.ServletsTest
Running org.apache.atlas.web.listeners.TestGuiceServletConfig
Tests run: 0, Failures: 0, Errors: 0, Skipped: 0, Time elapsed: 0.295 sec - in org.apache.atlas.web.listeners.TestGuiceServletConfig
Running org.apache.atlas.web.listeners.TestModule
Tests run: 0, Failures: 0, Errors: 0, Skipped: 0, Time elapsed: 0.307 sec - in org.apache.atlas.web.listeners.TestModule
Running org.apache.atlas.web.TestUtils
Tests run: 0, Failures: 0, Errors: 0, Skipped: 0, Time elapsed: 0.31 sec - in org.apache.atlas.web.TestUtils
Running org.apache.atlas.web.resources.EntityResourceTest
Tests run: 1, Failures: 0, Errors: 0, Skipped: 0, Time elapsed: 1.105 sec - in org.apache.atlas.web.resources.EntityResourceTest
Running org.apache.atlas.web.resources.AdminResourceTest
Tests run: 2, Failures: 0, Errors: 0, Skipped: 0, Time elapsed: 0.945 sec - in org.apache.atlas.web.resources.AdminResourceTest
Running org.apache.atlas.web.resources.TaxonomyServiceTest
Tests run: 12, Failures: 0, Errors: 0, Skipped: 0, Time elapsed: 1.167 sec - in org.apache.atlas.web.resources.TaxonomyServiceTest
Running org.apache.atlas.web.filters.ActiveServerFilterTest
Tests run: 9, Failures: 0, Errors: 0, Skipped: 0, Time elapsed: 1.064 sec - in org.apache.atlas.web.filters.ActiveServerFilterTest
Running org.apache.atlas.web.filters.AtlasCSRFPreventionFilterTest
Tests run: 0, Failures: 0, Errors: 0, Skipped: 0, Time elapsed: 0.262 sec - in org.apache.atlas.web.filters.AtlasCSRFPreventionFilterTest
Running org.apache.atlas.web.filters.AtlasAuthenticationSimpleFilterTest
Tests run: 0, Failures: 0, Errors: 0, Skipped: 0, Time elapsed: 0.338 sec - in org.apache.atlas.web.filters.AtlasAuthenticationSimpleFilterTest
Running org.apache.atlas.web.filters.AtlasAuthenticationKerberosFilterTest
Tests run: 0, Failures: 0, Errors: 0, Skipped: 0, Time elapsed: 0.351 sec - in org.apache.atlas.web.filters.AtlasAuthenticationKerberosFilterTest
Running org.apache.atlas.LocalAtlasClientTest
Tests run: 6, Failures: 0, Errors: 0, Skipped: 0, Time elapsed: 11.042 sec - in org.apache.atlas.LocalAtlasClientTest
Running org.apache.atlas.notification.NotificationHookConsumerKafkaTest
Tests run: 2, Failures: 0, Errors: 0, Skipped: 0, Time elapsed: 7.994 sec - in org.apache.atlas.notification.NotificationHookConsumerKafkaTest
Running org.apache.atlas.notification.NotificationEntityChangeListenerTest
Tests run: 1, Failures: 0, Errors: 0, Skipped: 0, Time elapsed: 0.963 sec - in org.apache.atlas.notification.NotificationEntityChangeListenerTest
Running org.apache.atlas.notification.NotificationHookConsumerTest
Tests run: 10, Failures: 0, Errors: 0, Skipped: 0, Time elapsed: 3.048 sec - in org.apache.atlas.notification.NotificationHookConsumerTest

Results :

Failed tests: 
  SSLAndKerberosTest.testService:177 » AtlasService Metadata service API org.apa...
  SSLTest.testService:138 » AtlasService Metadata service API org.apache.atlas.A...

Tests run: 107, Failures: 2, Errors: 0, Skipped: 0

[INFO] ------------------------------------------------------------------------
[INFO] Reactor Summary:
[INFO] 
[INFO] apache-atlas ....................................... SUCCESS [  8.137 s]
[INFO] Apache Atlas Integration ........................... SUCCESS [ 45.614 s]
[INFO] Apache Atlas Common ................................ SUCCESS [ 17.090 s]
[INFO] Apache Atlas Typesystem ............................ SUCCESS [01:38 min]
[INFO] Apache Atlas Client ................................ SUCCESS [ 21.135 s]
[INFO] Apache Atlas Server API ............................ SUCCESS [ 11.538 s]
[INFO] Apache Atlas Notification .......................... SUCCESS [ 41.096 s]
[INFO] Apache Atlas Graph Database Projects ............... SUCCESS [  0.629 s]
[INFO] Apache Atlas Graph Database API .................... SUCCESS [  7.576 s]
[INFO] Graph Database Common Code ......................... SUCCESS [  7.207 s]
[INFO] Shaded version of Apache hbase client .............. SUCCESS [ 10.062 s]
[INFO] Apache Atlas Titan 0.5.4 Graph DB Impl ............. SUCCESS [02:04 min]
[INFO] Apache Atlas Graph Database Implementation Dependencies SUCCESS [  0.630 s]
[INFO] Shaded version of Apache hbase server .............. SUCCESS [ 24.506 s]
[INFO] Apache Atlas Repository ............................ SUCCESS [13:16 min]
[INFO] Apache Atlas Authorization ......................... SUCCESS [ 15.462 s]
[INFO] Apache Atlas Business Catalog ...................... SUCCESS [ 34.184 s]
[INFO] Apache Atlas UI .................................... SUCCESS [ 52.398 s]
[INFO] Apache Atlas Web Application ....................... FAILURE [05:37 min]
[INFO] Apache Atlas Documentation ......................... SKIPPED
[INFO] Apache Atlas FileSystem Model ...................... SKIPPED
[INFO] Apache Atlas Plugin Classloader .................... SKIPPED
[INFO] Apache Atlas Hive Bridge Shim ...................... SKIPPED
[INFO] Apache Atlas Hive Bridge ........................... SKIPPED
[INFO] Apache Atlas Falcon Bridge Shim .................... SKIPPED
[INFO] Apache Atlas Falcon Bridge ......................... SKIPPED
[INFO] Apache Atlas Sqoop Bridge Shim ..................... SKIPPED
[INFO] Apache Atlas Sqoop Bridge .......................... SKIPPED
[INFO] Apache Atlas Storm Bridge Shim ..................... SKIPPED
[INFO] Apache Atlas Storm Bridge .......................... SKIPPED
[INFO] Apache Atlas Distribution .......................... SKIPPED
[INFO] ------------------------------------------------------------------------
[INFO] BUILD FAILURE
[INFO] ------------------------------------------------------------------------
[INFO] Total time: 27:36 min
[INFO] Finished at: 2016-11-19T01:21:19+00:00
[INFO] Final Memory: 163M/1170M
[INFO] ------------------------------------------------------------------------
[ERROR] Failed to execute goal org.apache.maven.plugins:maven-surefire-plugin:2.18.1:test
(default-test) on project atlas-webapp: There are test failures.
[ERROR] 
[ERROR] Please refer to <https://builds.apache.org/job/apache-atlas-nightly/ws/webapp/target/surefire-reports>
for the individual test results.
[ERROR] -> [Help 1]
[ERROR] 
[ERROR] To see the full stack trace of the errors, re-run Maven with the -e switch.
[ERROR] Re-run Maven using the -X switch to enable full debug logging.
[ERROR] 
[ERROR] For more information about the errors and possible solutions, please read the following
articles:
[ERROR] [Help 1] http://cwiki.apache.org/confluence/display/MAVEN/MojoFailureException
[ERROR] 
[ERROR] After correcting the problems, you can resume the build with the command
[ERROR]   mvn <goals> -rf :atlas-webapp
Build step 'Execute shell' marked build as failure
[CHECKSTYLE] Collecting checkstyle analysis files...
[CHECKSTYLE] Finding all files that match the pattern **/target/checkstyle-result.xml
[CHECKSTYLE] Parsing 30 files in <https://builds.apache.org/job/apache-atlas-nightly/ws/>
[CHECKSTYLE] Successfully parsed file <https://builds.apache.org/job/apache-atlas-nightly/ws/addons/falcon-bridge-shim/target/checkstyle-result.xml>
with 0 unique warnings and 0 duplicates.
[CHECKSTYLE] Successfully parsed file <https://builds.apache.org/job/apache-atlas-nightly/ws/addons/falcon-bridge/target/checkstyle-result.xml>
with 59 unique warnings and 0 duplicates.
[CHECKSTYLE] Successfully parsed file <https://builds.apache.org/job/apache-atlas-nightly/ws/addons/hdfs-model/target/checkstyle-result.xml>
with 77 unique warnings and 0 duplicates.
[CHECKSTYLE] Successfully parsed file <https://builds.apache.org/job/apache-atlas-nightly/ws/addons/hive-bridge-shim/target/checkstyle-result.xml>
with 77 unique warnings and 0 duplicates.
[CHECKSTYLE] Successfully parsed file <https://builds.apache.org/job/apache-atlas-nightly/ws/addons/sqoop-bridge-shim/target/checkstyle-result.xml>
with 77 unique warnings and 0 duplicates.
[CHECKSTYLE] Successfully parsed file <https://builds.apache.org/job/apache-atlas-nightly/ws/addons/sqoop-bridge/target/checkstyle-result.xml>
with 95 unique warnings and 0 duplicates.
[CHECKSTYLE] Successfully parsed file <https://builds.apache.org/job/apache-atlas-nightly/ws/addons/storm-bridge-shim/target/checkstyle-result.xml>
with 95 unique warnings and 0 duplicates.
[CHECKSTYLE] Successfully parsed file <https://builds.apache.org/job/apache-atlas-nightly/ws/addons/storm-bridge/target/checkstyle-result.xml>
with 175 unique warnings and 0 duplicates.
[CHECKSTYLE] Successfully parsed file <https://builds.apache.org/job/apache-atlas-nightly/ws/authorization/target/checkstyle-result.xml>
with 313 unique warnings and 0 duplicates.
[CHECKSTYLE] Successfully parsed file <https://builds.apache.org/job/apache-atlas-nightly/ws/catalog/target/checkstyle-result.xml>
with 618 unique warnings and 0 duplicates.
[CHECKSTYLE] Successfully parsed file <https://builds.apache.org/job/apache-atlas-nightly/ws/client/target/checkstyle-result.xml>
with 748 unique warnings and 0 duplicates.
[CHECKSTYLE] Successfully parsed file <https://builds.apache.org/job/apache-atlas-nightly/ws/common/target/checkstyle-result.xml>
with 748 unique warnings and 0 duplicates.
[CHECKSTYLE] Successfully parsed file <https://builds.apache.org/job/apache-atlas-nightly/ws/dashboardv2/target/checkstyle-result.xml>
with 748 unique warnings and 0 duplicates.
[CHECKSTYLE] Successfully parsed file <https://builds.apache.org/job/apache-atlas-nightly/ws/distro/target/checkstyle-result.xml>
with 748 unique warnings and 0 duplicates.
[CHECKSTYLE] Successfully parsed file <https://builds.apache.org/job/apache-atlas-nightly/ws/docs/target/checkstyle-result.xml>
with 748 unique warnings and 0 duplicates.
[CHECKSTYLE] Successfully parsed file <https://builds.apache.org/job/apache-atlas-nightly/ws/graphdb/api/target/checkstyle-result.xml>
with 748 unique warnings and 0 duplicates.
[CHECKSTYLE] Successfully parsed file <https://builds.apache.org/job/apache-atlas-nightly/ws/graphdb/common/target/checkstyle-result.xml>
with 748 unique warnings and 0 duplicates.
[CHECKSTYLE] Successfully parsed file <https://builds.apache.org/job/apache-atlas-nightly/ws/graphdb/graphdb-impls/target/checkstyle-result.xml>
with 748 unique warnings and 0 duplicates.
[CHECKSTYLE] Successfully parsed file <https://builds.apache.org/job/apache-atlas-nightly/ws/graphdb/target/checkstyle-result.xml>
with 748 unique warnings and 0 duplicates.
[CHECKSTYLE] Successfully parsed file <https://builds.apache.org/job/apache-atlas-nightly/ws/graphdb/titan0/target/checkstyle-result.xml>
with 748 unique warnings and 0 duplicates.
[CHECKSTYLE] Successfully parsed file <https://builds.apache.org/job/apache-atlas-nightly/ws/intg/target/checkstyle-result.xml>
with 947 unique warnings and 0 duplicates.
[CHECKSTYLE] Successfully parsed file <https://builds.apache.org/job/apache-atlas-nightly/ws/notification/target/checkstyle-result.xml>
with 947 unique warnings and 0 duplicates.
[CHECKSTYLE] Successfully parsed file <https://builds.apache.org/job/apache-atlas-nightly/ws/plugin-classloader/target/checkstyle-result.xml>
with 947 unique warnings and 0 duplicates.
[CHECKSTYLE] Successfully parsed file <https://builds.apache.org/job/apache-atlas-nightly/ws/repository/target/checkstyle-result.xml>
with 2448 unique warnings and 0 duplicates.
[CHECKSTYLE] Successfully parsed file <https://builds.apache.org/job/apache-atlas-nightly/ws/server-api/target/checkstyle-result.xml>
with 2481 unique warnings and 0 duplicates.
[CHECKSTYLE] Successfully parsed file <https://builds.apache.org/job/apache-atlas-nightly/ws/shaded/hbase-client-shaded/target/checkstyle-result.xml>
with 2481 unique warnings and 0 duplicates.
[CHECKSTYLE] Successfully parsed file <https://builds.apache.org/job/apache-atlas-nightly/ws/shaded/hbase-server-shaded/target/checkstyle-result.xml>
with 2481 unique warnings and 0 duplicates.
[CHECKSTYLE] Successfully parsed file <https://builds.apache.org/job/apache-atlas-nightly/ws/target/checkstyle-result.xml>
with 2481 unique warnings and 0 duplicates.
[CHECKSTYLE] Successfully parsed file <https://builds.apache.org/job/apache-atlas-nightly/ws/titan/target/checkstyle-result.xml>
with 2943 unique warnings and 0 duplicates.
[CHECKSTYLE] Successfully parsed file <https://builds.apache.org/job/apache-atlas-nightly/ws/typesystem/target/checkstyle-result.xml>
with 3754 unique warnings and 0 duplicates.
[CHECKSTYLE] Computing warning deltas based on reference build #270
[FINDBUGS] Collecting findbugs analysis files...
[FINDBUGS] Finding all files that match the pattern **/target/findbugs.xml
[FINDBUGS] Parsing 22 files in <https://builds.apache.org/job/apache-atlas-nightly/ws/>
[FINDBUGS] Successfully parsed file <https://builds.apache.org/job/apache-atlas-nightly/ws/addons/falcon-bridge-shim/target/findbugs.xml>
with 0 unique warnings and 0 duplicates.
[FINDBUGS] Successfully parsed file <https://builds.apache.org/job/apache-atlas-nightly/ws/addons/falcon-bridge/target/findbugs.xml>
with 0 unique warnings and 0 duplicates.
[FINDBUGS] Successfully parsed file <https://builds.apache.org/job/apache-atlas-nightly/ws/addons/hdfs-model/target/findbugs.xml>
with 0 unique warnings and 0 duplicates.
[FINDBUGS] Successfully parsed file <https://builds.apache.org/job/apache-atlas-nightly/ws/addons/hive-bridge-shim/target/findbugs.xml>
with 0 unique warnings and 0 duplicates.
[FINDBUGS] Successfully parsed file <https://builds.apache.org/job/apache-atlas-nightly/ws/addons/sqoop-bridge-shim/target/findbugs.xml>
with 0 unique warnings and 0 duplicates.
[FINDBUGS] Successfully parsed file <https://builds.apache.org/job/apache-atlas-nightly/ws/addons/sqoop-bridge/target/findbugs.xml>
with 0 unique warnings and 0 duplicates.
[FINDBUGS] Successfully parsed file <https://builds.apache.org/job/apache-atlas-nightly/ws/addons/storm-bridge-shim/target/findbugs.xml>
with 0 unique warnings and 0 duplicates.
[FINDBUGS] Successfully parsed file <https://builds.apache.org/job/apache-atlas-nightly/ws/addons/storm-bridge/target/findbugs.xml>
with 0 unique warnings and 0 duplicates.
[FINDBUGS] Successfully parsed file <https://builds.apache.org/job/apache-atlas-nightly/ws/authorization/target/findbugs.xml>
with 0 unique warnings and 0 duplicates.
[FINDBUGS] Successfully parsed file <https://builds.apache.org/job/apache-atlas-nightly/ws/catalog/target/findbugs.xml>
with 0 unique warnings and 0 duplicates.
[FINDBUGS] Successfully parsed file <https://builds.apache.org/job/apache-atlas-nightly/ws/client/target/findbugs.xml>
with 0 unique warnings and 0 duplicates.
[FINDBUGS] Successfully parsed file <https://builds.apache.org/job/apache-atlas-nightly/ws/common/target/findbugs.xml>
with 0 unique warnings and 0 duplicates.
[FINDBUGS] Successfully parsed file <https://builds.apache.org/job/apache-atlas-nightly/ws/graphdb/api/target/findbugs.xml>
with 0 unique warnings and 0 duplicates.
[FINDBUGS] Successfully parsed file <https://builds.apache.org/job/apache-atlas-nightly/ws/graphdb/common/target/findbugs.xml>
with 0 unique warnings and 0 duplicates.
[FINDBUGS] Successfully parsed file <https://builds.apache.org/job/apache-atlas-nightly/ws/graphdb/titan0/target/findbugs.xml>
with 0 unique warnings and 0 duplicates.
[FINDBUGS] Successfully parsed file <https://builds.apache.org/job/apache-atlas-nightly/ws/intg/target/findbugs.xml>
with 0 unique warnings and 0 duplicates.
[FINDBUGS] Successfully parsed file <https://builds.apache.org/job/apache-atlas-nightly/ws/notification/target/findbugs.xml>
with 0 unique warnings and 0 duplicates.
[FINDBUGS] Successfully parsed file <https://builds.apache.org/job/apache-atlas-nightly/ws/plugin-classloader/target/findbugs.xml>
with 0 unique warnings and 0 duplicates.
[FINDBUGS] Successfully parsed file <https://builds.apache.org/job/apache-atlas-nightly/ws/repository/target/findbugs.xml>
with 0 unique warnings and 0 duplicates.
[FINDBUGS] Successfully parsed file <https://builds.apache.org/job/apache-atlas-nightly/ws/server-api/target/findbugs.xml>
with 0 unique warnings and 0 duplicates.
[FINDBUGS] Successfully parsed file <https://builds.apache.org/job/apache-atlas-nightly/ws/titan/target/findbugs.xml>
with 0 unique warnings and 0 duplicates.
[FINDBUGS] Successfully parsed file <https://builds.apache.org/job/apache-atlas-nightly/ws/typesystem/target/findbugs.xml>
with 0 unique warnings and 0 duplicates.
[FINDBUGS] Computing warning deltas based on reference build #270
Archiving artifacts
TestNG Reports Processing: START
Looking for TestNG results report in workspace using pattern: **/target/surefire-reports/testng-results.xml,**/target/failsafe-reports/testng-results.xml
testng-results.xml was last modified before this build started. Ignoring it.
testng-results.xml was last modified before this build started. Ignoring it.
testng-results.xml was last modified before this build started. Ignoring it.
testng-results.xml was last modified before this build started. Ignoring it.
testng-results.xml was last modified before this build started. Ignoring it.
testng-results.xml was last modified before this build started. Ignoring it.
testng-results.xml was last modified before this build started. Ignoring it.
testng-results.xml was last modified before this build started. Ignoring it.
testng-results.xml was last modified before this build started. Ignoring it.
testng-results.xml was last modified before this build started. Ignoring it.
testng-results.xml was last modified before this build started. Ignoring it.
Saving reports...
Processing '/x1/jenkins/jenkins-home/jobs/apache-atlas-nightly/builds/485/testng/testng-results-1.xml'
Processing '/x1/jenkins/jenkins-home/jobs/apache-atlas-nightly/builds/485/testng/testng-results-2.xml'
Processing '/x1/jenkins/jenkins-home/jobs/apache-atlas-nightly/builds/485/testng/testng-results-3.xml'
Processing '/x1/jenkins/jenkins-home/jobs/apache-atlas-nightly/builds/485/testng/testng-results-4.xml'
Processing '/x1/jenkins/jenkins-home/jobs/apache-atlas-nightly/builds/485/testng/testng-results-5.xml'
Processing '/x1/jenkins/jenkins-home/jobs/apache-atlas-nightly/builds/485/testng/testng-results-6.xml'
Processing '/x1/jenkins/jenkins-home/jobs/apache-atlas-nightly/builds/485/testng/testng-results.xml'
TestNG Reports Processing: FINISH


Mime
View raw message