atlas-dev mailing list archives

Site index · List index
Message view « Date » · « Thread »
Top « Date » · « Thread »
From Apache Jenkins Server <jenk...@builds.apache.org>
Subject Build failed in Jenkins: apache-atlas-nightly #393
Date Thu, 04 Aug 2016 21:53:21 GMT
See <https://builds.apache.org/job/apache-atlas-nightly/393/changes>

Changes:

[sumasai.shivaprasad] ATLAS-1071 : Regression - UI - Details Button under Audits Tab is not

[sumasai.shivaprasad] ATLAS-762 - Assertion in NegativeSSLAndKerberosTest.testUnsecuredClient

[sumasai.shivaprasad] ATLAS-1088 Fix /search api to default to fulltext on dsl failure

[sumasai.shivaprasad] ATLAS-1086 Build failure in hive-bridge after security fixes in

[sumasai.shivaprasad] ATLAS-1089: fix Storm hook to handle cyclic references in topology

[kevalbhatt18] ATLAS-1080 : Regression - UI - hive_storagedesc is shown as undefined in

------------------------------------------
[...truncated 8031 lines...]
	at org.codehaus.plexus.classworlds.realm.ClassRealm.loadClass(ClassRealm.java:247)
	at org.codehaus.plexus.classworlds.realm.ClassRealm.loadClass(ClassRealm.java:239)
	at org.eclipse.jetty.webapp.WebAppClassLoader.loadClass(WebAppClassLoader.java:450)
	at org.eclipse.jetty.webapp.WebAppClassLoader.loadClass(WebAppClassLoader.java:403)
	at java.lang.Class.forName0(Native Method)
	at java.lang.Class.forName(Class.java:195)
	at com.thinkaurelius.titan.util.system.ConfigurationUtil.instantiate(ConfigurationUtil.java:42)
	... 77 more
[INFO] Started ServerConnector@4fd0431f{HTTP/1.1}{0.0.0.0:31000}
[WARNING] FAILED org.eclipse.jetty.maven.plugin.JettyServer@6b7c4374: java.lang.ExceptionInInitializerError
java.lang.ExceptionInInitializerError
	at org.apache.atlas.repository.graph.DeleteHandler.<clinit>(DeleteHandler.java:50)
	at java.lang.Class.forName0(Native Method)
	at java.lang.Class.forName(Class.java:195)
	at org.apache.atlas.ApplicationProperties.getClass(ApplicationProperties.java:115)
	at org.apache.atlas.RepositoryMetadataModule.getDeleteHandlerImpl(RepositoryMetadataModule.java:148)
	at org.apache.atlas.RepositoryMetadataModule.configure(RepositoryMetadataModule.java:95)
	at com.google.inject.AbstractModule.configure(AbstractModule.java:62)
	at com.google.inject.spi.Elements$RecordingBinder.install(Elements.java:340)
	at com.google.inject.spi.Elements.getElements(Elements.java:110)
	at com.google.inject.internal.InjectorShell$Builder.build(InjectorShell.java:138)
	at com.google.inject.internal.InternalInjectorCreator.build(InternalInjectorCreator.java:104)
	at com.google.inject.Guice.createInjector(Guice.java:96)
	at com.google.inject.Guice.createInjector(Guice.java:84)
	at org.apache.atlas.web.listeners.GuiceServletConfig.getInjector(GuiceServletConfig.java:77)
	at com.google.inject.servlet.GuiceServletContextListener.contextInitialized(GuiceServletContextListener.java:47)
	at org.apache.atlas.web.listeners.GuiceServletConfig.contextInitialized(GuiceServletConfig.java:131)
	at org.apache.atlas.web.listeners.TestGuiceServletConfig.contextInitialized(TestGuiceServletConfig.java:42)
	at org.eclipse.jetty.server.handler.ContextHandler.callContextInitialized(ContextHandler.java:800)
	at org.eclipse.jetty.servlet.ServletContextHandler.callContextInitialized(ServletContextHandler.java:444)
	at org.eclipse.jetty.server.handler.ContextHandler.startContext(ContextHandler.java:791)
	at org.eclipse.jetty.servlet.ServletContextHandler.startContext(ServletContextHandler.java:294)
	at org.eclipse.jetty.webapp.WebAppContext.startWebapp(WebAppContext.java:1349)
	at org.eclipse.jetty.maven.plugin.JettyWebAppContext.startWebapp(JettyWebAppContext.java:296)
	at org.eclipse.jetty.webapp.WebAppContext.startContext(WebAppContext.java:1342)
	at org.eclipse.jetty.server.handler.ContextHandler.doStart(ContextHandler.java:741)
	at org.eclipse.jetty.webapp.WebAppContext.doStart(WebAppContext.java:505)
	at org.eclipse.jetty.maven.plugin.JettyWebAppContext.doStart(JettyWebAppContext.java:365)
	at org.eclipse.jetty.util.component.AbstractLifeCycle.start(AbstractLifeCycle.java:68)
	at org.eclipse.jetty.util.component.ContainerLifeCycle.start(ContainerLifeCycle.java:132)
	at org.eclipse.jetty.util.component.ContainerLifeCycle.doStart(ContainerLifeCycle.java:114)
	at org.eclipse.jetty.server.handler.AbstractHandler.doStart(AbstractHandler.java:61)
	at org.eclipse.jetty.server.handler.ContextHandlerCollection.doStart(ContextHandlerCollection.java:163)
	at org.eclipse.jetty.util.component.AbstractLifeCycle.start(AbstractLifeCycle.java:68)
	at org.eclipse.jetty.util.component.ContainerLifeCycle.start(ContainerLifeCycle.java:132)
	at org.eclipse.jetty.util.component.ContainerLifeCycle.doStart(ContainerLifeCycle.java:114)
	at org.eclipse.jetty.server.handler.AbstractHandler.doStart(AbstractHandler.java:61)
	at org.eclipse.jetty.util.component.AbstractLifeCycle.start(AbstractLifeCycle.java:68)
	at org.eclipse.jetty.util.component.ContainerLifeCycle.start(ContainerLifeCycle.java:132)
	at org.eclipse.jetty.server.Server.start(Server.java:387)
	at org.eclipse.jetty.util.component.ContainerLifeCycle.doStart(ContainerLifeCycle.java:114)
	at org.eclipse.jetty.server.handler.AbstractHandler.doStart(AbstractHandler.java:61)
	at org.eclipse.jetty.server.Server.doStart(Server.java:354)
	at org.eclipse.jetty.maven.plugin.JettyServer.doStart(JettyServer.java:73)
	at org.eclipse.jetty.util.component.AbstractLifeCycle.start(AbstractLifeCycle.java:68)
	at org.eclipse.jetty.maven.plugin.AbstractJettyMojo.startJetty(AbstractJettyMojo.java:534)
	at org.eclipse.jetty.maven.plugin.AbstractJettyMojo.execute(AbstractJettyMojo.java:357)
	at org.eclipse.jetty.maven.plugin.JettyRunWarMojo.execute(JettyRunWarMojo.java:64)
	at org.eclipse.jetty.maven.plugin.JettyDeployWar.execute(JettyDeployWar.java:67)
	at org.apache.maven.plugin.DefaultBuildPluginManager.executeMojo(DefaultBuildPluginManager.java:134)
	at org.apache.maven.lifecycle.internal.MojoExecutor.execute(MojoExecutor.java:207)
	at org.apache.maven.lifecycle.internal.MojoExecutor.execute(MojoExecutor.java:153)
	at org.apache.maven.lifecycle.internal.MojoExecutor.execute(MojoExecutor.java:145)
	at org.apache.maven.lifecycle.internal.LifecycleModuleBuilder.buildProject(LifecycleModuleBuilder.java:116)
	at org.apache.maven.lifecycle.internal.LifecycleModuleBuilder.buildProject(LifecycleModuleBuilder.java:80)
	at org.apache.maven.lifecycle.internal.builder.singlethreaded.SingleThreadedBuilder.build(SingleThreadedBuilder.java:51)
	at org.apache.maven.lifecycle.internal.LifecycleStarter.execute(LifecycleStarter.java:128)
	at org.apache.maven.DefaultMaven.doExecute(DefaultMaven.java:307)
	at org.apache.maven.DefaultMaven.doExecute(DefaultMaven.java:193)
	at org.apache.maven.DefaultMaven.execute(DefaultMaven.java:106)
	at org.apache.maven.cli.MavenCli.execute(MavenCli.java:863)
	at org.apache.maven.cli.MavenCli.doMain(MavenCli.java:288)
	at org.apache.maven.cli.MavenCli.main(MavenCli.java:199)
	at sun.reflect.NativeMethodAccessorImpl.invoke0(Native Method)
	at sun.reflect.NativeMethodAccessorImpl.invoke(NativeMethodAccessorImpl.java:57)
	at sun.reflect.DelegatingMethodAccessorImpl.invoke(DelegatingMethodAccessorImpl.java:43)
	at java.lang.reflect.Method.invoke(Method.java:606)
	at org.codehaus.plexus.classworlds.launcher.Launcher.launchEnhanced(Launcher.java:289)
	at org.codehaus.plexus.classworlds.launcher.Launcher.launch(Launcher.java:229)
	at org.codehaus.plexus.classworlds.launcher.Launcher.mainWithExitCode(Launcher.java:415)
	at org.codehaus.plexus.classworlds.launcher.Launcher.main(Launcher.java:356)
Caused by: java.lang.IllegalArgumentException: Could not find implementation class: com.thinkaurelius.titan.diskstorage.berkeleyje.BerkeleyJEStoreManager
	at com.thinkaurelius.titan.util.system.ConfigurationUtil.instantiate(ConfigurationUtil.java:47)
	at com.thinkaurelius.titan.diskstorage.Backend.getImplementationClass(Backend.java:421)
	at com.thinkaurelius.titan.diskstorage.Backend.getStorageManager(Backend.java:361)
	at com.thinkaurelius.titan.graphdb.configuration.GraphDatabaseConfiguration.<init>(GraphDatabaseConfiguration.java:1275)
	at com.thinkaurelius.titan.core.TitanFactory.open(TitanFactory.java:93)
	at com.thinkaurelius.titan.core.TitanFactory.open(TitanFactory.java:73)
	at org.apache.atlas.repository.graph.TitanGraphProvider.getGraphInstance(TitanGraphProvider.java:105)
	at org.apache.atlas.repository.graph.GraphHelper.<clinit>(GraphHelper.java:69)
	... 70 more
Caused by: java.lang.ClassNotFoundException: com.thinkaurelius.titan.diskstorage.berkeleyje.BerkeleyJEStoreManager
	at org.codehaus.plexus.classworlds.strategy.SelfFirstStrategy.loadClass(SelfFirstStrategy.java:50)
	at org.codehaus.plexus.classworlds.realm.ClassRealm.unsynchronizedLoadClass(ClassRealm.java:271)
	at org.codehaus.plexus.classworlds.realm.ClassRealm.loadClass(ClassRealm.java:247)
	at org.codehaus.plexus.classworlds.realm.ClassRealm.loadClass(ClassRealm.java:239)
	at org.eclipse.jetty.webapp.WebAppClassLoader.loadClass(WebAppClassLoader.java:450)
	at org.eclipse.jetty.webapp.WebAppClassLoader.loadClass(WebAppClassLoader.java:403)
	at java.lang.Class.forName0(Native Method)
	at java.lang.Class.forName(Class.java:195)
	at com.thinkaurelius.titan.util.system.ConfigurationUtil.instantiate(ConfigurationUtil.java:42)
	... 77 more
[INFO] ------------------------------------------------------------------------
[INFO] Reactor Summary:
[INFO] 
[INFO] apache-atlas ....................................... SUCCESS [ 17.826 s]
[INFO] Apache Atlas Common ................................ SUCCESS [ 31.948 s]
[INFO] Apache Atlas Typesystem ............................ SUCCESS [01:28 min]
[INFO] Apache Atlas Client ................................ SUCCESS [ 23.469 s]
[INFO] Apache Atlas Server API ............................ SUCCESS [ 11.523 s]
[INFO] Apache Atlas Notification .......................... SUCCESS [ 35.684 s]
[INFO] Apache Atlas Graph Database Projects ............... SUCCESS [  0.615 s]
[INFO] Apache Atlas Graph Database API .................... SUCCESS [  8.737 s]
[INFO] Apache Atlas Titan ................................. SUCCESS [ 41.905 s]
[INFO] Apache Atlas Repository ............................ SUCCESS [11:50 min]
[INFO] Apache Atlas Authorization ......................... SUCCESS [ 18.451 s]
[INFO] Apache Atlas Business Catalog ...................... SUCCESS [ 39.847 s]
[INFO] Apache Atlas UI .................................... SUCCESS [01:03 min]
[INFO] Apache Atlas Web Application ....................... FAILURE [04:44 min]
[INFO] Apache Atlas Documentation ......................... SKIPPED
[INFO] Apache Atlas FileSystem Model ...................... SKIPPED
[INFO] Apache Atlas Plugin Classloader .................... SKIPPED
[INFO] Apache Atlas Hive Bridge Shim ...................... SKIPPED
[INFO] Apache Atlas Hive Bridge ........................... SKIPPED
[INFO] Apache Atlas Falcon Bridge Shim .................... SKIPPED
[INFO] Apache Atlas Falcon Bridge ......................... SKIPPED
[INFO] Apache Atlas Sqoop Bridge Shim ..................... SKIPPED
[INFO] Apache Atlas Sqoop Bridge .......................... SKIPPED
[INFO] Apache Atlas Storm Bridge Shim ..................... SKIPPED
[INFO] Apache Atlas Storm Bridge .......................... SKIPPED
[INFO] Apache Atlas Distribution .......................... SKIPPED
[INFO] ------------------------------------------------------------------------
[INFO] BUILD FAILURE
[INFO] ------------------------------------------------------------------------
[INFO] Total time: 22:59 min
[INFO] Finished at: 2016-08-04T21:51:56+00:00
[INFO] Final Memory: 230M/1782M
[INFO] ------------------------------------------------------------------------
[ERROR] Failed to execute goal org.eclipse.jetty:jetty-maven-plugin:9.2.12.v20150709:deploy-war
(start-jetty) on project atlas-webapp: Execution start-jetty of goal org.eclipse.jetty:jetty-maven-plugin:9.2.12.v20150709:deploy-war
failed: An API incompatibility was encountered while executing org.eclipse.jetty:jetty-maven-plugin:9.2.12.v20150709:deploy-war:
java.lang.ExceptionInInitializerError: null
[ERROR] -----------------------------------------------------
[ERROR] realm =    plugin>org.eclipse.jetty:jetty-maven-plugin:9.2.12.v20150709
[ERROR] strategy = org.codehaus.plexus.classworlds.strategy.SelfFirstStrategy
[ERROR] urls[0] = file:/home/jenkins/.m2/repository/org/eclipse/jetty/jetty-maven-plugin/9.2.12.v20150709/jetty-maven-plugin-9.2.12.v20150709.jar
[ERROR] urls[1] = file:/home/jenkins/.m2/repository/org/sonatype/sisu/sisu-inject-bean/2.1.1/sisu-inject-bean-2.1.1.jar
[ERROR] urls[2] = file:/home/jenkins/.m2/repository/org/sonatype/sisu/sisu-guice/2.9.4/sisu-guice-2.9.4-no_aop.jar
[ERROR] urls[3] = file:/home/jenkins/.m2/repository/org/codehaus/plexus/plexus-utils/2.0.6/plexus-utils-2.0.6.jar
[ERROR] urls[4] = file:/home/jenkins/.m2/repository/org/sonatype/aether/aether-util/1.11/aether-util-1.11.jar
[ERROR] urls[5] = file:/home/jenkins/.m2/repository/org/codehaus/plexus/plexus-interpolation/1.14/plexus-interpolation-1.14.jar
[ERROR] urls[6] = file:/home/jenkins/.m2/repository/org/codehaus/plexus/plexus-component-annotations/1.5.5/plexus-component-annotations-1.5.5.jar
[ERROR] urls[7] = file:/home/jenkins/.m2/repository/org/sonatype/plexus/plexus-sec-dispatcher/1.3/plexus-sec-dispatcher-1.3.jar
[ERROR] urls[8] = file:/home/jenkins/.m2/repository/org/sonatype/plexus/plexus-cipher/1.4/plexus-cipher-1.4.jar
[ERROR] urls[9] = file:/home/jenkins/.m2/repository/org/apache/maven/plugin-tools/maven-plugin-tools-api/3.1/maven-plugin-tools-api-3.1.jar
[ERROR] urls[10] = file:/home/jenkins/.m2/repository/backport-util-concurrent/backport-util-concurrent/3.1/backport-util-concurrent-3.1.jar
[ERROR] urls[11] = file:/home/jenkins/.m2/repository/org/eclipse/jetty/jetty-util/9.2.12.v20150709/jetty-util-9.2.12.v20150709.jar
[ERROR] urls[12] = file:/home/jenkins/.m2/repository/org/eclipse/jetty/jetty-webapp/9.2.12.v20150709/jetty-webapp-9.2.12.v20150709.jar
[ERROR] urls[13] = file:/home/jenkins/.m2/repository/org/eclipse/jetty/jetty-xml/9.2.12.v20150709/jetty-xml-9.2.12.v20150709.jar
[ERROR] urls[14] = file:/home/jenkins/.m2/repository/org/eclipse/jetty/jetty-servlet/9.2.12.v20150709/jetty-servlet-9.2.12.v20150709.jar
[ERROR] urls[15] = file:/home/jenkins/.m2/repository/org/eclipse/jetty/jetty-quickstart/9.2.12.v20150709/jetty-quickstart-9.2.12.v20150709.jar
[ERROR] urls[16] = file:/home/jenkins/.m2/repository/org/eclipse/jetty/jetty-jaas/9.2.12.v20150709/jetty-jaas-9.2.12.v20150709.jar
[ERROR] urls[17] = file:/home/jenkins/.m2/repository/org/eclipse/jetty/jetty-security/9.2.12.v20150709/jetty-security-9.2.12.v20150709.jar
[ERROR] urls[18] = file:/home/jenkins/.m2/repository/org/eclipse/jetty/jetty-plus/9.2.12.v20150709/jetty-plus-9.2.12.v20150709.jar
[ERROR] urls[19] = file:/home/jenkins/.m2/repository/org/eclipse/jetty/jetty-jndi/9.2.12.v20150709/jetty-jndi-9.2.12.v20150709.jar
[ERROR] urls[20] = file:/home/jenkins/.m2/repository/org/eclipse/jetty/jetty-server/9.2.12.v20150709/jetty-server-9.2.12.v20150709.jar
[ERROR] urls[21] = file:/home/jenkins/.m2/repository/javax/servlet/javax.servlet-api/3.1.0/javax.servlet-api-3.1.0.jar
[ERROR] urls[22] = file:/home/jenkins/.m2/repository/org/eclipse/jetty/jetty-http/9.2.12.v20150709/jetty-http-9.2.12.v20150709.jar
[ERROR] urls[23] = file:/home/jenkins/.m2/repository/org/eclipse/jetty/jetty-io/9.2.12.v20150709/jetty-io-9.2.12.v20150709.jar
[ERROR] urls[24] = file:/home/jenkins/.m2/repository/org/eclipse/jetty/jetty-jmx/9.2.12.v20150709/jetty-jmx-9.2.12.v20150709.jar
[ERROR] urls[25] = file:/home/jenkins/.m2/repository/org/eclipse/jetty/jetty-annotations/9.2.12.v20150709/jetty-annotations-9.2.12.v20150709.jar
[ERROR] urls[26] = file:/home/jenkins/.m2/repository/javax/annotation/javax.annotation-api/1.2/javax.annotation-api-1.2.jar
[ERROR] urls[27] = file:/home/jenkins/.m2/repository/org/ow2/asm/asm/5.0.1/asm-5.0.1.jar
[ERROR] urls[28] = file:/home/jenkins/.m2/repository/org/ow2/asm/asm-commons/5.0.1/asm-commons-5.0.1.jar
[ERROR] urls[29] = file:/home/jenkins/.m2/repository/org/ow2/asm/asm-tree/5.0.1/asm-tree-5.0.1.jar
[ERROR] urls[30] = file:/home/jenkins/.m2/repository/org/eclipse/jetty/websocket/javax-websocket-server-impl/9.2.12.v20150709/javax-websocket-server-impl-9.2.12.v20150709.jar
[ERROR] urls[31] = file:/home/jenkins/.m2/repository/org/eclipse/jetty/websocket/javax-websocket-client-impl/9.2.12.v20150709/javax-websocket-client-impl-9.2.12.v20150709.jar
[ERROR] urls[32] = file:/home/jenkins/.m2/repository/javax/websocket/javax.websocket-api/1.0/javax.websocket-api-1.0.jar
[ERROR] urls[33] = file:/home/jenkins/.m2/repository/org/eclipse/jetty/websocket/websocket-server/9.2.12.v20150709/websocket-server-9.2.12.v20150709.jar
[ERROR] urls[34] = file:/home/jenkins/.m2/repository/org/eclipse/jetty/websocket/websocket-common/9.2.12.v20150709/websocket-common-9.2.12.v20150709.jar
[ERROR] urls[35] = file:/home/jenkins/.m2/repository/org/eclipse/jetty/websocket/websocket-api/9.2.12.v20150709/websocket-api-9.2.12.v20150709.jar
[ERROR] urls[36] = file:/home/jenkins/.m2/repository/org/eclipse/jetty/websocket/websocket-client/9.2.12.v20150709/websocket-client-9.2.12.v20150709.jar
[ERROR] urls[37] = file:/home/jenkins/.m2/repository/org/eclipse/jetty/websocket/websocket-servlet/9.2.12.v20150709/websocket-servlet-9.2.12.v20150709.jar
[ERROR] urls[38] = file:/home/jenkins/.m2/repository/org/eclipse/jetty/apache-jsp/9.2.12.v20150709/apache-jsp-9.2.12.v20150709.jar
[ERROR] urls[39] = file:/home/jenkins/.m2/repository/org/eclipse/jetty/toolchain/jetty-schemas/3.1.M0/jetty-schemas-3.1.M0.jar
[ERROR] urls[40] = file:/home/jenkins/.m2/repository/org/mortbay/jasper/apache-jsp/8.0.9.M3/apache-jsp-8.0.9.M3.jar
[ERROR] urls[41] = file:/home/jenkins/.m2/repository/org/mortbay/jasper/apache-el/8.0.9.M3/apache-el-8.0.9.M3.jar
[ERROR] urls[42] = file:/home/jenkins/.m2/repository/org/eclipse/jetty/orbit/org.eclipse.jdt.core/3.8.2.v20130121/org.eclipse.jdt.core-3.8.2.v20130121.jar
[ERROR] urls[43] = file:/home/jenkins/.m2/repository/org/eclipse/jetty/apache-jstl/9.2.12.v20150709/apache-jstl-9.2.12.v20150709.jar
[ERROR] urls[44] = file:/home/jenkins/.m2/repository/org/apache/taglibs/taglibs-standard-spec/1.2.1/taglibs-standard-spec-1.2.1.jar
[ERROR] urls[45] = file:/home/jenkins/.m2/repository/org/apache/taglibs/taglibs-standard-impl/1.2.1/taglibs-standard-impl-1.2.1.jar
[ERROR] urls[46] = file:/home/jenkins/.m2/repository/javax/transaction/javax.transaction-api/1.2/javax.transaction-api-1.2.jar
[ERROR] Number of foreign imports: 1
[ERROR] import: Entry[import  from realm ClassRealm[project>org.apache.atlas:apache-atlas:0.8-incubating-SNAPSHOT,
parent: ClassRealm[maven.api, parent: null]]]
[ERROR] 
[ERROR] -----------------------------------------------------: Could not find implementation
class: com.thinkaurelius.titan.diskstorage.berkeleyje.BerkeleyJEStoreManager
[ERROR] -> [Help 1]
[ERROR] 
[ERROR] To see the full stack trace of the errors, re-run Maven with the -e switch.
[ERROR] Re-run Maven using the -X switch to enable full debug logging.
[ERROR] 
[ERROR] For more information about the errors and possible solutions, please read the following
articles:
[ERROR] [Help 1] http://cwiki.apache.org/confluence/display/MAVEN/PluginContainerException
[ERROR] 
[ERROR] After correcting the problems, you can resume the build with the command
[ERROR]   mvn <goals> -rf :atlas-webapp
Build step 'Execute shell' marked build as failure
[CHECKSTYLE] Collecting checkstyle analysis files...
[CHECKSTYLE] Finding all files that match the pattern **/target/checkstyle-result.xml
[CHECKSTYLE] Parsing 13 files in <https://builds.apache.org/job/apache-atlas-nightly/ws/>
[CHECKSTYLE] Successfully parsed file <https://builds.apache.org/job/apache-atlas-nightly/ws/authorization/target/checkstyle-result.xml>
with 138 unique warnings and 0 duplicates.
[CHECKSTYLE] Successfully parsed file <https://builds.apache.org/job/apache-atlas-nightly/ws/catalog/target/checkstyle-result.xml>
with 444 unique warnings and 0 duplicates.
[CHECKSTYLE] Successfully parsed file <https://builds.apache.org/job/apache-atlas-nightly/ws/client/target/checkstyle-result.xml>
with 537 unique warnings and 0 duplicates.
[CHECKSTYLE] Successfully parsed file <https://builds.apache.org/job/apache-atlas-nightly/ws/common/target/checkstyle-result.xml>
with 537 unique warnings and 0 duplicates.
[CHECKSTYLE] Successfully parsed file <https://builds.apache.org/job/apache-atlas-nightly/ws/dashboardv2/target/checkstyle-result.xml>
with 537 unique warnings and 0 duplicates.
[CHECKSTYLE] Successfully parsed file <https://builds.apache.org/job/apache-atlas-nightly/ws/graphdb/api/target/checkstyle-result.xml>
with 699 unique warnings and 0 duplicates.
[CHECKSTYLE] Successfully parsed file <https://builds.apache.org/job/apache-atlas-nightly/ws/graphdb/target/checkstyle-result.xml>
with 699 unique warnings and 0 duplicates.
[CHECKSTYLE] Successfully parsed file <https://builds.apache.org/job/apache-atlas-nightly/ws/notification/target/checkstyle-result.xml>
with 699 unique warnings and 0 duplicates.
[CHECKSTYLE] Successfully parsed file <https://builds.apache.org/job/apache-atlas-nightly/ws/repository/target/checkstyle-result.xml>
with 1613 unique warnings and 0 duplicates.
[CHECKSTYLE] Successfully parsed file <https://builds.apache.org/job/apache-atlas-nightly/ws/server-api/target/checkstyle-result.xml>
with 1643 unique warnings and 0 duplicates.
[CHECKSTYLE] Successfully parsed file <https://builds.apache.org/job/apache-atlas-nightly/ws/target/checkstyle-result.xml>
with 1643 unique warnings and 0 duplicates.
[CHECKSTYLE] Successfully parsed file <https://builds.apache.org/job/apache-atlas-nightly/ws/titan/target/checkstyle-result.xml>
with 2105 unique warnings and 0 duplicates.
[CHECKSTYLE] Successfully parsed file <https://builds.apache.org/job/apache-atlas-nightly/ws/typesystem/target/checkstyle-result.xml>
with 2865 unique warnings and 0 duplicates.
[CHECKSTYLE] Computing warning deltas based on reference build #270
[FINDBUGS] Collecting findbugs analysis files...
[FINDBUGS] Finding all files that match the pattern **/target/findbugs.xml
[FINDBUGS] Parsing 10 files in <https://builds.apache.org/job/apache-atlas-nightly/ws/>
[FINDBUGS] Successfully parsed file <https://builds.apache.org/job/apache-atlas-nightly/ws/authorization/target/findbugs.xml>
with 0 unique warnings and 0 duplicates.
[FINDBUGS] Successfully parsed file <https://builds.apache.org/job/apache-atlas-nightly/ws/catalog/target/findbugs.xml>
with 0 unique warnings and 0 duplicates.
[FINDBUGS] Successfully parsed file <https://builds.apache.org/job/apache-atlas-nightly/ws/client/target/findbugs.xml>
with 0 unique warnings and 0 duplicates.
[FINDBUGS] Successfully parsed file <https://builds.apache.org/job/apache-atlas-nightly/ws/common/target/findbugs.xml>
with 0 unique warnings and 0 duplicates.
[FINDBUGS] Successfully parsed file <https://builds.apache.org/job/apache-atlas-nightly/ws/graphdb/api/target/findbugs.xml>
with 0 unique warnings and 0 duplicates.
[FINDBUGS] Successfully parsed file <https://builds.apache.org/job/apache-atlas-nightly/ws/notification/target/findbugs.xml>
with 0 unique warnings and 0 duplicates.
[FINDBUGS] Successfully parsed file <https://builds.apache.org/job/apache-atlas-nightly/ws/repository/target/findbugs.xml>
with 0 unique warnings and 0 duplicates.
[FINDBUGS] Successfully parsed file <https://builds.apache.org/job/apache-atlas-nightly/ws/server-api/target/findbugs.xml>
with 0 unique warnings and 0 duplicates.
[FINDBUGS] Successfully parsed file <https://builds.apache.org/job/apache-atlas-nightly/ws/titan/target/findbugs.xml>
with 0 unique warnings and 0 duplicates.
[FINDBUGS] Successfully parsed file <https://builds.apache.org/job/apache-atlas-nightly/ws/typesystem/target/findbugs.xml>
with 0 unique warnings and 0 duplicates.
[FINDBUGS] Computing warning deltas based on reference build #270
Archiving artifacts
TestNG Reports Processing: START
Looking for TestNG results report in workspace using pattern: **/target/surefire-reports/testng-results.xml,**/target/failsafe-reports/testng-results.xml
Saving reports...
Processing '/x1/jenkins/jenkins-home/jobs/apache-atlas-nightly/builds/393/testng/testng-results-1.xml'
Processing '/x1/jenkins/jenkins-home/jobs/apache-atlas-nightly/builds/393/testng/testng-results-2.xml'
Processing '/x1/jenkins/jenkins-home/jobs/apache-atlas-nightly/builds/393/testng/testng-results-3.xml'
Processing '/x1/jenkins/jenkins-home/jobs/apache-atlas-nightly/builds/393/testng/testng-results-4.xml'
Processing '/x1/jenkins/jenkins-home/jobs/apache-atlas-nightly/builds/393/testng/testng-results-5.xml'
Processing '/x1/jenkins/jenkins-home/jobs/apache-atlas-nightly/builds/393/testng/testng-results-6.xml'
Processing '/x1/jenkins/jenkins-home/jobs/apache-atlas-nightly/builds/393/testng/testng-results-7.xml'
Processing '/x1/jenkins/jenkins-home/jobs/apache-atlas-nightly/builds/393/testng/testng-results-8.xml'
Processing '/x1/jenkins/jenkins-home/jobs/apache-atlas-nightly/builds/393/testng/testng-results.xml'
TestNG Reports Processing: FINISH

Mime
View raw message