atlas-dev mailing list archives

Site index · List index
Message view « Date » · « Thread »
Top « Date » · « Thread »
From Apache Jenkins Server <jenk...@builds.apache.org>
Subject Build failed in Jenkins: apache-atlas-nightly #371
Date Tue, 19 Jul 2016 16:32:33 GMT
See <https://builds.apache.org/job/apache-atlas-nightly/371/changes>

Changes:

[sshivalingamurthy] ATLAS-957 Atlas is not capturing topologies that have $ in the data

------------------------------------------
[...truncated 6006 lines...]
[INFO] --- maven-source-plugin:2.4:test-jar-no-fork (attach-sources) @ atlas-dashboardv2 ---
[INFO] Building jar: <https://builds.apache.org/job/apache-atlas-nightly/ws/dashboardv2/target/atlas-dashboardv2-0.8-incubating-SNAPSHOT-test-sources.jar>
[INFO] 
[INFO] --- maven-failsafe-plugin:2.19.1:verify (verify) @ atlas-dashboardv2 ---
[INFO] 
[INFO] --- apache-rat-plugin:0.7:check (rat-check) @ atlas-dashboardv2 ---
[INFO] Exclude: 3party-licenses/**
[INFO] Exclude: *.txt
[INFO] Exclude: **/*.json
[INFO] Exclude: .pc/**
[INFO] Exclude: debian/**
[INFO] Exclude: .svn/**
[INFO] Exclude: .git/**
[INFO] Exclude: .gitignore
[INFO] Exclude: **/.idea/**
[INFO] Exclude: **/*.twiki
[INFO] Exclude: **/*.iml
[INFO] Exclude: **/*.json
[INFO] Exclude: **/target/**
[INFO] Exclude: **/target*/**
[INFO] Exclude: **/build/**
[INFO] Exclude: **/*.patch
[INFO] Exclude: derby.log
[INFO] Exclude: **/logs/**
[INFO] Exclude: **/.classpath
[INFO] Exclude: **/.project
[INFO] Exclude: **/.settings/**
[INFO] Exclude: **/test-output/**
[INFO] Exclude: **/mock/**
[INFO] Exclude: **/data/**
[INFO] Exclude: **/maven-eclipse.xml
[INFO] Exclude: **/.externalToolBuilders/**
[INFO] Exclude: **/build.log
[INFO] Exclude: **/.bowerrc
[INFO] Exclude: *.json
[INFO] Exclude: **/overlays/**
[INFO] Exclude: dev-support/**
[INFO] Exclude: **/users-credentials.properties
[INFO] Exclude: **/public/css/animate.min.css
[INFO] Exclude: **/public/css/bootstrap-sidebar.css
[INFO] Exclude: **/public/js/require-handlebars-plugin/**
[INFO] Exclude: **/node_modules/**
[INFO] Exclude: **/public/js/libs/**
[INFO] Exclude: **/atlas.data/**
[INFO] Exclude: **/${sys:atlas.data}/**
[INFO] Exclude: **/policy-store.txt
[INFO] 
[INFO] --- maven-checkstyle-plugin:2.9.1:check (checkstyle-check) @ atlas-dashboardv2 ---
[INFO] Starting audit...
Audit done.

[INFO] 
[INFO] >>> findbugs-maven-plugin:3.0.1:check (findbugs-check) @ atlas-dashboardv2
>>>
[INFO] 
[INFO] --- findbugs-maven-plugin:3.0.1:findbugs (findbugs) @ atlas-dashboardv2 ---
[INFO] 
[INFO] <<< findbugs-maven-plugin:3.0.1:check (findbugs-check) @ atlas-dashboardv2
<<<
[INFO] 
[INFO] --- findbugs-maven-plugin:3.0.1:check (findbugs-check) @ atlas-dashboardv2 ---
[INFO] 
[INFO] --- maven-install-plugin:2.5.2:install (default-install) @ atlas-dashboardv2 ---
[INFO] Installing <https://builds.apache.org/job/apache-atlas-nightly/ws/dashboardv2/target/atlas-dashboardv2-0.8-incubating-SNAPSHOT.war>
to /home/jenkins/.m2/repository/org/apache/atlas/atlas-dashboardv2/0.8-incubating-SNAPSHOT/atlas-dashboardv2-0.8-incubating-SNAPSHOT.war
[INFO] Installing <https://builds.apache.org/job/apache-atlas-nightly/ws/dashboardv2/pom.xml>
to /home/jenkins/.m2/repository/org/apache/atlas/atlas-dashboardv2/0.8-incubating-SNAPSHOT/atlas-dashboardv2-0.8-incubating-SNAPSHOT.pom
[INFO] Installing <https://builds.apache.org/job/apache-atlas-nightly/ws/dashboardv2/target/atlas-dashboardv2-0.8-incubating-SNAPSHOT-sources.jar>
to /home/jenkins/.m2/repository/org/apache/atlas/atlas-dashboardv2/0.8-incubating-SNAPSHOT/atlas-dashboardv2-0.8-incubating-SNAPSHOT-sources.jar
[INFO] Installing <https://builds.apache.org/job/apache-atlas-nightly/ws/dashboardv2/target/atlas-dashboardv2-0.8-incubating-SNAPSHOT-test-sources.jar>
to /home/jenkins/.m2/repository/org/apache/atlas/atlas-dashboardv2/0.8-incubating-SNAPSHOT/atlas-dashboardv2-0.8-incubating-SNAPSHOT-test-sources.jar
[INFO]                                                                         
[INFO] ------------------------------------------------------------------------
[INFO] Building Apache Atlas Web Application 0.8-incubating-SNAPSHOT
[INFO] ------------------------------------------------------------------------
[INFO] 
[INFO] --- maven-clean-plugin:2.5:clean (default-clean) @ atlas-webapp ---
[INFO] Deleting <https://builds.apache.org/job/apache-atlas-nightly/ws/webapp/target>
[INFO] Deleting <https://builds.apache.org/job/apache-atlas-nightly/ws/webapp> (includes
= [**/*.pyc], excludes = [])
[INFO] 
[INFO] --- buildnumber-maven-plugin:1.4:create (default) @ atlas-webapp ---
[INFO] Executing: /bin/sh -c cd '<https://builds.apache.org/job/apache-atlas-nightly/ws/webapp'>
&& 'git' 'rev-parse' '--verify' 'HEAD'
[INFO] Working directory: <https://builds.apache.org/job/apache-atlas-nightly/ws/webapp>
[INFO] Storing buildNumber: d64112d6a95e6279fd54f2164e89857124450b67 at timestamp: 1468914304318
[WARNING] Cannot get the branch information from the git repository: 
Detecting the current branch failed: fatal: ref HEAD is not a symbolic ref

[INFO] Executing: /bin/sh -c cd '<https://builds.apache.org/job/apache-atlas-nightly/ws/webapp'>
&& 'git' 'rev-parse' '--verify' 'HEAD'
[INFO] Working directory: <https://builds.apache.org/job/apache-atlas-nightly/ws/webapp>
[INFO] Storing buildScmBranch: UNKNOWN
[INFO] 
[INFO] --- maven-remote-resources-plugin:1.5:process (default) @ atlas-webapp ---
[INFO] 
[INFO] --- keytool-maven-plugin:1.5:clean (clean) @ atlas-webapp ---
[WARNING] Keystore file '<https://builds.apache.org/job/apache-atlas-nightly/ws/webapp/target/atlas.keystore'>
doesn't exist.
[INFO] 
[INFO] --- keytool-maven-plugin:1.5:generateKeyPair (generateKeyPair) @ atlas-webapp ---
[INFO] 
[INFO] --- maven-resources-plugin:2.7:resources (default-resources) @ atlas-webapp ---
[INFO] Using 'UTF-8' encoding to copy filtered resources.
[INFO] Copying 2 resources
[INFO] Copying 2 resources to META-INF
[INFO] Copying 3 resources
[INFO] 
[INFO] --- scala-maven-plugin:3.2.0:compile (scala-compile-first) @ atlas-webapp ---
[WARNING] Zinc server is not available at port 3030 - reverting to normal incremental compile
[INFO] Using incremental compilation
[INFO] Compiling 56 Java sources to <https://builds.apache.org/job/apache-atlas-nightly/ws/webapp/target/classes...>
[WARNING] Note: Some input files use or override a deprecated API.
[WARNING] Note: Recompile with -Xlint:deprecation for details.
[WARNING] Note: Some input files use unchecked or unsafe operations.
[WARNING] Note: Recompile with -Xlint:unchecked for details.
[INFO] 
[INFO] --- maven-compiler-plugin:3.1:compile (default-compile) @ atlas-webapp ---
[INFO] Changes detected - recompiling the module!
[INFO] Compiling 56 source files to <https://builds.apache.org/job/apache-atlas-nightly/ws/webapp/target/classes>
[WARNING] <https://builds.apache.org/job/apache-atlas-nightly/ws/webapp/src/main/java/org/apache/atlas/LocalServletRequest.java>:
Some input files use or override a deprecated API.
[WARNING] <https://builds.apache.org/job/apache-atlas-nightly/ws/webapp/src/main/java/org/apache/atlas/LocalServletRequest.java>:
Recompile with -Xlint:deprecation for details.
[WARNING] <https://builds.apache.org/job/apache-atlas-nightly/ws/webapp/src/main/java/org/apache/atlas/web/security/AtlasAuthenticationSuccessHandler.java>:
Some input files use unchecked or unsafe operations.
[WARNING] <https://builds.apache.org/job/apache-atlas-nightly/ws/webapp/src/main/java/org/apache/atlas/web/security/AtlasAuthenticationSuccessHandler.java>:
Recompile with -Xlint:unchecked for details.
[INFO] 
[INFO] --- maven-resources-plugin:2.7:testResources (default-testResources) @ atlas-webapp
---
[INFO] Using 'UTF-8' encoding to copy filtered resources.
[INFO] skip non existing resourceDirectory <https://builds.apache.org/job/apache-atlas-nightly/ws/webapp/src/test/resources>
[INFO] skip non existing resourceDirectory <https://builds.apache.org/job/apache-atlas-nightly/ws/webapp/typesystem/src/test/resources>
[INFO] Copying 3 resources
[INFO] 
[INFO] --- scala-maven-plugin:3.2.0:testCompile (scala-test-compile-first) @ atlas-webapp
---
[WARNING] Zinc server is not available at port 3030 - reverting to normal incremental compile
[INFO] Using incremental compilation
[INFO] Compiling 42 Java sources to <https://builds.apache.org/job/apache-atlas-nightly/ws/webapp/target/test-classes...>
[WARNING] Note: Some input files use unchecked or unsafe operations.
[WARNING] Note: Recompile with -Xlint:unchecked for details.
[INFO] 
[INFO] --- maven-compiler-plugin:3.1:testCompile (default-testCompile) @ atlas-webapp ---
[INFO] Changes detected - recompiling the module!
[INFO] Compiling 42 source files to <https://builds.apache.org/job/apache-atlas-nightly/ws/webapp/target/test-classes>
[WARNING] <https://builds.apache.org/job/apache-atlas-nightly/ws/webapp/src/test/java/org/apache/atlas/notification/NotificationHookConsumerTest.java>:
Some input files use unchecked or unsafe operations.
[WARNING] <https://builds.apache.org/job/apache-atlas-nightly/ws/webapp/src/test/java/org/apache/atlas/notification/NotificationHookConsumerTest.java>:
Recompile with -Xlint:unchecked for details.
[INFO] 
[INFO] --- maven-war-plugin:2.6:war (default-war) @ atlas-webapp ---
[INFO] Packaging webapp
[INFO] Assembling webapp [atlas-webapp] in [<https://builds.apache.org/job/apache-atlas-nightly/ws/webapp/target/atlas-webapp-0.8-incubating-SNAPSHOT]>
[INFO] Processing overlay [ id org.apache.atlas:atlas-dashboardv2]
[INFO] Processing war project
[INFO] Copying webapp resources [<https://builds.apache.org/job/apache-atlas-nightly/ws/webapp/src/main/webapp]>
[INFO] Building jar: <https://builds.apache.org/job/apache-atlas-nightly/ws/webapp/target/atlas-webapp-0.8-incubating-SNAPSHOT/WEB-INF/lib/atlas-webapp-0.8-incubating-SNAPSHOT.jar>
[INFO] Webapp assembled in [566 msecs]
[INFO] Building war: <https://builds.apache.org/job/apache-atlas-nightly/ws/webapp/target/atlas-webapp-0.8-incubating-SNAPSHOT.war>
[INFO] 
[INFO] --- maven-site-plugin:3.4:attach-descriptor (attach-descriptor) @ atlas-webapp ---
[INFO] 
[INFO] --- maven-surefire-plugin:2.18.1:test (default-test) @ atlas-webapp ---
[WARNING] The parameter forkMode is deprecated since version 2.14. Use forkCount and reuseForks
instead.
[INFO] Surefire report directory: <https://builds.apache.org/job/apache-atlas-nightly/ws/webapp/target/surefire-reports>
[INFO] Using configured provider org.apache.maven.surefire.testng.TestNGProvider
[WARNING] file.encoding cannot be set as system property, use <argLine>-Dfile.encoding=...<argLine>
instead

-------------------------------------------------------
 T E S T S
-------------------------------------------------------
Running org.apache.atlas.web.service.ActiveInstanceElectorServiceTest
Tests run: 14, Failures: 0, Errors: 0, Skipped: 0, Time elapsed: 1.281 sec - in org.apache.atlas.web.service.ActiveInstanceElectorServiceTest
Running org.apache.atlas.web.service.CuratorFactoryTest
Tests run: 3, Failures: 0, Errors: 0, Skipped: 0, Time elapsed: 1.304 sec - in org.apache.atlas.web.service.CuratorFactoryTest
Running org.apache.atlas.web.service.AtlasZookeeperSecurityPropertiesTest
Tests run: 6, Failures: 0, Errors: 0, Skipped: 0, Time elapsed: 0.384 sec - in org.apache.atlas.web.service.AtlasZookeeperSecurityPropertiesTest
Running org.apache.atlas.web.service.ServiceStateTest
Tests run: 3, Failures: 0, Errors: 0, Skipped: 0, Time elapsed: 0.84 sec - in org.apache.atlas.web.service.ServiceStateTest
Running org.apache.atlas.web.service.SecureEmbeddedServerTest
Tests run: 4, Failures: 0, Errors: 0, Skipped: 0, Time elapsed: 80.709 sec - in org.apache.atlas.web.service.SecureEmbeddedServerTest
Running org.apache.atlas.web.service.ActiveInstanceStateTest
Tests run: 5, Failures: 0, Errors: 0, Skipped: 0, Time elapsed: 1.014 sec - in org.apache.atlas.web.service.ActiveInstanceStateTest
Running org.apache.atlas.web.setup.SetupStepsTest
Tests run: 6, Failures: 0, Errors: 0, Skipped: 0, Time elapsed: 1.256 sec - in org.apache.atlas.web.setup.SetupStepsTest
Running org.apache.atlas.web.security.SSLAndKerberosTest
Tests run: 1, Failures: 0, Errors: 0, Skipped: 0, Time elapsed: 23.685 sec - in org.apache.atlas.web.security.SSLAndKerberosTest
Running org.apache.atlas.web.security.NegativeSSLAndKerberosTest
Tests run: 1, Failures: 1, Errors: 0, Skipped: 0, Time elapsed: 21.721 sec <<< FAILURE!
- in org.apache.atlas.web.security.NegativeSSLAndKerberosTest
testUnsecuredClient(org.apache.atlas.web.security.NegativeSSLAndKerberosTest)  Time elapsed:
0.504 sec  <<< FAILURE!
java.lang.AssertionError: Should have failed with GSSException
	at org.testng.Assert.fail(Assert.java:89)
	at org.apache.atlas.web.security.NegativeSSLAndKerberosTest.testUnsecuredClient(NegativeSSLAndKerberosTest.java:127)

Running org.apache.atlas.web.security.FileAuthenticationTest
Tests run: 6, Failures: 0, Errors: 0, Skipped: 0, Time elapsed: 3.023 sec - in org.apache.atlas.web.security.FileAuthenticationTest
Running org.apache.atlas.web.security.UserDaoTest
Tests run: 2, Failures: 0, Errors: 0, Skipped: 0, Time elapsed: 0.64 sec - in org.apache.atlas.web.security.UserDaoTest
Running org.apache.atlas.web.security.SSLTest
Build timed out (after 540 minutes). Marking the build as failed.
Build was aborted
[CHECKSTYLE] Collecting checkstyle analysis files...
Running org.apache.atlas.web.util.ServletsTest
[CHECKSTYLE] Finding all files that match the pattern **/target/checkstyle-result.xml
[CHECKSTYLE] Parsing 20 files in <https://builds.apache.org/job/apache-atlas-nightly/ws/>
[CHECKSTYLE] Successfully parsed file <https://builds.apache.org/job/apache-atlas-nightly/ws/addons/falcon-bridge/target/checkstyle-result.xml>
with 52 unique warnings and 0 duplicates.
[CHECKSTYLE] Successfully parsed file <https://builds.apache.org/job/apache-atlas-nightly/ws/addons/hdfs-model/target/checkstyle-result.xml>
with 72 unique warnings and 0 duplicates.
[CHECKSTYLE] Successfully parsed file <https://builds.apache.org/job/apache-atlas-nightly/ws/addons/sqoop-bridge/target/checkstyle-result.xml>
with 88 unique warnings and 0 duplicates.
[CHECKSTYLE] Successfully parsed file <https://builds.apache.org/job/apache-atlas-nightly/ws/addons/storm-bridge/target/checkstyle-result.xml>
with 164 unique warnings and 0 duplicates.
[CHECKSTYLE] Successfully parsed file <https://builds.apache.org/job/apache-atlas-nightly/ws/authorization/target/checkstyle-result.xml>
with 301 unique warnings and 0 duplicates.
[CHECKSTYLE] Successfully parsed file <https://builds.apache.org/job/apache-atlas-nightly/ws/catalog/target/checkstyle-result.xml>
with 607 unique warnings and 0 duplicates.
[CHECKSTYLE] Successfully parsed file <https://builds.apache.org/job/apache-atlas-nightly/ws/client/target/checkstyle-result.xml>
with 693 unique warnings and 0 duplicates.
[CHECKSTYLE] Successfully parsed file <https://builds.apache.org/job/apache-atlas-nightly/ws/common/target/checkstyle-result.xml>
with 693 unique warnings and 0 duplicates.
[CHECKSTYLE] Successfully parsed file <https://builds.apache.org/job/apache-atlas-nightly/ws/dashboard/target/checkstyle-result.xml>
with 693 unique warnings and 0 duplicates.
[CHECKSTYLE] Successfully parsed file <https://builds.apache.org/job/apache-atlas-nightly/ws/dashboardv2/target/checkstyle-result.xml>
with 693 unique warnings and 0 duplicates.
[CHECKSTYLE] Successfully parsed file <https://builds.apache.org/job/apache-atlas-nightly/ws/distro/target/checkstyle-result.xml>
with 693 unique warnings and 0 duplicates.
[CHECKSTYLE] Successfully parsed file <https://builds.apache.org/job/apache-atlas-nightly/ws/docs/target/checkstyle-result.xml>
with 693 unique warnings and 0 duplicates.
[CHECKSTYLE] Successfully parsed file <https://builds.apache.org/job/apache-atlas-nightly/ws/graphdb/api/target/checkstyle-result.xml>
with 855 unique warnings and 0 duplicates.
[CHECKSTYLE] Successfully parsed file <https://builds.apache.org/job/apache-atlas-nightly/ws/graphdb/target/checkstyle-result.xml>
with 855 unique warnings and 0 duplicates.
[CHECKSTYLE] Successfully parsed file <https://builds.apache.org/job/apache-atlas-nightly/ws/notification/target/checkstyle-result.xml>
with 855 unique warnings and 0 duplicates.
[CHECKSTYLE] Successfully parsed file <https://builds.apache.org/job/apache-atlas-nightly/ws/repository/target/checkstyle-result.xml>
with 1743 unique warnings and 0 duplicates.
[CHECKSTYLE] Successfully parsed file <https://builds.apache.org/job/apache-atlas-nightly/ws/server-api/target/checkstyle-result.xml>
with 1774 unique warnings and 0 duplicates.
[CHECKSTYLE] Successfully parsed file <https://builds.apache.org/job/apache-atlas-nightly/ws/target/checkstyle-result.xml>
with 1774 unique warnings and 0 duplicates.
[CHECKSTYLE] Successfully parsed file <https://builds.apache.org/job/apache-atlas-nightly/ws/titan/target/checkstyle-result.xml>
with 2143 unique warnings and 0 duplicates.
[CHECKSTYLE] Successfully parsed file <https://builds.apache.org/job/apache-atlas-nightly/ws/typesystem/target/checkstyle-result.xml>
with 2871 unique warnings and 0 duplicates.
[CHECKSTYLE] Computing warning deltas based on reference build #270
[FINDBUGS] Collecting findbugs analysis files...
[FINDBUGS] Finding all files that match the pattern **/target/findbugs.xml
[FINDBUGS] Parsing 14 files in <https://builds.apache.org/job/apache-atlas-nightly/ws/>
[FINDBUGS] Successfully parsed file <https://builds.apache.org/job/apache-atlas-nightly/ws/addons/falcon-bridge/target/findbugs.xml>
with 0 unique warnings and 0 duplicates.
[FINDBUGS] Successfully parsed file <https://builds.apache.org/job/apache-atlas-nightly/ws/addons/hdfs-model/target/findbugs.xml>
with 0 unique warnings and 0 duplicates.
[FINDBUGS] Successfully parsed file <https://builds.apache.org/job/apache-atlas-nightly/ws/addons/sqoop-bridge/target/findbugs.xml>
with 0 unique warnings and 0 duplicates.
[FINDBUGS] Successfully parsed file <https://builds.apache.org/job/apache-atlas-nightly/ws/addons/storm-bridge/target/findbugs.xml>
with 0 unique warnings and 0 duplicates.
[FINDBUGS] Successfully parsed file <https://builds.apache.org/job/apache-atlas-nightly/ws/authorization/target/findbugs.xml>
with 0 unique warnings and 0 duplicates.
[FINDBUGS] Successfully parsed file <https://builds.apache.org/job/apache-atlas-nightly/ws/catalog/target/findbugs.xml>
with 0 unique warnings and 0 duplicates.
[FINDBUGS] Successfully parsed file <https://builds.apache.org/job/apache-atlas-nightly/ws/client/target/findbugs.xml>
with 0 unique warnings and 0 duplicates.
[FINDBUGS] Successfully parsed file <https://builds.apache.org/job/apache-atlas-nightly/ws/common/target/findbugs.xml>
with 0 unique warnings and 0 duplicates.
[FINDBUGS] Successfully parsed file <https://builds.apache.org/job/apache-atlas-nightly/ws/graphdb/api/target/findbugs.xml>
with 0 unique warnings and 0 duplicates.
[FINDBUGS] Successfully parsed file <https://builds.apache.org/job/apache-atlas-nightly/ws/notification/target/findbugs.xml>
with 0 unique warnings and 0 duplicates.
[FINDBUGS] Successfully parsed file <https://builds.apache.org/job/apache-atlas-nightly/ws/repository/target/findbugs.xml>
with 0 unique warnings and 0 duplicates.
[FINDBUGS] Successfully parsed file <https://builds.apache.org/job/apache-atlas-nightly/ws/server-api/target/findbugs.xml>
with 0 unique warnings and 0 duplicates.
[FINDBUGS] Successfully parsed file <https://builds.apache.org/job/apache-atlas-nightly/ws/titan/target/findbugs.xml>
with 0 unique warnings and 0 duplicates.
[FINDBUGS] Successfully parsed file <https://builds.apache.org/job/apache-atlas-nightly/ws/typesystem/target/findbugs.xml>
with 0 unique warnings and 0 duplicates.
[FINDBUGS] Computing warning deltas based on reference build #270
Archiving artifacts
Compressed 803.35 MB of artifacts by 73.9% relative to #270
TestNG Reports Processing: START
Looking for TestNG results report in workspace using pattern: **/target/surefire-reports/testng-results.xml,**/target/failsafe-reports/testng-results.xml
testng-results.xml was last modified before this build started. Ignoring it.
testng-results.xml was last modified before this build started. Ignoring it.
testng-results.xml was last modified before this build started. Ignoring it.
testng-results.xml was last modified before this build started. Ignoring it.
testng-results.xml was last modified before this build started. Ignoring it.
testng-results.xml was last modified before this build started. Ignoring it.
Saving reports...
Processing '/x1/jenkins/jenkins-home/jobs/apache-atlas-nightly/builds/371/testng/testng-results-1.xml'
Processing '/x1/jenkins/jenkins-home/jobs/apache-atlas-nightly/builds/371/testng/testng-results-2.xml'
Processing '/x1/jenkins/jenkins-home/jobs/apache-atlas-nightly/builds/371/testng/testng-results-3.xml'
Processing '/x1/jenkins/jenkins-home/jobs/apache-atlas-nightly/builds/371/testng/testng-results-4.xml'
Processing '/x1/jenkins/jenkins-home/jobs/apache-atlas-nightly/builds/371/testng/testng-results-5.xml'
Processing '/x1/jenkins/jenkins-home/jobs/apache-atlas-nightly/builds/371/testng/testng-results-6.xml'
Processing '/x1/jenkins/jenkins-home/jobs/apache-atlas-nightly/builds/371/testng/testng-results-7.xml'
Processing '/x1/jenkins/jenkins-home/jobs/apache-atlas-nightly/builds/371/testng/testng-results-8.xml'
Processing '/x1/jenkins/jenkins-home/jobs/apache-atlas-nightly/builds/371/testng/testng-results.xml'
TestNG Reports Processing: FINISH

Mime
View raw message