atlas-dev mailing list archives

Site index · List index
Message view « Date » · « Thread »
Top « Date » · « Thread »
From Apache Jenkins Server <jenk...@builds.apache.org>
Subject Build failed in Jenkins: apache-atlas-nightly #355
Date Fri, 01 Jul 2016 19:02:14 GMT
See <https://builds.apache.org/job/apache-atlas-nightly/355/changes>

Changes:

[sumasai.shivaprasad] ATLAS-966 Exit execution of import_hive.sh if HIVE_HOME is not set

------------------------------------------
[...truncated 2421 lines...]
<https://builds.apache.org/job/apache-atlas-nightly/ws/graphdb/api/src/main/java/org/apache/atlas/repository/graphdb/AtlasGraph.java>:235:
Line matches the illegal pattern 'Trailing whitespace'.
<https://builds.apache.org/job/apache-atlas-nightly/ws/graphdb/api/src/main/java/org/apache/atlas/repository/graphdb/AtlasGraph.java>:239:
Line matches the illegal pattern 'Trailing whitespace'.
<https://builds.apache.org/job/apache-atlas-nightly/ws/graphdb/api/src/main/java/org/apache/atlas/repository/graphdb/AtlasGraph.java>:243:
Line matches the illegal pattern 'Trailing whitespace'.
<https://builds.apache.org/job/apache-atlas-nightly/ws/graphdb/api/src/main/java/org/apache/atlas/repository/graphdb/AtlasGraph.java>:248:
Line matches the illegal pattern 'Trailing whitespace'.
<https://builds.apache.org/job/apache-atlas-nightly/ws/graphdb/api/src/main/java/org/apache/atlas/repository/graphdb/AtlasElement.java>:28:
Line matches the illegal pattern 'Trailing whitespace'.
<https://builds.apache.org/job/apache-atlas-nightly/ws/graphdb/api/src/main/java/org/apache/atlas/repository/graphdb/AtlasElement.java>:33:
First sentence should end with a period.
<https://builds.apache.org/job/apache-atlas-nightly/ws/graphdb/api/src/main/java/org/apache/atlas/repository/graphdb/AtlasElement.java>:45:
First sentence should end with a period.
<https://builds.apache.org/job/apache-atlas-nightly/ws/graphdb/api/src/main/java/org/apache/atlas/repository/graphdb/AtlasElement.java>:47:
Line matches the illegal pattern 'Trailing whitespace'.
<https://builds.apache.org/job/apache-atlas-nightly/ws/graphdb/api/src/main/java/org/apache/atlas/repository/graphdb/AtlasElement.java>:52:
Line matches the illegal pattern 'Trailing whitespace'.
<https://builds.apache.org/job/apache-atlas-nightly/ws/graphdb/api/src/main/java/org/apache/atlas/repository/graphdb/AtlasElement.java>:60:
Line matches the illegal pattern 'Trailing whitespace'.
<https://builds.apache.org/job/apache-atlas-nightly/ws/graphdb/api/src/main/java/org/apache/atlas/repository/graphdb/AtlasElement.java>:64:
Line matches the illegal pattern 'Trailing whitespace'.
<https://builds.apache.org/job/apache-atlas-nightly/ws/graphdb/api/src/main/java/org/apache/atlas/repository/graphdb/AtlasElement.java>:65:
Line matches the illegal pattern 'Trailing whitespace'.
<https://builds.apache.org/job/apache-atlas-nightly/ws/graphdb/api/src/main/java/org/apache/atlas/repository/graphdb/AtlasElement.java>:66:
Line matches the illegal pattern 'Trailing whitespace'.
<https://builds.apache.org/job/apache-atlas-nightly/ws/graphdb/api/src/main/java/org/apache/atlas/repository/graphdb/AtlasElement.java>:67:
First sentence should end with a period.
<https://builds.apache.org/job/apache-atlas-nightly/ws/graphdb/api/src/main/java/org/apache/atlas/repository/graphdb/AtlasElement.java>:70:
Line is longer than 120 characters.
<https://builds.apache.org/job/apache-atlas-nightly/ws/graphdb/api/src/main/java/org/apache/atlas/repository/graphdb/AtlasElement.java>:72:
Line matches the illegal pattern 'Trailing whitespace'.
<https://builds.apache.org/job/apache-atlas-nightly/ws/graphdb/api/src/main/java/org/apache/atlas/repository/graphdb/AtlasElement.java>:73:
Line matches the illegal pattern 'Trailing whitespace'.
<https://builds.apache.org/job/apache-atlas-nightly/ws/graphdb/api/src/main/java/org/apache/atlas/repository/graphdb/AtlasSchemaViolationException.java>:25:
Line matches the illegal pattern 'Trailing whitespace'.
<https://builds.apache.org/job/apache-atlas-nightly/ws/graphdb/api/src/main/java/org/apache/atlas/repository/graphdb/AtlasIndexQuery.java>:29:36:
',' is not followed by whitespace.
<https://builds.apache.org/job/apache-atlas-nightly/ws/graphdb/api/src/main/java/org/apache/atlas/repository/graphdb/AtlasIndexQuery.java>:33:
Line matches the illegal pattern 'Trailing whitespace'.
<https://builds.apache.org/job/apache-atlas-nightly/ws/graphdb/api/src/main/java/org/apache/atlas/repository/graphdb/AtlasIndexQuery.java>:36:23:
',' is not followed by whitespace.
<https://builds.apache.org/job/apache-atlas-nightly/ws/graphdb/api/src/main/java/org/apache/atlas/repository/graphdb/AtlasIndexQuery.java>:38:
Line matches the illegal pattern 'Trailing whitespace'.
<https://builds.apache.org/job/apache-atlas-nightly/ws/graphdb/api/src/main/java/org/apache/atlas/repository/graphdb/AtlasIndexQuery.java>:40:
Line matches the illegal pattern 'Trailing whitespace'.
<https://builds.apache.org/job/apache-atlas-nightly/ws/graphdb/api/src/main/java/org/apache/atlas/repository/graphdb/AtlasIndexQuery.java>:44:31:
',' is not followed by whitespace.
<https://builds.apache.org/job/apache-atlas-nightly/ws/graphdb/api/src/main/java/org/apache/atlas/repository/graphdb/AtlasIndexQuery.java>:45:
Line matches the illegal pattern 'Trailing whitespace'.
<https://builds.apache.org/job/apache-atlas-nightly/ws/graphdb/api/src/main/java/org/apache/atlas/repository/graphdb/AtlasIndexQuery.java>:46:
First sentence should end with a period.
<https://builds.apache.org/job/apache-atlas-nightly/ws/graphdb/api/src/main/java/org/apache/atlas/repository/graphdb/AtlasIndexQuery.java>:49:23:
',' is not followed by whitespace.
<https://builds.apache.org/job/apache-atlas-nightly/ws/graphdb/api/src/main/java/org/apache/atlas/repository/graphdb/AtlasIndexQuery.java>:50:
Line matches the illegal pattern 'Trailing whitespace'.
<https://builds.apache.org/job/apache-atlas-nightly/ws/graphdb/api/src/main/java/org/apache/atlas/repository/graphdb/AtlasIndexQuery.java>:53:
Line matches the illegal pattern 'Trailing whitespace'.
Audit done.

[INFO] There are 162 checkstyle errors.
[WARNING] checkstyle:check violations detected but failOnViolation set to false
[INFO] 
[INFO] >>> findbugs-maven-plugin:3.0.1:check (findbugs-check) @ atlas-graphdb-api
>>>
[INFO] 
[INFO] --- findbugs-maven-plugin:3.0.1:findbugs (findbugs) @ atlas-graphdb-api ---
[INFO] Fork Value is true
[INFO] Done FindBugs Analysis....
[INFO] 
[INFO] <<< findbugs-maven-plugin:3.0.1:check (findbugs-check) @ atlas-graphdb-api
<<<
[INFO] 
[INFO] --- findbugs-maven-plugin:3.0.1:check (findbugs-check) @ atlas-graphdb-api ---
[INFO] BugInstance size is 0
[INFO] Error size is 0
[INFO] No errors/warnings found
[INFO] 
[INFO] --- maven-install-plugin:2.5.2:install (default-install) @ atlas-graphdb-api ---
[INFO] Installing <https://builds.apache.org/job/apache-atlas-nightly/ws/graphdb/api/target/atlas-graphdb-api-0.8-incubating-SNAPSHOT.jar>
to /home/jenkins/.m2/repository/org/apache/atlas/atlas-graphdb-api/0.8-incubating-SNAPSHOT/atlas-graphdb-api-0.8-incubating-SNAPSHOT.jar
[INFO] Installing <https://builds.apache.org/job/apache-atlas-nightly/ws/graphdb/api/pom.xml>
to /home/jenkins/.m2/repository/org/apache/atlas/atlas-graphdb-api/0.8-incubating-SNAPSHOT/atlas-graphdb-api-0.8-incubating-SNAPSHOT.pom
[INFO] Installing <https://builds.apache.org/job/apache-atlas-nightly/ws/graphdb/api/target/atlas-graphdb-api-0.8-incubating-SNAPSHOT-sources.jar>
to /home/jenkins/.m2/repository/org/apache/atlas/atlas-graphdb-api/0.8-incubating-SNAPSHOT/atlas-graphdb-api-0.8-incubating-SNAPSHOT-sources.jar
[INFO] Installing <https://builds.apache.org/job/apache-atlas-nightly/ws/graphdb/api/target/atlas-graphdb-api-0.8-incubating-SNAPSHOT-test-sources.jar>
to /home/jenkins/.m2/repository/org/apache/atlas/atlas-graphdb-api/0.8-incubating-SNAPSHOT/atlas-graphdb-api-0.8-incubating-SNAPSHOT-test-sources.jar
[INFO]                                                                         
[INFO] ------------------------------------------------------------------------
[INFO] Building Apache Atlas Titan 0.8-incubating-SNAPSHOT
[INFO] ------------------------------------------------------------------------
[INFO] 
[INFO] --- maven-clean-plugin:2.5:clean (default-clean) @ atlas-titan ---
[INFO] Deleting <https://builds.apache.org/job/apache-atlas-nightly/ws/titan/target>
[INFO] Deleting <https://builds.apache.org/job/apache-atlas-nightly/ws/titan> (includes
= [**/*.pyc], excludes = [])
[INFO] 
[INFO] --- buildnumber-maven-plugin:1.4:create (default) @ atlas-titan ---
[INFO] Executing: /bin/sh -c cd '<https://builds.apache.org/job/apache-atlas-nightly/ws/titan'>
&& 'git' 'rev-parse' '--verify' 'HEAD'
[INFO] Working directory: <https://builds.apache.org/job/apache-atlas-nightly/ws/titan>
[INFO] Storing buildNumber: f623bddf80265f0a4874b2305d198a6cf399e469 at timestamp: 1467399629575
[WARNING] Cannot get the branch information from the git repository: 
Detecting the current branch failed: fatal: ref HEAD is not a symbolic ref

[INFO] Executing: /bin/sh -c cd '<https://builds.apache.org/job/apache-atlas-nightly/ws/titan'>
&& 'git' 'rev-parse' '--verify' 'HEAD'
[INFO] Working directory: <https://builds.apache.org/job/apache-atlas-nightly/ws/titan>
[INFO] Storing buildScmBranch: UNKNOWN
[INFO] 
[INFO] --- maven-remote-resources-plugin:1.5:process (default) @ atlas-titan ---
[INFO] 
[INFO] --- maven-resources-plugin:2.7:resources (default-resources) @ atlas-titan ---
[INFO] Using 'UTF-8' encoding to copy filtered resources.
[INFO] skip non existing resourceDirectory <https://builds.apache.org/job/apache-atlas-nightly/ws/titan/src/main/resources>
[INFO] Copying 2 resources to META-INF
[INFO] Copying 3 resources
[INFO] 
[INFO] --- scala-maven-plugin:3.2.0:compile (scala-compile-first) @ atlas-titan ---
[WARNING] Zinc server is not available at port 3030 - reverting to normal incremental compile
[INFO] Using incremental compilation
[INFO] Compiling 19 Java sources to <https://builds.apache.org/job/apache-atlas-nightly/ws/titan/target/classes...>
[WARNING] Note: Some input files use or override a deprecated API.
[WARNING] Note: Recompile with -Xlint:deprecation for details.
[WARNING] Note: <https://builds.apache.org/job/apache-atlas-nightly/ws/titan/src/main/java/com/thinkaurelius/titan/diskstorage/solr/Solr5Index.java>
uses unchecked or unsafe operations.
[WARNING] Note: Recompile with -Xlint:unchecked for details.
[INFO] 
[INFO] --- maven-compiler-plugin:3.1:compile (default-compile) @ atlas-titan ---
[INFO] Changes detected - recompiling the module!
[INFO] Compiling 19 source files to <https://builds.apache.org/job/apache-atlas-nightly/ws/titan/target/classes>
[WARNING] <https://builds.apache.org/job/apache-atlas-nightly/ws/titan/src/main/java/com/thinkaurelius/titan/diskstorage/hbase/HBaseCompat0_98.java>:
Some input files use or override a deprecated API.
[WARNING] <https://builds.apache.org/job/apache-atlas-nightly/ws/titan/src/main/java/com/thinkaurelius/titan/diskstorage/hbase/HBaseCompat0_98.java>:
Recompile with -Xlint:deprecation for details.
[WARNING] <https://builds.apache.org/job/apache-atlas-nightly/ws/titan/src/main/java/com/thinkaurelius/titan/diskstorage/solr/Solr5Index.java>:
<https://builds.apache.org/job/apache-atlas-nightly/ws/titan/src/main/java/com/thinkaurelius/titan/diskstorage/solr/Solr5Index.java>
uses unchecked or unsafe operations.
[WARNING] <https://builds.apache.org/job/apache-atlas-nightly/ws/titan/src/main/java/com/thinkaurelius/titan/diskstorage/solr/Solr5Index.java>:
Recompile with -Xlint:unchecked for details.
[INFO] 
[INFO] --- maven-resources-plugin:2.7:testResources (default-testResources) @ atlas-titan
---
[INFO] Using 'UTF-8' encoding to copy filtered resources.
[INFO] skip non existing resourceDirectory <https://builds.apache.org/job/apache-atlas-nightly/ws/titan/src/test/resources>
[INFO] skip non existing resourceDirectory <https://builds.apache.org/job/apache-atlas-nightly/ws/titan/typesystem/src/test/resources>
[INFO] Copying 3 resources
[INFO] 
[INFO] --- scala-maven-plugin:3.2.0:testCompile (scala-test-compile-first) @ atlas-titan ---
[WARNING] Zinc server is not available at port 3030 - reverting to normal incremental compile
[INFO] Using incremental compilation
[INFO] Compiling 2 Java sources to <https://builds.apache.org/job/apache-atlas-nightly/ws/titan/target/test-classes...>
[WARNING] Note: <https://builds.apache.org/job/apache-atlas-nightly/ws/titan/src/test/java/com/thinkaurelius/titan/diskstorage/hbase/HBaseKeyColumnValueStoreTest.java>
uses unchecked or unsafe operations.
[WARNING] Note: Recompile with -Xlint:unchecked for details.
[INFO] 
[INFO] --- maven-compiler-plugin:3.1:testCompile (default-testCompile) @ atlas-titan ---
[INFO] Changes detected - recompiling the module!
[INFO] Compiling 2 source files to <https://builds.apache.org/job/apache-atlas-nightly/ws/titan/target/test-classes>
[WARNING] <https://builds.apache.org/job/apache-atlas-nightly/ws/titan/src/test/java/com/thinkaurelius/titan/diskstorage/hbase/HBaseKeyColumnValueStoreTest.java>:
<https://builds.apache.org/job/apache-atlas-nightly/ws/titan/src/test/java/com/thinkaurelius/titan/diskstorage/hbase/HBaseKeyColumnValueStoreTest.java>
uses unchecked or unsafe operations.
[WARNING] <https://builds.apache.org/job/apache-atlas-nightly/ws/titan/src/test/java/com/thinkaurelius/titan/diskstorage/hbase/HBaseKeyColumnValueStoreTest.java>:
Recompile with -Xlint:unchecked for details.
[INFO] 
[INFO] --- maven-surefire-plugin:2.18.1:test (default-test) @ atlas-titan ---
[WARNING] The parameter forkMode is deprecated since version 2.14. Use forkCount and reuseForks
instead.
[INFO] Surefire report directory: <https://builds.apache.org/job/apache-atlas-nightly/ws/titan/target/surefire-reports>
[INFO] Using configured provider org.apache.maven.surefire.testng.TestNGProvider
[WARNING] file.encoding cannot be set as system property, use <argLine>-Dfile.encoding=...<argLine>
instead

-------------------------------------------------------
 T E S T S
-------------------------------------------------------
Running com.thinkaurelius.titan.diskstorage.locking.LocalLockMediatorTest
Tests run: 1, Failures: 1, Errors: 0, Skipped: 0, Time elapsed: 0.522 sec <<< FAILURE!
- in com.thinkaurelius.titan.diskstorage.locking.LocalLockMediatorTest
testLock(com.thinkaurelius.titan.diskstorage.locking.LocalLockMediatorTest)  Time elapsed:
0.038 sec  <<< FAILURE!
java.lang.AssertionError: expected:<true> but was:<false>
	at org.testng.Assert.fail(Assert.java:89)
	at org.testng.Assert.failNotEquals(Assert.java:489)
	at org.testng.Assert.assertTrue(Assert.java:37)
	at org.testng.Assert.assertTrue(Assert.java:47)
	at com.thinkaurelius.titan.diskstorage.locking.LocalLockMediatorTest.testLock(LocalLockMediatorTest.java:46)

Running com.thinkaurelius.titan.diskstorage.hbase.HBaseKeyColumnValueStoreTest
Tests run: 3, Failures: 0, Errors: 0, Skipped: 0, Time elapsed: 0.806 sec - in com.thinkaurelius.titan.diskstorage.hbase.HBaseKeyColumnValueStoreTest

Results :

Failed tests: 
  LocalLockMediatorTest.testLock:46 expected:<true> but was:<false>

Tests run: 4, Failures: 1, Errors: 0, Skipped: 0

[INFO] ------------------------------------------------------------------------
[INFO] Reactor Summary:
[INFO] 
[INFO] apache-atlas ...................................... SUCCESS [ 20.850 s]
[INFO] Apache Atlas Common ............................... SUCCESS [ 27.548 s]
[INFO] Apache Atlas Typesystem ........................... SUCCESS [01:30 min]
[INFO] Apache Atlas Client ............................... SUCCESS [ 24.056 s]
[INFO] Apache Atlas Server API ........................... SUCCESS [ 13.430 s]
[INFO] Apache Atlas Notification ......................... SUCCESS [ 38.117 s]
[INFO] Apache Atlas Graph Database Projects .............. SUCCESS [  0.650 s]
[INFO] Apache Atlas Graph Database API ................... SUCCESS [  8.762 s]
[INFO] Apache Atlas Titan ................................ FAILURE [ 14.403 s]
[INFO] Apache Atlas Repository ........................... SKIPPED
[INFO] Apache Atlas Authorization ........................ SKIPPED
[INFO] Apache Atlas Business Catalog ..................... SKIPPED
[INFO] Apache Atlas UI ................................... SKIPPED
[INFO] Apache Atlas Web Application ...................... SKIPPED
[INFO] Apache Atlas Documentation ........................ SKIPPED
[INFO] Apache Atlas FileSystem Model ..................... SKIPPED
[INFO] Apache Atlas Hive Bridge .......................... SKIPPED
[INFO] Apache Atlas Falcon Bridge ........................ SKIPPED
[INFO] Apache Atlas Sqoop Bridge ......................... SKIPPED
[INFO] Apache Atlas Storm Bridge ......................... SKIPPED
[INFO] Apache Atlas Distribution ......................... SKIPPED
[INFO] ------------------------------------------------------------------------
[INFO] BUILD FAILURE
[INFO] ------------------------------------------------------------------------
[INFO] Total time: 03:59 min
[INFO] Finished at: 2016-07-01T19:00:43+00:00
[INFO] Final Memory: 115M/1433M
[INFO] ------------------------------------------------------------------------
[ERROR] Failed to execute goal org.apache.maven.plugins:maven-surefire-plugin:2.18.1:test
(default-test) on project atlas-titan: There are test failures.
[ERROR] 
[ERROR] Please refer to <https://builds.apache.org/job/apache-atlas-nightly/ws/titan/target/surefire-reports>
for the individual test results.
[ERROR] -> [Help 1]
[ERROR] 
[ERROR] To see the full stack trace of the errors, re-run Maven with the -e switch.
[ERROR] Re-run Maven using the -X switch to enable full debug logging.
[ERROR] 
[ERROR] For more information about the errors and possible solutions, please read the following
articles:
[ERROR] [Help 1] http://cwiki.apache.org/confluence/display/MAVEN/MojoFailureException
[ERROR] 
[ERROR] After correcting the problems, you can resume the build with the command
[ERROR]   mvn <goals> -rf :atlas-titan
Build step 'Execute shell' marked build as failure
[CHECKSTYLE] Collecting checkstyle analysis files...
[CHECKSTYLE] Finding all files that match the pattern **/target/checkstyle-result.xml
[CHECKSTYLE] Parsing 18 files in <https://builds.apache.org/job/apache-atlas-nightly/ws/>
[CHECKSTYLE] Successfully parsed file <https://builds.apache.org/job/apache-atlas-nightly/ws/addons/falcon-bridge/target/checkstyle-result.xml>
with 52 unique warnings and 0 duplicates.
[CHECKSTYLE] Successfully parsed file <https://builds.apache.org/job/apache-atlas-nightly/ws/addons/hdfs-model/target/checkstyle-result.xml>
with 72 unique warnings and 0 duplicates.
[CHECKSTYLE] Successfully parsed file <https://builds.apache.org/job/apache-atlas-nightly/ws/addons/sqoop-bridge/target/checkstyle-result.xml>
with 88 unique warnings and 0 duplicates.
[CHECKSTYLE] Successfully parsed file <https://builds.apache.org/job/apache-atlas-nightly/ws/addons/storm-bridge/target/checkstyle-result.xml>
with 164 unique warnings and 0 duplicates.
[CHECKSTYLE] Successfully parsed file <https://builds.apache.org/job/apache-atlas-nightly/ws/authorization/target/checkstyle-result.xml>
with 301 unique warnings and 0 duplicates.
[CHECKSTYLE] Successfully parsed file <https://builds.apache.org/job/apache-atlas-nightly/ws/catalog/target/checkstyle-result.xml>
with 593 unique warnings and 0 duplicates.
[CHECKSTYLE] Successfully parsed file <https://builds.apache.org/job/apache-atlas-nightly/ws/client/target/checkstyle-result.xml>
with 678 unique warnings and 0 duplicates.
[CHECKSTYLE] Successfully parsed file <https://builds.apache.org/job/apache-atlas-nightly/ws/common/target/checkstyle-result.xml>
with 678 unique warnings and 0 duplicates.
[CHECKSTYLE] Successfully parsed file <https://builds.apache.org/job/apache-atlas-nightly/ws/dashboard/target/checkstyle-result.xml>
with 678 unique warnings and 0 duplicates.
[CHECKSTYLE] Successfully parsed file <https://builds.apache.org/job/apache-atlas-nightly/ws/dashboardv2/target/checkstyle-result.xml>
with 678 unique warnings and 0 duplicates.
[CHECKSTYLE] Successfully parsed file <https://builds.apache.org/job/apache-atlas-nightly/ws/distro/target/checkstyle-result.xml>
with 678 unique warnings and 0 duplicates.
[CHECKSTYLE] Successfully parsed file <https://builds.apache.org/job/apache-atlas-nightly/ws/docs/target/checkstyle-result.xml>
with 678 unique warnings and 0 duplicates.
[CHECKSTYLE] Successfully parsed file <https://builds.apache.org/job/apache-atlas-nightly/ws/graphdb/api/target/checkstyle-result.xml>
with 840 unique warnings and 0 duplicates.
[CHECKSTYLE] Successfully parsed file <https://builds.apache.org/job/apache-atlas-nightly/ws/graphdb/target/checkstyle-result.xml>
with 840 unique warnings and 0 duplicates.
[CHECKSTYLE] Successfully parsed file <https://builds.apache.org/job/apache-atlas-nightly/ws/notification/target/checkstyle-result.xml>
with 840 unique warnings and 0 duplicates.
[CHECKSTYLE] Successfully parsed file <https://builds.apache.org/job/apache-atlas-nightly/ws/server-api/target/checkstyle-result.xml>
with 870 unique warnings and 0 duplicates.
[CHECKSTYLE] Successfully parsed file <https://builds.apache.org/job/apache-atlas-nightly/ws/target/checkstyle-result.xml>
with 870 unique warnings and 0 duplicates.
[CHECKSTYLE] Successfully parsed file <https://builds.apache.org/job/apache-atlas-nightly/ws/typesystem/target/checkstyle-result.xml>
with 1591 unique warnings and 0 duplicates.
[CHECKSTYLE] Computing warning deltas based on reference build #270
[FINDBUGS] Collecting findbugs analysis files...
[FINDBUGS] Finding all files that match the pattern **/target/findbugs.xml
[FINDBUGS] Parsing 12 files in <https://builds.apache.org/job/apache-atlas-nightly/ws/>
[FINDBUGS] Successfully parsed file <https://builds.apache.org/job/apache-atlas-nightly/ws/addons/falcon-bridge/target/findbugs.xml>
with 0 unique warnings and 0 duplicates.
[FINDBUGS] Successfully parsed file <https://builds.apache.org/job/apache-atlas-nightly/ws/addons/hdfs-model/target/findbugs.xml>
with 0 unique warnings and 0 duplicates.
[FINDBUGS] Successfully parsed file <https://builds.apache.org/job/apache-atlas-nightly/ws/addons/sqoop-bridge/target/findbugs.xml>
with 0 unique warnings and 0 duplicates.
[FINDBUGS] Successfully parsed file <https://builds.apache.org/job/apache-atlas-nightly/ws/addons/storm-bridge/target/findbugs.xml>
with 0 unique warnings and 0 duplicates.
[FINDBUGS] Successfully parsed file <https://builds.apache.org/job/apache-atlas-nightly/ws/authorization/target/findbugs.xml>
with 0 unique warnings and 0 duplicates.
[FINDBUGS] Successfully parsed file <https://builds.apache.org/job/apache-atlas-nightly/ws/catalog/target/findbugs.xml>
with 0 unique warnings and 0 duplicates.
[FINDBUGS] Successfully parsed file <https://builds.apache.org/job/apache-atlas-nightly/ws/client/target/findbugs.xml>
with 0 unique warnings and 0 duplicates.
[FINDBUGS] Successfully parsed file <https://builds.apache.org/job/apache-atlas-nightly/ws/common/target/findbugs.xml>
with 0 unique warnings and 0 duplicates.
[FINDBUGS] Successfully parsed file <https://builds.apache.org/job/apache-atlas-nightly/ws/graphdb/api/target/findbugs.xml>
with 0 unique warnings and 0 duplicates.
[FINDBUGS] Successfully parsed file <https://builds.apache.org/job/apache-atlas-nightly/ws/notification/target/findbugs.xml>
with 0 unique warnings and 0 duplicates.
[FINDBUGS] Successfully parsed file <https://builds.apache.org/job/apache-atlas-nightly/ws/server-api/target/findbugs.xml>
with 0 unique warnings and 0 duplicates.
[FINDBUGS] Successfully parsed file <https://builds.apache.org/job/apache-atlas-nightly/ws/typesystem/target/findbugs.xml>
with 0 unique warnings and 0 duplicates.
[FINDBUGS] Computing warning deltas based on reference build #270
Archiving artifacts
Compressed 741.36 MB of artifacts by 80.1% relative to #270
TestNG Reports Processing: START
Looking for TestNG results report in workspace using pattern: **/target/surefire-reports/testng-results.xml,**/target/failsafe-reports/testng-results.xml
testng-results.xml was last modified before this build started. Ignoring it.
testng-results.xml was last modified before this build started. Ignoring it.
testng-results.xml was last modified before this build started. Ignoring it.
testng-results.xml was last modified before this build started. Ignoring it.
testng-results.xml was last modified before this build started. Ignoring it.
testng-results.xml was last modified before this build started. Ignoring it.
testng-results.xml was last modified before this build started. Ignoring it.
testng-results.xml was last modified before this build started. Ignoring it.
testng-results.xml was last modified before this build started. Ignoring it.
testng-results.xml was last modified before this build started. Ignoring it.
Saving reports...
Processing '/x1/jenkins/jenkins-home/jobs/apache-atlas-nightly/builds/355/testng/testng-results-1.xml'
Processing '/x1/jenkins/jenkins-home/jobs/apache-atlas-nightly/builds/355/testng/testng-results-2.xml'
Processing '/x1/jenkins/jenkins-home/jobs/apache-atlas-nightly/builds/355/testng/testng-results-3.xml'
Processing '/x1/jenkins/jenkins-home/jobs/apache-atlas-nightly/builds/355/testng/testng-results-4.xml'
Processing '/x1/jenkins/jenkins-home/jobs/apache-atlas-nightly/builds/355/testng/testng-results.xml'
TestNG Reports Processing: FINISH

Mime
View raw message