atlas-dev mailing list archives

Site index · List index
Message view « Date » · « Thread »
Top « Date » · « Thread »
From Apache Jenkins Server <jenk...@builds.apache.org>
Subject Build failed in Jenkins: apache-atlas-nightly #307
Date Thu, 09 Jun 2016 01:01:05 GMT
See <https://builds.apache.org/job/apache-atlas-nightly/307/changes>

Changes:

[sumasai.shivaprasad] ATLAS-867 Excessive logs: default log level should be set to 'info';

------------------------------------------
[...truncated 5922 lines...]
[INFO] Using incremental compilation
[INFO] Compiling 56 Java sources to <https://builds.apache.org/job/apache-atlas-nightly/ws/webapp/target/classes...>
[WARNING] Note: Some input files use or override a deprecated API.
[WARNING] Note: Recompile with -Xlint:deprecation for details.
[WARNING] Note: Some input files use unchecked or unsafe operations.
[WARNING] Note: Recompile with -Xlint:unchecked for details.
[INFO] 
[INFO] --- maven-compiler-plugin:3.1:compile (default-compile) @ atlas-webapp ---
[INFO] Changes detected - recompiling the module!
[INFO] Compiling 56 source files to <https://builds.apache.org/job/apache-atlas-nightly/ws/webapp/target/classes>
[WARNING] <https://builds.apache.org/job/apache-atlas-nightly/ws/webapp/src/main/java/org/apache/atlas/LocalServletRequest.java>:
Some input files use or override a deprecated API.
[WARNING] <https://builds.apache.org/job/apache-atlas-nightly/ws/webapp/src/main/java/org/apache/atlas/LocalServletRequest.java>:
Recompile with -Xlint:deprecation for details.
[WARNING] <https://builds.apache.org/job/apache-atlas-nightly/ws/webapp/src/main/java/org/apache/atlas/web/security/AtlasAuthenticationSuccessHandler.java>:
Some input files use unchecked or unsafe operations.
[WARNING] <https://builds.apache.org/job/apache-atlas-nightly/ws/webapp/src/main/java/org/apache/atlas/web/security/AtlasAuthenticationSuccessHandler.java>:
Recompile with -Xlint:unchecked for details.
[INFO] 
[INFO] --- maven-resources-plugin:2.7:testResources (default-testResources) @ atlas-webapp
---
[INFO] Using 'UTF-8' encoding to copy filtered resources.
[INFO] skip non existing resourceDirectory <https://builds.apache.org/job/apache-atlas-nightly/ws/webapp/src/test/resources>
[INFO] Copying 3 resources
[INFO] 
[INFO] --- scala-maven-plugin:3.2.0:testCompile (scala-test-compile-first) @ atlas-webapp
---
[WARNING] Zinc server is not available at port 3030 - reverting to normal incremental compile
[INFO] Using incremental compilation
[INFO] Compiling 41 Java sources to <https://builds.apache.org/job/apache-atlas-nightly/ws/webapp/target/test-classes...>
[WARNING] Note: Some input files use unchecked or unsafe operations.
[WARNING] Note: Recompile with -Xlint:unchecked for details.
[INFO] 
[INFO] --- maven-compiler-plugin:3.1:testCompile (default-testCompile) @ atlas-webapp ---
[INFO] Changes detected - recompiling the module!
[INFO] Compiling 41 source files to <https://builds.apache.org/job/apache-atlas-nightly/ws/webapp/target/test-classes>
[WARNING] <https://builds.apache.org/job/apache-atlas-nightly/ws/webapp/src/test/java/org/apache/atlas/notification/NotificationHookConsumerTest.java>:
Some input files use unchecked or unsafe operations.
[WARNING] <https://builds.apache.org/job/apache-atlas-nightly/ws/webapp/src/test/java/org/apache/atlas/notification/NotificationHookConsumerTest.java>:
Recompile with -Xlint:unchecked for details.
[INFO] 
[INFO] --- maven-war-plugin:2.6:war (default-war) @ atlas-webapp ---
[INFO] Packaging webapp
[INFO] Assembling webapp [atlas-webapp] in [<https://builds.apache.org/job/apache-atlas-nightly/ws/webapp/target/atlas-webapp-0.7-incubating-SNAPSHOT]>
[INFO] Processing overlay [ id org.apache.atlas:atlas-dashboardv2]
[INFO] Processing war project
[INFO] Copying webapp resources [<https://builds.apache.org/job/apache-atlas-nightly/ws/webapp/src/main/webapp]>
[INFO] Building jar: <https://builds.apache.org/job/apache-atlas-nightly/ws/webapp/target/atlas-webapp-0.7-incubating-SNAPSHOT/WEB-INF/lib/atlas-webapp-0.7-incubating-SNAPSHOT.jar>
[INFO] Webapp assembled in [2644 msecs]
[INFO] Building war: <https://builds.apache.org/job/apache-atlas-nightly/ws/webapp/target/atlas-webapp-0.7-incubating-SNAPSHOT.war>
[INFO] 
[INFO] --- maven-site-plugin:3.4:attach-descriptor (attach-descriptor) @ atlas-webapp ---
[INFO] 
[INFO] --- maven-surefire-plugin:2.18.1:test (default-test) @ atlas-webapp ---
[WARNING] The parameter forkMode is deprecated since version 2.14. Use forkCount and reuseForks
instead.
[INFO] Surefire report directory: <https://builds.apache.org/job/apache-atlas-nightly/ws/webapp/target/surefire-reports>
[INFO] Using configured provider org.apache.maven.surefire.testng.TestNGProvider
[WARNING] file.encoding cannot be set as system property, use <argLine>-Dfile.encoding=...<argLine>
instead

-------------------------------------------------------
 T E S T S
-------------------------------------------------------
Running org.apache.atlas.web.service.ActiveInstanceElectorServiceTest
Tests run: 14, Failures: 0, Errors: 0, Skipped: 0, Time elapsed: 1.582 sec - in org.apache.atlas.web.service.ActiveInstanceElectorServiceTest
Running org.apache.atlas.web.service.CuratorFactoryTest
Tests run: 3, Failures: 0, Errors: 0, Skipped: 0, Time elapsed: 1.565 sec - in org.apache.atlas.web.service.CuratorFactoryTest
Running org.apache.atlas.web.service.AtlasZookeeperSecurityPropertiesTest
Tests run: 6, Failures: 0, Errors: 0, Skipped: 0, Time elapsed: 0.461 sec - in org.apache.atlas.web.service.AtlasZookeeperSecurityPropertiesTest
Running org.apache.atlas.web.service.ServiceStateTest
Tests run: 3, Failures: 0, Errors: 0, Skipped: 0, Time elapsed: 0.911 sec - in org.apache.atlas.web.service.ServiceStateTest
Running org.apache.atlas.web.service.SecureEmbeddedServerTest
Tests run: 4, Failures: 0, Errors: 0, Skipped: 0, Time elapsed: 67.302 sec - in org.apache.atlas.web.service.SecureEmbeddedServerTest
Running org.apache.atlas.web.service.ActiveInstanceStateTest
Tests run: 5, Failures: 0, Errors: 0, Skipped: 0, Time elapsed: 1.181 sec - in org.apache.atlas.web.service.ActiveInstanceStateTest
Running org.apache.atlas.web.setup.SetupStepsTest
Tests run: 6, Failures: 0, Errors: 0, Skipped: 0, Time elapsed: 1.602 sec - in org.apache.atlas.web.setup.SetupStepsTest
Running org.apache.atlas.web.security.SSLAndKerberosTest
Tests run: 1, Failures: 0, Errors: 0, Skipped: 0, Time elapsed: 26.7 sec - in org.apache.atlas.web.security.SSLAndKerberosTest
Running org.apache.atlas.web.security.NegativeSSLAndKerberosTest
Tests run: 1, Failures: 1, Errors: 0, Skipped: 0, Time elapsed: 24.422 sec <<< FAILURE!
- in org.apache.atlas.web.security.NegativeSSLAndKerberosTest
testUnsecuredClient(org.apache.atlas.web.security.NegativeSSLAndKerberosTest)  Time elapsed:
0.601 sec  <<< FAILURE!
java.lang.AssertionError: Should have failed with GSSException
	at org.testng.Assert.fail(Assert.java:89)
	at org.apache.atlas.web.security.NegativeSSLAndKerberosTest.testUnsecuredClient(NegativeSSLAndKerberosTest.java:127)

Running org.apache.atlas.web.security.FileAuthenticationTest
Tests run: 6, Failures: 0, Errors: 0, Skipped: 0, Time elapsed: 3.879 sec - in org.apache.atlas.web.security.FileAuthenticationTest
Running org.apache.atlas.web.security.UserDaoTest
Tests run: 2, Failures: 0, Errors: 0, Skipped: 0, Time elapsed: 0.867 sec - in org.apache.atlas.web.security.UserDaoTest
Running org.apache.atlas.web.security.SSLTest
Tests run: 1, Failures: 0, Errors: 0, Skipped: 0, Time elapsed: 23.085 sec - in org.apache.atlas.web.security.SSLTest
Running org.apache.atlas.web.util.ServletsTest
Tests run: 1, Failures: 0, Errors: 0, Skipped: 0, Time elapsed: 0.918 sec - in org.apache.atlas.web.util.ServletsTest
Running org.apache.atlas.web.listeners.TestGuiceServletConfig$1
Tests run: 0, Failures: 0, Errors: 0, Skipped: 0, Time elapsed: 0.371 sec - in org.apache.atlas.web.listeners.TestGuiceServletConfig$1
Running org.apache.atlas.web.listeners.TestGuiceServletConfig
Tests run: 0, Failures: 0, Errors: 0, Skipped: 0, Time elapsed: 0.462 sec - in org.apache.atlas.web.listeners.TestGuiceServletConfig
Running org.apache.atlas.web.listeners.TestModule
Tests run: 0, Failures: 0, Errors: 0, Skipped: 0, Time elapsed: 0.448 sec - in org.apache.atlas.web.listeners.TestModule
Running org.apache.atlas.web.TestUtils
Tests run: 0, Failures: 0, Errors: 0, Skipped: 0, Time elapsed: 0.411 sec - in org.apache.atlas.web.TestUtils
Running org.apache.atlas.web.resources.AdminResourceTest
Tests run: 2, Failures: 0, Errors: 0, Skipped: 0, Time elapsed: 0.941 sec - in org.apache.atlas.web.resources.AdminResourceTest
Running org.apache.atlas.web.resources.TaxonomyServiceTest
Tests run: 12, Failures: 0, Errors: 0, Skipped: 0, Time elapsed: 1.533 sec - in org.apache.atlas.web.resources.TaxonomyServiceTest
Running org.apache.atlas.web.filters.ActiveServerFilterTest
Tests run: 9, Failures: 0, Errors: 0, Skipped: 0, Time elapsed: 1.419 sec - in org.apache.atlas.web.filters.ActiveServerFilterTest
Running org.apache.atlas.web.filters.AtlasAuthenticationSimpleFilterTest
Tests run: 0, Failures: 0, Errors: 0, Skipped: 0, Time elapsed: 0.363 sec - in org.apache.atlas.web.filters.AtlasAuthenticationSimpleFilterTest
Running org.apache.atlas.web.filters.AtlasAuthenticationKerberosFilterTest
Tests run: 0, Failures: 0, Errors: 0, Skipped: 0, Time elapsed: 0.416 sec - in org.apache.atlas.web.filters.AtlasAuthenticationKerberosFilterTest
Running org.apache.atlas.LocalAtlasClientTest
Tests run: 5, Failures: 0, Errors: 0, Skipped: 0, Time elapsed: 2.822 sec - in org.apache.atlas.LocalAtlasClientTest
Running org.apache.atlas.notification.NotificationHookConsumerKafkaTest
Tests run: 2, Failures: 2, Errors: 0, Skipped: 0, Time elapsed: 6.336 sec <<< FAILURE!
- in org.apache.atlas.notification.NotificationHookConsumerKafkaTest
testConsumerConsumesNewMessageWithAutoCommitDisabled(org.apache.atlas.notification.NotificationHookConsumerKafkaTest)
 Time elapsed: 1.788 sec  <<< FAILURE!
kafka.consumer.ConsumerTimeoutException: null
	at kafka.consumer.ConsumerIterator.makeNext(ConsumerIterator.scala:69)
	at kafka.consumer.ConsumerIterator.makeNext(ConsumerIterator.scala:33)
	at kafka.utils.IteratorTemplate.maybeComputeNext(IteratorTemplate.scala:66)
	at kafka.utils.IteratorTemplate.hasNext(IteratorTemplate.scala:58)
	at org.apache.atlas.kafka.KafkaConsumer.hasNext(KafkaConsumer.java:69)
	at org.apache.atlas.notification.NotificationHookConsumerKafkaTest.consumeOneMessage(NotificationHookConsumerKafkaTest.java:114)
	at org.apache.atlas.notification.NotificationHookConsumerKafkaTest.testConsumerConsumesNewMessageWithAutoCommitDisabled(NotificationHookConsumerKafkaTest.java:68)

testConsumerRemainsAtSameMessageWithAutoCommitEnabled(org.apache.atlas.notification.NotificationHookConsumerKafkaTest)
 Time elapsed: 0.399 sec  <<< FAILURE!
kafka.consumer.ConsumerTimeoutException: null
	at kafka.consumer.ConsumerIterator.makeNext(ConsumerIterator.scala:69)
	at kafka.consumer.ConsumerIterator.makeNext(ConsumerIterator.scala:33)
	at kafka.utils.IteratorTemplate.maybeComputeNext(IteratorTemplate.scala:66)
	at kafka.utils.IteratorTemplate.hasNext(IteratorTemplate.scala:58)
	at org.apache.atlas.kafka.KafkaConsumer.hasNext(KafkaConsumer.java:69)
	at org.apache.atlas.notification.NotificationHookConsumerKafkaTest.consumeOneMessage(NotificationHookConsumerKafkaTest.java:114)
	at org.apache.atlas.notification.NotificationHookConsumerKafkaTest.testConsumerRemainsAtSameMessageWithAutoCommitEnabled(NotificationHookConsumerKafkaTest.java:94)

Running org.apache.atlas.notification.NotificationEntityChangeListenerTest
Tests run: 1, Failures: 0, Errors: 0, Skipped: 0, Time elapsed: 1.285 sec - in org.apache.atlas.notification.NotificationEntityChangeListenerTest
Running org.apache.atlas.notification.NotificationHookConsumerTest
Tests run: 10, Failures: 0, Errors: 0, Skipped: 0, Time elapsed: 1.265 sec - in org.apache.atlas.notification.NotificationHookConsumerTest

Results :

Failed tests: 
  NotificationHookConsumerKafkaTest.testConsumerConsumesNewMessageWithAutoCommitDisabled:68->consumeOneMessage:114
» ConsumerTimeout
  NotificationHookConsumerKafkaTest.testConsumerRemainsAtSameMessageWithAutoCommitEnabled:94->consumeOneMessage:114
» ConsumerTimeout
  NegativeSSLAndKerberosTest.testUnsecuredClient:127 Should have failed with GSSException

Tests run: 94, Failures: 3, Errors: 0, Skipped: 0

[INFO] ------------------------------------------------------------------------
[INFO] Reactor Summary:
[INFO] 
[INFO] apache-atlas ...................................... SUCCESS [ 24.427 s]
[INFO] Apache Atlas Common ............................... SUCCESS [ 33.273 s]
[INFO] Apache Atlas Typesystem ........................... SUCCESS [01:41 min]
[INFO] Apache Atlas Client ............................... SUCCESS [ 26.208 s]
[INFO] Apache Atlas Server API ........................... SUCCESS [ 14.173 s]
[INFO] Apache Atlas Notification ......................... SUCCESS [ 39.164 s]
[INFO] Apache Atlas Graph Database Projects .............. SUCCESS [  0.679 s]
[INFO] Apache Atlas Graph Database API ................... SUCCESS [  9.698 s]
[INFO] Apache Atlas Titan ................................ SUCCESS [ 33.790 s]
[INFO] Apache Atlas Repository ........................... SUCCESS [12:02 min]
[INFO] Apache Atlas Authorization ........................ SUCCESS [ 23.026 s]
[INFO] Apache Atlas Business Catalog ..................... SUCCESS [ 46.689 s]
[INFO] Apache Atlas UI ................................... SUCCESS [01:06 min]
[INFO] Apache Atlas Web Application ...................... FAILURE [03:33 min]
[INFO] Apache Atlas Documentation ........................ SKIPPED
[INFO] Apache Atlas FileSystem Model ..................... SKIPPED
[INFO] Apache Atlas Hive Bridge .......................... SKIPPED
[INFO] Apache Atlas Falcon Bridge ........................ SKIPPED
[INFO] Apache Atlas Sqoop Bridge ......................... SKIPPED
[INFO] Apache Atlas Storm Bridge ......................... SKIPPED
[INFO] Apache Atlas Distribution ......................... SKIPPED
[INFO] ------------------------------------------------------------------------
[INFO] BUILD FAILURE
[INFO] ------------------------------------------------------------------------
[INFO] Total time: 22:37 min
[INFO] Finished at: 2016-06-09T00:59:17+00:00
[INFO] Final Memory: 130M/888M
[INFO] ------------------------------------------------------------------------
[ERROR] Failed to execute goal org.apache.maven.plugins:maven-surefire-plugin:2.18.1:test
(default-test) on project atlas-webapp: There are test failures.
[ERROR] 
[ERROR] Please refer to <https://builds.apache.org/job/apache-atlas-nightly/ws/webapp/target/surefire-reports>
for the individual test results.
[ERROR] -> [Help 1]
[ERROR] 
[ERROR] To see the full stack trace of the errors, re-run Maven with the -e switch.
[ERROR] Re-run Maven using the -X switch to enable full debug logging.
[ERROR] 
[ERROR] For more information about the errors and possible solutions, please read the following
articles:
[ERROR] [Help 1] http://cwiki.apache.org/confluence/display/MAVEN/MojoFailureException
[ERROR] 
[ERROR] After correcting the problems, you can resume the build with the command
[ERROR]   mvn <goals> -rf :atlas-webapp
Build step 'Execute shell' marked build as failure
[CHECKSTYLE] Collecting checkstyle analysis files...
[CHECKSTYLE] Finding all files that match the pattern **/target/checkstyle-result.xml
[CHECKSTYLE] Parsing 20 files in <https://builds.apache.org/job/apache-atlas-nightly/ws/>
[CHECKSTYLE] Successfully parsed file <https://builds.apache.org/job/apache-atlas-nightly/ws/addons/falcon-bridge/target/checkstyle-result.xml>
with 52 unique warnings and 0 duplicates.
[CHECKSTYLE] Successfully parsed file <https://builds.apache.org/job/apache-atlas-nightly/ws/addons/hdfs-model/target/checkstyle-result.xml>
with 72 unique warnings and 0 duplicates.
[CHECKSTYLE] Successfully parsed file <https://builds.apache.org/job/apache-atlas-nightly/ws/addons/sqoop-bridge/target/checkstyle-result.xml>
with 88 unique warnings and 0 duplicates.
[CHECKSTYLE] Successfully parsed file <https://builds.apache.org/job/apache-atlas-nightly/ws/addons/storm-bridge/target/checkstyle-result.xml>
with 164 unique warnings and 0 duplicates.
[CHECKSTYLE] Successfully parsed file <https://builds.apache.org/job/apache-atlas-nightly/ws/authorization/target/checkstyle-result.xml>
with 301 unique warnings and 0 duplicates.
[CHECKSTYLE] Successfully parsed file <https://builds.apache.org/job/apache-atlas-nightly/ws/catalog/target/checkstyle-result.xml>
with 595 unique warnings and 0 duplicates.
[CHECKSTYLE] Successfully parsed file <https://builds.apache.org/job/apache-atlas-nightly/ws/client/target/checkstyle-result.xml>
with 680 unique warnings and 0 duplicates.
[CHECKSTYLE] Successfully parsed file <https://builds.apache.org/job/apache-atlas-nightly/ws/common/target/checkstyle-result.xml>
with 680 unique warnings and 0 duplicates.
[CHECKSTYLE] Successfully parsed file <https://builds.apache.org/job/apache-atlas-nightly/ws/dashboard/target/checkstyle-result.xml>
with 680 unique warnings and 0 duplicates.
[CHECKSTYLE] Successfully parsed file <https://builds.apache.org/job/apache-atlas-nightly/ws/dashboardv2/target/checkstyle-result.xml>
with 680 unique warnings and 0 duplicates.
[CHECKSTYLE] Successfully parsed file <https://builds.apache.org/job/apache-atlas-nightly/ws/distro/target/checkstyle-result.xml>
with 680 unique warnings and 0 duplicates.
[CHECKSTYLE] Successfully parsed file <https://builds.apache.org/job/apache-atlas-nightly/ws/docs/target/checkstyle-result.xml>
with 680 unique warnings and 0 duplicates.
[CHECKSTYLE] Successfully parsed file <https://builds.apache.org/job/apache-atlas-nightly/ws/graphdb/api/target/checkstyle-result.xml>
with 842 unique warnings and 0 duplicates.
[CHECKSTYLE] Successfully parsed file <https://builds.apache.org/job/apache-atlas-nightly/ws/graphdb/target/checkstyle-result.xml>
with 842 unique warnings and 0 duplicates.
[CHECKSTYLE] Successfully parsed file <https://builds.apache.org/job/apache-atlas-nightly/ws/notification/target/checkstyle-result.xml>
with 842 unique warnings and 0 duplicates.
[CHECKSTYLE] Successfully parsed file <https://builds.apache.org/job/apache-atlas-nightly/ws/repository/target/checkstyle-result.xml>
with 1680 unique warnings and 0 duplicates.
[CHECKSTYLE] Successfully parsed file <https://builds.apache.org/job/apache-atlas-nightly/ws/server-api/target/checkstyle-result.xml>
with 1710 unique warnings and 0 duplicates.
[CHECKSTYLE] Successfully parsed file <https://builds.apache.org/job/apache-atlas-nightly/ws/target/checkstyle-result.xml>
with 1710 unique warnings and 0 duplicates.
[CHECKSTYLE] Successfully parsed file <https://builds.apache.org/job/apache-atlas-nightly/ws/titan/target/checkstyle-result.xml>
with 2079 unique warnings and 0 duplicates.
[CHECKSTYLE] Successfully parsed file <https://builds.apache.org/job/apache-atlas-nightly/ws/typesystem/target/checkstyle-result.xml>
with 2805 unique warnings and 0 duplicates.
[CHECKSTYLE] Computing warning deltas based on reference build #270
[FINDBUGS] Collecting findbugs analysis files...
[FINDBUGS] Finding all files that match the pattern **/target/findbugs.xml
[FINDBUGS] Parsing 14 files in <https://builds.apache.org/job/apache-atlas-nightly/ws/>
[FINDBUGS] Successfully parsed file <https://builds.apache.org/job/apache-atlas-nightly/ws/addons/falcon-bridge/target/findbugs.xml>
with 0 unique warnings and 0 duplicates.
[FINDBUGS] Successfully parsed file <https://builds.apache.org/job/apache-atlas-nightly/ws/addons/hdfs-model/target/findbugs.xml>
with 0 unique warnings and 0 duplicates.
[FINDBUGS] Successfully parsed file <https://builds.apache.org/job/apache-atlas-nightly/ws/addons/sqoop-bridge/target/findbugs.xml>
with 0 unique warnings and 0 duplicates.
[FINDBUGS] Successfully parsed file <https://builds.apache.org/job/apache-atlas-nightly/ws/addons/storm-bridge/target/findbugs.xml>
with 0 unique warnings and 0 duplicates.
[FINDBUGS] Successfully parsed file <https://builds.apache.org/job/apache-atlas-nightly/ws/authorization/target/findbugs.xml>
with 0 unique warnings and 0 duplicates.
[FINDBUGS] Successfully parsed file <https://builds.apache.org/job/apache-atlas-nightly/ws/catalog/target/findbugs.xml>
with 0 unique warnings and 0 duplicates.
[FINDBUGS] Successfully parsed file <https://builds.apache.org/job/apache-atlas-nightly/ws/client/target/findbugs.xml>
with 0 unique warnings and 0 duplicates.
[FINDBUGS] Successfully parsed file <https://builds.apache.org/job/apache-atlas-nightly/ws/common/target/findbugs.xml>
with 0 unique warnings and 0 duplicates.
[FINDBUGS] Successfully parsed file <https://builds.apache.org/job/apache-atlas-nightly/ws/graphdb/api/target/findbugs.xml>
with 0 unique warnings and 0 duplicates.
[FINDBUGS] Successfully parsed file <https://builds.apache.org/job/apache-atlas-nightly/ws/notification/target/findbugs.xml>
with 0 unique warnings and 0 duplicates.
[FINDBUGS] Successfully parsed file <https://builds.apache.org/job/apache-atlas-nightly/ws/repository/target/findbugs.xml>
with 0 unique warnings and 0 duplicates.
[FINDBUGS] Successfully parsed file <https://builds.apache.org/job/apache-atlas-nightly/ws/server-api/target/findbugs.xml>
with 0 unique warnings and 0 duplicates.
[FINDBUGS] Successfully parsed file <https://builds.apache.org/job/apache-atlas-nightly/ws/titan/target/findbugs.xml>
with 0 unique warnings and 0 duplicates.
[FINDBUGS] Successfully parsed file <https://builds.apache.org/job/apache-atlas-nightly/ws/typesystem/target/findbugs.xml>
with 0 unique warnings and 0 duplicates.
[FINDBUGS] Computing warning deltas based on reference build #270
Archiving artifacts
Compressed 739.87 MB of artifacts by 80.2% relative to #270
TestNG Reports Processing: START
Looking for TestNG results report in workspace using pattern: **/target/surefire-reports/testng-results.xml,**/target/failsafe-reports/testng-results.xml
testng-results.xml was last modified before this build started. Ignoring it.
testng-results.xml was last modified before this build started. Ignoring it.
testng-results.xml was last modified before this build started. Ignoring it.
testng-results.xml was last modified before this build started. Ignoring it.
testng-results.xml was last modified before this build started. Ignoring it.
testng-results.xml was last modified before this build started. Ignoring it.
Saving reports...
Processing '/x1/jenkins/jenkins-home/jobs/apache-atlas-nightly/builds/307/testng/testng-results-1.xml'
Processing '/x1/jenkins/jenkins-home/jobs/apache-atlas-nightly/builds/307/testng/testng-results-2.xml'
Processing '/x1/jenkins/jenkins-home/jobs/apache-atlas-nightly/builds/307/testng/testng-results-3.xml'
Processing '/x1/jenkins/jenkins-home/jobs/apache-atlas-nightly/builds/307/testng/testng-results-4.xml'
Processing '/x1/jenkins/jenkins-home/jobs/apache-atlas-nightly/builds/307/testng/testng-results-5.xml'
Processing '/x1/jenkins/jenkins-home/jobs/apache-atlas-nightly/builds/307/testng/testng-results-6.xml'
Processing '/x1/jenkins/jenkins-home/jobs/apache-atlas-nightly/builds/307/testng/testng-results-7.xml'
Processing '/x1/jenkins/jenkins-home/jobs/apache-atlas-nightly/builds/307/testng/testng-results-8.xml'
Processing '/x1/jenkins/jenkins-home/jobs/apache-atlas-nightly/builds/307/testng/testng-results.xml'
TestNG Reports Processing: FINISH

Mime
View raw message