atlas-dev mailing list archives

Site index · List index
Message view « Date » · « Thread »
Top « Date » · « Thread »
From "ATLAS QA (JIRA)" <j...@apache.org>
Subject [jira] [Commented] (ATLAS-841) mvn clean install of Atlas is failing python unit tests
Date Mon, 30 May 2016 16:07:13 GMT

    [ https://issues.apache.org/jira/browse/ATLAS-841?page=com.atlassian.jira.plugin.system.issuetabpanels:comment-tabpanel&focusedCommentId=15306790#comment-15306790
] 

ATLAS QA commented on ATLAS-841:
--------------------------------

{color:red}-1 overall{color}.  Here are the results of testing the latest attachment
  http://issues.apache.org/jira/secure/attachment/12806984/ATLAS-841.patch
  against master revision 65d95eb.

    {color:green}+1 @author{color}.  The patch does not contain any @author tags.

    {color:green}+1 tests included{color}.  The patch appears to include 1 new or modified
test files.

    {color:green}+1 javac{color}.  The applied patch does not increase the total number of
javac compiler warnings.

    {color:green}+1 javadoc{color}.  There were no new javadoc warning messages.

    +1 checkstyle.  The patch generated 0 code style errors.

    {color:red}-1 findbugs{color}.  The patch appears to introduce 379 new Findbugs (version
2.0.3) warnings.

    {color:green}+1 release audit{color}.  The applied patch does not increase the total number
of release audit warnings.

    {color:red}-1 core tests{color}.  The patch failed these unit tests in :
 ./webapp/test-output/junitreports/TEST-org.apache.atlas.web.resources.TypesJerseyResourceIT
./webapp/test-output/junitreports/TEST-org.apache.atlas.web.resources.AdminJerseyResourceIT
./webapp/test-output/junitreports/TEST-org.apache.atlas.web.resources.MetadataDiscoveryJerseyResourceIT
./webapp/test-output/junitreports/TEST-org.apache.atlas.web.resources.RexsterGraphJerseyResourceIT
./webapp/test-output/junitreports/TEST-org.apache.atlas.web.resources.EntityJerseyResourceIT

Test results: https://builds.apache.org/job/PreCommit-ATLAS-Build/266//testReport/
Findbugs warnings: https://builds.apache.org/job/PreCommit-ATLAS-Build/266//artifact/patchprocess/newPatchFindbugsWarningshive-bridge.html
Findbugs warnings: https://builds.apache.org/job/PreCommit-ATLAS-Build/266//artifact/patchprocess/newPatchFindbugsWarningsfalcon-bridge.html
Findbugs warnings: https://builds.apache.org/job/PreCommit-ATLAS-Build/266//artifact/patchprocess/newPatchFindbugsWarningssqoop-bridge.html
Findbugs warnings: https://builds.apache.org/job/PreCommit-ATLAS-Build/266//artifact/patchprocess/newPatchFindbugsWarningsstorm-bridge.html
Findbugs warnings: https://builds.apache.org/job/PreCommit-ATLAS-Build/266//artifact/patchprocess/newPatchFindbugsWarningshdfs-model.html
Findbugs warnings: https://builds.apache.org/job/PreCommit-ATLAS-Build/266//artifact/patchprocess/newPatchFindbugsWarningsauthorization.html
Findbugs warnings: https://builds.apache.org/job/PreCommit-ATLAS-Build/266//artifact/patchprocess/newPatchFindbugsWarningsclient.html
Findbugs warnings: https://builds.apache.org/job/PreCommit-ATLAS-Build/266//artifact/patchprocess/newPatchFindbugsWarningsnotification.html
Findbugs warnings: https://builds.apache.org/job/PreCommit-ATLAS-Build/266//artifact/patchprocess/newPatchFindbugsWarningstypesystem.html
Findbugs warnings: https://builds.apache.org/job/PreCommit-ATLAS-Build/266//artifact/patchprocess/newPatchFindbugsWarningscatalog.html
Findbugs warnings: https://builds.apache.org/job/PreCommit-ATLAS-Build/266//artifact/patchprocess/newPatchFindbugsWarningscommon.html
Findbugs warnings: https://builds.apache.org/job/PreCommit-ATLAS-Build/266//artifact/patchprocess/newPatchFindbugsWarningstitan.html
Findbugs warnings: https://builds.apache.org/job/PreCommit-ATLAS-Build/266//artifact/patchprocess/newPatchFindbugsWarningsrepository.html
Findbugs warnings: https://builds.apache.org/job/PreCommit-ATLAS-Build/266//artifact/patchprocess/newPatchFindbugsWarningswebapp.html
Console output: https://builds.apache.org/job/PreCommit-ATLAS-Build/266//console

This message is automatically generated.

> mvn clean install of Atlas is failing python unit tests
> -------------------------------------------------------
>
>                 Key: ATLAS-841
>                 URL: https://issues.apache.org/jira/browse/ATLAS-841
>             Project: Atlas
>          Issue Type: Bug
>            Reporter: Hemanth Yamijala
>            Assignee: Hemanth Yamijala
>            Priority: Blocker
>             Fix For: 0.7-incubating
>
>         Attachments: ATLAS-841.patch
>
>
> Run mvn clean install on master, git id: 65d95ebe23744f72c0ed40b9a171d3c42cd2906c. It
fails as below:
> {code}
> [INFO] --- exec-maven-plugin:1.2.1:exec (python-test) @ atlas-distro ---
> test_jar_java_lookups_fail (TestMetadata.TestMetadata) ... ok
> test_jar_java_lookups_succeed_from_path (TestMetadata.TestMetadata) ... ok
> test_main (TestMetadata.TestMetadata) ... Apache Atlas Server started!!!
> FAIL
> ======================================================================
> FAIL: test_main (TestMetadata.TestMetadata)
> ----------------------------------------------------------------------
> Traceback (most recent call last):
>   File "/Users/hyamijala/projects/hwx/atlas/src/atlas/distro/src/test/mock/mock.py",
line 1199, in patched
>     return func(*args, **keywargs)
>   File "/Users/hyamijala/projects/hwx/atlas/src/atlas/distro/src/test/python/scripts/TestMetadata.py",
line 58, in test_main
>     self.assertTrue(configure_hbase_mock.called)
> AssertionError: False is not true
> ----------------------------------------------------------------------
> Ran 3 tests in 0.004s
> FAILED (failures=1)
> [INFO] ------------------------------------------------------------------------
> [INFO] BUILD FAILURE
> [INFO] ------------------------------------------------------------------------
> {code}



--
This message was sent by Atlassian JIRA
(v6.3.4#6332)

Mime
View raw message