atlas-dev mailing list archives

Site index · List index
Message view « Date » · « Thread »
Top « Date » · « Thread »
From Apache Jenkins Server <jenk...@builds.apache.org>
Subject Build failed in Jenkins: apache-atlas-nightly #258
Date Thu, 05 May 2016 13:04:45 GMT
See <https://builds.apache.org/job/apache-atlas-nightly/258/changes>

Changes:

[sshivalingamurthy] ATLAS-659 atlas_start fails on Windows (dkantor via shwethags)

------------------------------------------
[...truncated 15879 lines...]
127.0.0.1 - - [05/May/2016:13:00:33 +0000] "OPTIONS /api/atlas/entities/4803533d-b8e9-4908-bc9d-184ad58852da/audit?count=100&user.name=jenkins
HTTP/1.1" 200 - "-" "Java/1.7.0_80"
127.0.0.1 - - [05/May/2016:13:00:33 +0000] "GET /api/atlas/entities/4803533d-b8e9-4908-bc9d-184ad58852da/audit?count=100
HTTP/1.1" 200 - "-" "Java/1.7.0_80"
127.0.0.1 - - [05/May/2016:13:00:34 +0000] "OPTIONS /api/atlas/types?user.name=jenkins HTTP/1.1"
200 - "-" "Java/1.7.0_80"
127.0.0.1 - - [05/May/2016:13:00:34 +0000] "POST /api/atlas/types HTTP/1.1" 201 - "-" "Java/1.7.0_80"
127.0.0.1 - - [05/May/2016:13:00:34 +0000] "OPTIONS /api/atlas/entities?user.name=jenkins
HTTP/1.1" 200 - "-" "Java/1.7.0_80"
127.0.0.1 - - [05/May/2016:13:00:34 +0000] "POST /api/atlas/entities HTTP/1.1" 201 - "-" "Java/1.7.0_80"
127.0.0.1 - - [05/May/2016:13:00:34 +0000] "OPTIONS /api/atlas/types?user.name=jenkins HTTP/1.1"
200 - "-" "Java/1.7.0_80"
127.0.0.1 - - [05/May/2016:13:00:34 +0000] "PUT /api/atlas/types HTTP/1.1" 200 - "-" "Java/1.7.0_80"
127.0.0.1 - - [05/May/2016:13:00:34 +0000] "OPTIONS /api/atlas/entities/35ce3dd6-bb7f-4945-a511-674543f5df16?user.name=jenkins
HTTP/1.1" 200 - "-" "Java/1.7.0_80"
127.0.0.1 - - [05/May/2016:13:00:34 +0000] "GET /api/atlas/entities/35ce3dd6-bb7f-4945-a511-674543f5df16
HTTP/1.1" 200 - "-" "Java/1.7.0_80"
127.0.0.1 - - [05/May/2016:13:00:34 +0000] "OPTIONS /api/atlas/entities?user.name=jenkins
HTTP/1.1" 200 - "-" "Java/1.7.0_80"
127.0.0.1 - - [05/May/2016:13:00:34 +0000] "POST /api/atlas/entities HTTP/1.1" 400 - "-" "Java/1.7.0_80"
127.0.0.1 - - [05/May/2016:13:00:34 +0000] "OPTIONS /api/atlas/entities?user.name=jenkins
HTTP/1.1" 200 - "-" "Java/1.7.0_80"
127.0.0.1 - - [05/May/2016:13:00:34 +0000] "POST /api/atlas/entities HTTP/1.1" 400 - "-" "Java/1.7.0_80"
127.0.0.1 - - [05/May/2016:13:00:34 +0000] "OPTIONS /api/atlas/entities?user.name=jenkins
HTTP/1.1" 200 - "-" "Java/1.7.0_80"
127.0.0.1 - - [05/May/2016:13:00:34 +0000] "POST /api/atlas/entities HTTP/1.1" 201 - "-" "Java/1.7.0_80"
127.0.0.1 - - [05/May/2016:13:00:34 +0000] "OPTIONS /api/atlas/entities?type=hive_db&property=name&value=453TrrH3MZ&user.name=jenkins
HTTP/1.1" 200 - "-" "Java/1.7.0_80"
127.0.0.1 - - [05/May/2016:13:00:35 +0000] "GET /api/atlas/entities?type=hive_db&property=name&value=453TrrH3MZ
HTTP/1.1" 200 - "-" "Java/1.7.0_80"
127.0.0.1 - - [05/May/2016:13:00:35 +0000] "GET /api/atlas/entities?type=blah HTTP/1.1" 400
- "-" "Java/1.7.0_80"
127.0.0.1 - - [05/May/2016:13:00:35 +0000] "POST /api/atlas/types HTTP/1.1" 201 - "-" "Java/1.7.0_80"
127.0.0.1 - - [05/May/2016:13:00:35 +0000] "GET /api/atlas/entities?type=testX6fxEup7p7 HTTP/1.1"
200 - "-" "Java/1.7.0_80"
127.0.0.1 - - [05/May/2016:13:00:35 +0000] "GET /api/atlas/entities/blah HTTP/1.1" 404 - "-"
"Java/1.7.0_80"
127.0.0.1 - - [05/May/2016:13:00:35 +0000] "OPTIONS /api/atlas/entities?user.name=jenkins
HTTP/1.1" 200 - "-" "Java/1.7.0_80"
127.0.0.1 - - [05/May/2016:13:00:35 +0000] "POST /api/atlas/entities HTTP/1.1" 400 - "-" "Java/1.7.0_80"
127.0.0.1 - - [05/May/2016:13:00:35 +0000] "POST /api/atlas/entities HTTP/1.1" 201 - "-" "Java/1.7.0_80"
127.0.0.1 - - [05/May/2016:13:00:35 +0000] "OPTIONS /api/atlas/types/%EA%86%B6%E8%8B%B6%E7%9E%98%E4%A8%9B%E6%95%A5%E6%98%8A%EE%AC%8C%E7%83%AD%EA%9C%8C%EA%91%AA?user.name=jenkins
HTTP/1.1" 200 - "-" "Java/1.7.0_80"
127.0.0.1 - - [05/May/2016:13:00:35 +0000] "GET /api/atlas/types/%EA%86%B6%E8%8B%B6%E7%9E%98%E4%A8%9B%E6%95%A5%E6%98%8A%EE%AC%8C%E7%83%AD%EA%9C%8C%EA%91%AA
HTTP/1.1" 404 - "-" "Java/1.7.0_80"
127.0.0.1 - - [05/May/2016:13:00:35 +0000] "POST /api/atlas/types HTTP/1.1" 201 - "-" "Java/1.7.0_80"
127.0.0.1 - - [05/May/2016:13:00:35 +0000] "OPTIONS /api/atlas/entities?user.name=jenkins
HTTP/1.1" 200 - "-" "Java/1.7.0_80"
127.0.0.1 - - [05/May/2016:13:00:35 +0000] "POST /api/atlas/entities HTTP/1.1" 201 - "-" "Java/1.7.0_80"
127.0.0.1 - - [05/May/2016:13:00:35 +0000] "GET /api/atlas/entities/aefd2c60-4eec-4ba8-a95c-24f9755d8a79
HTTP/1.1" 200 - "-" "Java/1.7.0_80"
Tests run: 31, Failures: 1, Errors: 0, Skipped: 0, Time elapsed: 9.354 sec <<< FAILURE!
- in org.apache.atlas.web.resources.EntityJerseyResourceIT
testEntityDeduping(org.apache.atlas.web.resources.EntityJerseyResourceIT)  Time elapsed: 1.084
sec  <<< FAILURE!
java.lang.Exception: Waiting timed out after 1000 msec
	at org.apache.atlas.web.resources.EntityJerseyResourceIT.testEntityDeduping(EntityJerseyResourceIT.java:155)

Running org.apache.atlas.web.resources.TypesJerseyResourceIT
127.0.0.1 - - [05/May/2016:13:00:39 +0000] "POST /api/atlas/types HTTP/1.1" 201 - "-" "Java/1.7.0_80"
127.0.0.1 - - [05/May/2016:13:00:39 +0000] "POST /api/atlas/types HTTP/1.1" 201 - "-" "Java/1.7.0_80"
127.0.0.1 - - [05/May/2016:13:00:39 +0000] "POST /api/atlas/types HTTP/1.1" 201 - "-" "Java/1.7.0_80"
127.0.0.1 - - [05/May/2016:13:00:39 +0000] "GET /api/atlas/types/database HTTP/1.1" 200 -
"-" "Java/1.7.0_80"
127.0.0.1 - - [05/May/2016:13:00:39 +0000] "GET /api/atlas/types/table HTTP/1.1" 200 - "-"
"Java/1.7.0_80"
127.0.0.1 - - [05/May/2016:13:00:39 +0000] "GET /api/atlas/types/fetl HTTP/1.1" 200 - "-"
"Java/1.7.0_80"
127.0.0.1 - - [05/May/2016:13:00:39 +0000] "GET /api/atlas/types HTTP/1.1" 200 - "-" "Java/1.7.0_80"
127.0.0.1 - - [05/May/2016:13:00:39 +0000] "OPTIONS /api/atlas/types?user.name=jenkins HTTP/1.1"
200 - "-" "Java/1.7.0_80"
127.0.0.1 - - [05/May/2016:13:00:39 +0000] "POST /api/atlas/types HTTP/1.1" 201 - "-" "Java/1.7.0_80"
127.0.0.1 - - [05/May/2016:13:00:39 +0000] "OPTIONS /api/atlas/types?user.name=jenkins HTTP/1.1"
200 - "-" "Java/1.7.0_80"
127.0.0.1 - - [05/May/2016:13:00:39 +0000] "PUT /api/atlas/types HTTP/1.1" 200 - "-" "Java/1.7.0_80"
127.0.0.1 - - [05/May/2016:13:00:40 +0000] "POST /api/atlas/types HTTP/1.1" 201 - "-" "Java/1.7.0_80"
127.0.0.1 - - [05/May/2016:13:00:40 +0000] "POST /api/atlas/types HTTP/1.1" 201 - "-" "Java/1.7.0_80"
127.0.0.1 - - [05/May/2016:13:00:40 +0000] "POST /api/atlas/types HTTP/1.1" 201 - "-" "Java/1.7.0_80"
127.0.0.1 - - [05/May/2016:13:00:40 +0000] "POST /api/atlas/types HTTP/1.1" 201 - "-" "Java/1.7.0_80"
127.0.0.1 - - [05/May/2016:13:00:40 +0000] "POST /api/atlas/types HTTP/1.1" 201 - "-" "Java/1.7.0_80"
127.0.0.1 - - [05/May/2016:13:00:40 +0000] "POST /api/atlas/types HTTP/1.1" 201 - "-" "Java/1.7.0_80"
127.0.0.1 - - [05/May/2016:13:00:40 +0000] "GET /api/atlas/types?type=TRAIT HTTP/1.1" 200
- "-" "Java/1.7.0_80"
127.0.0.1 - - [05/May/2016:13:00:40 +0000] "GET /api/atlas/types/blah HTTP/1.1" 404 - "-"
"Java/1.7.0_80"
Tests run: 6, Failures: 0, Errors: 0, Skipped: 0, Time elapsed: 3.604 sec - in org.apache.atlas.web.resources.TypesJerseyResourceIT
Running org.apache.atlas.web.resources.AdminJerseyResourceIT
127.0.0.1 - - [05/May/2016:13:00:43 +0000] "GET /api/atlas/admin/version HTTP/1.1" 200 - "-"
"Java/1.7.0_80"
Tests run: 1, Failures: 0, Errors: 0, Skipped: 0, Time elapsed: 2.563 sec - in org.apache.atlas.web.resources.AdminJerseyResourceIT
Running org.apache.atlas.web.filters.AtlasAuthenticationKerberosFilterIT
Tests run: 0, Failures: 0, Errors: 0, Skipped: 0, Time elapsed: 0.327 sec - in org.apache.atlas.web.filters.AtlasAuthenticationKerberosFilterIT
Running org.apache.atlas.web.filters.AtlasAuthenticationSimpleFilterIT
Tests run: 0, Failures: 0, Errors: 0, Skipped: 0, Time elapsed: 0.322 sec - in org.apache.atlas.web.filters.AtlasAuthenticationSimpleFilterIT
Running org.apache.atlas.CredentialProviderUtilityIT
Tests run: 4, Failures: 0, Errors: 0, Skipped: 0, Time elapsed: 1.607 sec - in org.apache.atlas.CredentialProviderUtilityIT
Running org.apache.atlas.notification.EntityNotificationIT
127.0.0.1 - - [05/May/2016:13:00:51 +0000] "OPTIONS /api/atlas/types/hive_db?user.name=jenkins
HTTP/1.1" 200 - "-" "Java/1.7.0_80"
127.0.0.1 - - [05/May/2016:13:00:51 +0000] "GET /api/atlas/types/hive_db HTTP/1.1" 200 - "-"
"Java/1.7.0_80"
127.0.0.1 - - [05/May/2016:13:00:52 +0000] "OPTIONS /api/atlas/entities?user.name=jenkins
HTTP/1.1" 200 - "-" "Java/1.7.0_80"
127.0.0.1 - - [05/May/2016:13:00:52 +0000] "POST /api/atlas/entities HTTP/1.1" 201 - "-" "Java/1.7.0_80"
127.0.0.1 - - [05/May/2016:13:00:54 +0000] "OPTIONS /api/atlas/entities?user.name=jenkins
HTTP/1.1" 200 - "-" "Java/1.7.0_80"
127.0.0.1 - - [05/May/2016:13:00:54 +0000] "POST /api/atlas/entities HTTP/1.1" 201 - "-" "Java/1.7.0_80"
127.0.0.1 - - [05/May/2016:13:00:54 +0000] "OPTIONS /api/atlas/entities?type=hive_table&property=name&value=table-updjo7ruYa&user.name=jenkins
HTTP/1.1" 200 - "-" "Java/1.7.0_80"
127.0.0.1 - - [05/May/2016:13:00:54 +0000] "DELETE /api/atlas/entities?type=hive_table&property=name&value=table-updjo7ruYa
HTTP/1.1" 200 - "-" "Java/1.7.0_80"
Tests run: 5, Failures: 1, Errors: 0, Skipped: 3, Time elapsed: 6.801 sec <<< FAILURE!
- in org.apache.atlas.notification.EntityNotificationIT
testCreateEntity(org.apache.atlas.notification.EntityNotificationIT)  Time elapsed: 2.042
sec  <<< FAILURE!
java.lang.Exception: Waiting timed out after 1000 msec
	at org.apache.atlas.notification.EntityNotificationIT.testCreateEntity(EntityNotificationIT.java:90)

Running org.apache.atlas.notification.NotificationHookConsumerIT
127.0.0.1 - - [05/May/2016:13:00:58 +0000] "OPTIONS /api/atlas/types/hive_db?user.name=jenkins
HTTP/1.1" 200 - "-" "Java/1.7.0_80"
127.0.0.1 - - [05/May/2016:13:00:58 +0000] "GET /api/atlas/types/hive_db HTTP/1.1" 200 - "-"
"Java/1.7.0_80"
127.0.0.1 - - [05/May/2016:13:01:00 +0000] "OPTIONS /api/atlas/discovery/search/dsl?query=hive_db+where+name%3D'dbgr8ZljD1k7'&user.name=jenkins
HTTP/1.1" 200 - "-" "Java/1.7.0_80"
127.0.0.1 - - [05/May/2016:13:01:00 +0000] "OPTIONS /api/atlas/entities?doAs=testuser&user.name=testuser
HTTP/1.1" 200 - "-" "Java/1.7.0_80"
127.0.0.1 - - [05/May/2016:13:01:00 +0000] "POST /api/atlas/entities?doAs=testuser HTTP/1.1"
201 - "-" "Java/1.7.0_80"
127.0.0.1 - - [05/May/2016:13:01:00 +0000] "GET /api/atlas/discovery/search/dsl?query=hive_db+where+name%3D'dbgr8ZljD1k7'
HTTP/1.1" 200 - "-" "Java/1.7.0_80"
127.0.0.1 - - [05/May/2016:13:01:00 +0000] "OPTIONS /api/atlas/entities?user.name=jenkins
HTTP/1.1" 200 - "-" "Java/1.7.0_80"
127.0.0.1 - - [05/May/2016:13:01:00 +0000] "POST /api/atlas/entities HTTP/1.1" 201 - "-" "Java/1.7.0_80"
127.0.0.1 - - [05/May/2016:13:01:00 +0000] "OPTIONS /api/atlas/entities/0b0bae95-07ee-4e1a-886a-8849675de64c?user.name=jenkins
HTTP/1.1" 200 - "-" "Java/1.7.0_80"
127.0.0.1 - - [05/May/2016:13:01:00 +0000] "GET /api/atlas/entities/0b0bae95-07ee-4e1a-886a-8849675de64c
HTTP/1.1" 200 - "-" "Java/1.7.0_80"
127.0.0.1 - - [05/May/2016:13:01:01 +0000] "OPTIONS /api/atlas/entities?type=hive_db&property=name&value=db9kUvQMwy8t&doAs=testuser&user.name=testuser
HTTP/1.1" 200 - "-" "Java/1.7.0_80"
127.0.0.1 - - [05/May/2016:13:01:01 +0000] "OPTIONS /api/atlas/entities/0b0bae95-07ee-4e1a-886a-8849675de64c?user.name=jenkins
HTTP/1.1" 200 - "-" "Java/1.7.0_80"
127.0.0.1 - - [05/May/2016:13:01:01 +0000] "GET /api/atlas/entities/0b0bae95-07ee-4e1a-886a-8849675de64c
HTTP/1.1" 200 - "-" "Java/1.7.0_80"
127.0.0.1 - - [05/May/2016:13:01:01 +0000] "DELETE /api/atlas/entities?type=hive_db&property=name&value=db9kUvQMwy8t&doAs=testuser
HTTP/1.1" 200 - "-" "Java/1.7.0_80"
127.0.0.1 - - [05/May/2016:13:01:01 +0000] "OPTIONS /api/atlas/entities/0b0bae95-07ee-4e1a-886a-8849675de64c?user.name=jenkins
HTTP/1.1" 200 - "-" "Java/1.7.0_80"
127.0.0.1 - - [05/May/2016:13:01:01 +0000] "GET /api/atlas/entities/0b0bae95-07ee-4e1a-886a-8849675de64c
HTTP/1.1" 200 - "-" "Java/1.7.0_80"
127.0.0.1 - - [05/May/2016:13:01:01 +0000] "OPTIONS /api/atlas/entities?user.name=jenkins
HTTP/1.1" 200 - "-" "Java/1.7.0_80"
127.0.0.1 - - [05/May/2016:13:01:01 +0000] "POST /api/atlas/entities HTTP/1.1" 201 - "-" "Java/1.7.0_80"
127.0.0.1 - - [05/May/2016:13:01:01 +0000] "OPTIONS /api/atlas/discovery/search/dsl?query=hive_db+where+name%3D'dbbxeGMvY0ml'&user.name=jenkins
HTTP/1.1" 200 - "-" "Java/1.7.0_80"
127.0.0.1 - - [05/May/2016:13:01:01 +0000] "OPTIONS /api/atlas/entities?doAs=testuser&user.name=testuser
HTTP/1.1" 200 - "-" "Java/1.7.0_80"
127.0.0.1 - - [05/May/2016:13:01:01 +0000] "PUT /api/atlas/entities?doAs=testuser HTTP/1.1"
200 - "-" "Java/1.7.0_80"
127.0.0.1 - - [05/May/2016:13:01:01 +0000] "GET /api/atlas/discovery/search/dsl?query=hive_db+where+name%3D'dbbxeGMvY0ml'
HTTP/1.1" 200 - "-" "Java/1.7.0_80"
127.0.0.1 - - [05/May/2016:13:01:02 +0000] "OPTIONS /api/atlas/entities?type=hive_db&property=name&value=dbbxeGMvY0ml&user.name=jenkins
HTTP/1.1" 200 - "-" "Java/1.7.0_80"
127.0.0.1 - - [05/May/2016:13:01:02 +0000] "GET /api/atlas/entities?type=hive_db&property=name&value=dbbxeGMvY0ml
HTTP/1.1" 200 - "-" "Java/1.7.0_80"
127.0.0.1 - - [05/May/2016:13:01:02 +0000] "OPTIONS /api/atlas/entities?user.name=jenkins
HTTP/1.1" 200 - "-" "Java/1.7.0_80"
127.0.0.1 - - [05/May/2016:13:01:02 +0000] "POST /api/atlas/entities HTTP/1.1" 201 - "-" "Java/1.7.0_80"
127.0.0.1 - - [05/May/2016:13:01:02 +0000] "OPTIONS /api/atlas/entities?type=hive_db&property=name&value=dbQr4m3yiDOO&user.name=jenkins
HTTP/1.1" 200 - "-" "Java/1.7.0_80"
127.0.0.1 - - [05/May/2016:13:01:02 +0000] "GET /api/atlas/entities?type=hive_db&property=name&value=dbQr4m3yiDOO
HTTP/1.1" 200 - "-" "Java/1.7.0_80"
127.0.0.1 - - [05/May/2016:13:01:02 +0000] "OPTIONS /api/atlas/entities?type=hive_db&property=name&value=dbQr4m3yiDOO&user.name=jenkins
HTTP/1.1" 200 - "-" "Java/1.7.0_80"
127.0.0.1 - - [05/May/2016:13:01:02 +0000] "GET /api/atlas/entities?type=hive_db&property=name&value=dbQr4m3yiDOO
HTTP/1.1" 200 - "-" "Java/1.7.0_80"
127.0.0.1 - - [05/May/2016:13:01:02 +0000] "OPTIONS /api/atlas/entities/qualifiedName?type=hive_db&property=name&value=dbQr4m3yiDOO&doAs=testuser&user.name=testuser
HTTP/1.1" 200 - "-" "Java/1.7.0_80"
127.0.0.1 - - [05/May/2016:13:01:02 +0000] "POST /api/atlas/entities/qualifiedName?type=hive_db&property=name&value=dbQr4m3yiDOO&doAs=testuser
HTTP/1.1" 200 - "-" "Java/1.7.0_80"
127.0.0.1 - - [05/May/2016:13:01:02 +0000] "OPTIONS /api/atlas/entities?type=hive_db&property=name&value=dbQr4m3yiDOO&user.name=jenkins
HTTP/1.1" 200 - "-" "Java/1.7.0_80"
127.0.0.1 - - [05/May/2016:13:01:02 +0000] "GET /api/atlas/entities?type=hive_db&property=name&value=dbQr4m3yiDOO
HTTP/1.1" 200 - "-" "Java/1.7.0_80"
127.0.0.1 - - [05/May/2016:13:01:02 +0000] "OPTIONS /api/atlas/entities?type=hive_db&property=name&value=dbQr4m3yiDOO&user.name=jenkins
HTTP/1.1" 200 - "-" "Java/1.7.0_80"
127.0.0.1 - - [05/May/2016:13:01:02 +0000] "GET /api/atlas/entities?type=hive_db&property=name&value=dbQr4m3yiDOO
HTTP/1.1" 200 - "-" "Java/1.7.0_80"
127.0.0.1 - - [05/May/2016:13:01:02 +0000] "OPTIONS /api/atlas/entities?user.name=jenkins
HTTP/1.1" 200 - "-" "Java/1.7.0_80"
127.0.0.1 - - [05/May/2016:13:01:02 +0000] "POST /api/atlas/entities HTTP/1.1" 201 - "-" "Java/1.7.0_80"
127.0.0.1 - - [05/May/2016:13:01:02 +0000] "OPTIONS /api/atlas/discovery/search/dsl?query=hive_db+where+name%3D'db9lXzhIWYyk'&user.name=jenkins
HTTP/1.1" 200 - "-" "Java/1.7.0_80"
127.0.0.1 - - [05/May/2016:13:01:02 +0000] "OPTIONS /api/atlas/entities/qualifiedName?type=hive_db&property=name&value=db38skF3rdw2&doAs=testuser&user.name=testuser
HTTP/1.1" 200 - "-" "Java/1.7.0_80"
127.0.0.1 - - [05/May/2016:13:01:02 +0000] "POST /api/atlas/entities/qualifiedName?type=hive_db&property=name&value=db38skF3rdw2&doAs=testuser
HTTP/1.1" 200 - "-" "Java/1.7.0_80"
127.0.0.1 - - [05/May/2016:13:01:02 +0000] "GET /api/atlas/discovery/search/dsl?query=hive_db+where+name%3D'db9lXzhIWYyk'
HTTP/1.1" 200 - "-" "Java/1.7.0_80"
127.0.0.1 - - [05/May/2016:13:01:03 +0000] "OPTIONS /api/atlas/discovery/search/dsl?query=hive_db+where+name%3D'db38skF3rdw2'&user.name=jenkins
HTTP/1.1" 200 - "-" "Java/1.7.0_80"
127.0.0.1 - - [05/May/2016:13:01:03 +0000] "GET /api/atlas/discovery/search/dsl?query=hive_db+where+name%3D'db38skF3rdw2'
HTTP/1.1" 200 - "-" "Java/1.7.0_80"
Tests run: 5, Failures: 0, Errors: 0, Skipped: 0, Time elapsed: 7.907 sec - in org.apache.atlas.notification.NotificationHookConsumerIT

Results :

Failed tests: 
  EntityNotificationIT.testCreateEntity:90->BaseResourceIT.waitForNotification:309->BaseResourceIT.waitFor:301
» 
  EntityJerseyResourceIT.testEntityDeduping:155->BaseResourceIT.waitForNotification:309->BaseResourceIT.waitFor:301
» 

Tests run: 74, Failures: 2, Errors: 0, Skipped: 3

[INFO] 
[INFO] --- jetty-maven-plugin:9.2.12.v20150709:stop (stop-jetty) @ atlas-webapp ---
[INFO] Waiting 10 seconds for jetty to stop
2016-05-05 13:01:04.355:INFO:oejs.ServerConnector:ShutdownMonitor: Stopped ServerConnector@17383cc{HTTP/1.1}{0.0.0.0:31000}
2016-05-05 13:01:09.493:INFO:oejsh.ContextHandler:ShutdownMonitor: Stopped o.e.j.m.p.JettyWebAppContext@35fb4a60{/,<https://builds.apache.org/job/apache-atlas-nightly/ws/webapp/target/atlas-webapp-0.7-incubating-SNAPSHOT/,UNAVAILABLE}{/home/jenkins/jenkins-slave/workspace/apache-atlas-nightly/webapp/target/atlas-webapp-0.7-incubating-SNAPSHOT.war}>
[INFO] Server reports itself as stopped
[INFO] 
[INFO] --- maven-source-plugin:2.4:jar-no-fork (attach-sources) @ atlas-webapp ---
[INFO] Building jar: <https://builds.apache.org/job/apache-atlas-nightly/ws/webapp/target/atlas-webapp-0.7-incubating-SNAPSHOT-sources.jar>
[INFO] 
[INFO] --- maven-source-plugin:2.4:test-jar-no-fork (attach-sources) @ atlas-webapp ---
[INFO] Building jar: <https://builds.apache.org/job/apache-atlas-nightly/ws/webapp/target/atlas-webapp-0.7-incubating-SNAPSHOT-test-sources.jar>
[INFO] 
[INFO] --- maven-failsafe-plugin:2.19.1:verify (verify) @ atlas-webapp ---
[INFO] ------------------------------------------------------------------------
[INFO] Reactor Summary:
[INFO] 
[INFO] apache-atlas ...................................... SUCCESS [ 14.771 s]
[INFO] Apache Atlas Common ............................... SUCCESS [ 21.418 s]
[INFO] Apache Atlas Typesystem ........................... SUCCESS [01:26 min]
[INFO] Apache Atlas Client ............................... SUCCESS [ 23.869 s]
[INFO] Apache Atlas Server API ........................... SUCCESS [ 15.126 s]
[INFO] Apache Atlas Notification ......................... SUCCESS [ 40.907 s]
[INFO] Apache Atlas Titan ................................ SUCCESS [ 26.832 s]
[INFO] Apache Atlas Repository ........................... SUCCESS [16:52 min]
[INFO] Apache Atlas UI ................................... SUCCESS [ 16.142 s]
[INFO] Apache Atlas Web Application ...................... FAILURE [05:45 min]
[INFO] Apache Atlas Documentation ........................ SKIPPED
[INFO] Apache Atlas FileSystem Model ..................... SKIPPED
[INFO] Apache Atlas Hive Bridge .......................... SKIPPED
[INFO] Apache Atlas Falcon Bridge ........................ SKIPPED
[INFO] Apache Atlas Sqoop Bridge ......................... SKIPPED
[INFO] Apache Atlas Storm Bridge ......................... SKIPPED
[INFO] Apache Atlas Distribution ......................... SKIPPED
[INFO] ------------------------------------------------------------------------
[INFO] BUILD FAILURE
[INFO] ------------------------------------------------------------------------
[INFO] Total time: 26:44 min
[INFO] Finished at: 2016-05-05T13:01:10+00:00
[INFO] Final Memory: 144M/1130M
[INFO] ------------------------------------------------------------------------
[ERROR] Failed to execute goal org.apache.maven.plugins:maven-failsafe-plugin:2.19.1:verify
(verify) on project atlas-webapp: There are test failures.
[ERROR] 
[ERROR] Please refer to <https://builds.apache.org/job/apache-atlas-nightly/ws/webapp/target/failsafe-reports>
for the individual test results.
[ERROR] -> [Help 1]
[ERROR] 
[ERROR] To see the full stack trace of the errors, re-run Maven with the -e switch.
[ERROR] Re-run Maven using the -X switch to enable full debug logging.
[ERROR] 
[ERROR] For more information about the errors and possible solutions, please read the following
articles:
[ERROR] [Help 1] http://cwiki.apache.org/confluence/display/MAVEN/MojoFailureException
[ERROR] 
[ERROR] After correcting the problems, you can resume the build with the command
[ERROR]   mvn <goals> -rf :atlas-webapp
Build step 'Execute shell' marked build as failure
[CHECKSTYLE] Collecting checkstyle analysis files...
[CHECKSTYLE] Finding all files that match the pattern **/target/checkstyle-result.xml
[CHECKSTYLE] Parsing 18 files in <https://builds.apache.org/job/apache-atlas-nightly/ws/>
[CHECKSTYLE] Successfully parsed file <https://builds.apache.org/job/apache-atlas-nightly/ws/addons/falcon-bridge/target/checkstyle-result.xml>
with 52 unique warnings and 0 duplicates.
[CHECKSTYLE] Successfully parsed file <https://builds.apache.org/job/apache-atlas-nightly/ws/addons/hdfs-model/target/checkstyle-result.xml>
with 72 unique warnings and 0 duplicates.
[CHECKSTYLE] Successfully parsed file <https://builds.apache.org/job/apache-atlas-nightly/ws/addons/hive-bridge/target/checkstyle-result.xml>
with 268 unique warnings and 0 duplicates.
[CHECKSTYLE] Successfully parsed file <https://builds.apache.org/job/apache-atlas-nightly/ws/addons/sqoop-bridge/target/checkstyle-result.xml>
with 284 unique warnings and 0 duplicates.
[CHECKSTYLE] Successfully parsed file <https://builds.apache.org/job/apache-atlas-nightly/ws/addons/storm-bridge/target/checkstyle-result.xml>
with 360 unique warnings and 0 duplicates.
[CHECKSTYLE] Successfully parsed file <https://builds.apache.org/job/apache-atlas-nightly/ws/client/target/checkstyle-result.xml>
with 442 unique warnings and 0 duplicates.
[CHECKSTYLE] Successfully parsed file <https://builds.apache.org/job/apache-atlas-nightly/ws/common/target/checkstyle-result.xml>
with 442 unique warnings and 0 duplicates.
[CHECKSTYLE] Successfully parsed file <https://builds.apache.org/job/apache-atlas-nightly/ws/dashboard/target/checkstyle-result.xml>
with 442 unique warnings and 0 duplicates.
[CHECKSTYLE] Successfully parsed file <https://builds.apache.org/job/apache-atlas-nightly/ws/dashboardv2/target/checkstyle-result.xml>
with 442 unique warnings and 0 duplicates.
[CHECKSTYLE] Successfully parsed file <https://builds.apache.org/job/apache-atlas-nightly/ws/distro/target/checkstyle-result.xml>
with 442 unique warnings and 0 duplicates.
[CHECKSTYLE] Successfully parsed file <https://builds.apache.org/job/apache-atlas-nightly/ws/docs/target/checkstyle-result.xml>
with 442 unique warnings and 0 duplicates.
[CHECKSTYLE] Successfully parsed file <https://builds.apache.org/job/apache-atlas-nightly/ws/notification/target/checkstyle-result.xml>
with 442 unique warnings and 0 duplicates.
[CHECKSTYLE] Successfully parsed file <https://builds.apache.org/job/apache-atlas-nightly/ws/repository/target/checkstyle-result.xml>
with 1295 unique warnings and 0 duplicates.
[CHECKSTYLE] Successfully parsed file <https://builds.apache.org/job/apache-atlas-nightly/ws/server-api/target/checkstyle-result.xml>
with 1323 unique warnings and 0 duplicates.
[CHECKSTYLE] Successfully parsed file <https://builds.apache.org/job/apache-atlas-nightly/ws/target/checkstyle-result.xml>
with 1323 unique warnings and 0 duplicates.
[CHECKSTYLE] Successfully parsed file <https://builds.apache.org/job/apache-atlas-nightly/ws/titan/target/checkstyle-result.xml>
with 1683 unique warnings and 0 duplicates.
[CHECKSTYLE] Successfully parsed file <https://builds.apache.org/job/apache-atlas-nightly/ws/typesystem/target/checkstyle-result.xml>
with 2352 unique warnings and 0 duplicates.
[CHECKSTYLE] Successfully parsed file <https://builds.apache.org/job/apache-atlas-nightly/ws/webapp/target/checkstyle-result.xml>
with 2698 unique warnings and 0 duplicates.
[CHECKSTYLE] Computing warning deltas based on reference build #256
[FINDBUGS] Collecting findbugs analysis files...
[FINDBUGS] Finding all files that match the pattern **/target/findbugs.xml
[FINDBUGS] Parsing 13 files in <https://builds.apache.org/job/apache-atlas-nightly/ws/>
[FINDBUGS] Successfully parsed file <https://builds.apache.org/job/apache-atlas-nightly/ws/addons/falcon-bridge/target/findbugs.xml>
with 0 unique warnings and 0 duplicates.
[FINDBUGS] Successfully parsed file <https://builds.apache.org/job/apache-atlas-nightly/ws/addons/hdfs-model/target/findbugs.xml>
with 0 unique warnings and 0 duplicates.
[FINDBUGS] Successfully parsed file <https://builds.apache.org/job/apache-atlas-nightly/ws/addons/hive-bridge/target/findbugs.xml>
with 0 unique warnings and 0 duplicates.
[FINDBUGS] Successfully parsed file <https://builds.apache.org/job/apache-atlas-nightly/ws/addons/sqoop-bridge/target/findbugs.xml>
with 0 unique warnings and 0 duplicates.
[FINDBUGS] Successfully parsed file <https://builds.apache.org/job/apache-atlas-nightly/ws/addons/storm-bridge/target/findbugs.xml>
with 0 unique warnings and 0 duplicates.
[FINDBUGS] Successfully parsed file <https://builds.apache.org/job/apache-atlas-nightly/ws/client/target/findbugs.xml>
with 0 unique warnings and 0 duplicates.
[FINDBUGS] Successfully parsed file <https://builds.apache.org/job/apache-atlas-nightly/ws/common/target/findbugs.xml>
with 0 unique warnings and 0 duplicates.
[FINDBUGS] Successfully parsed file <https://builds.apache.org/job/apache-atlas-nightly/ws/notification/target/findbugs.xml>
with 0 unique warnings and 0 duplicates.
[FINDBUGS] Successfully parsed file <https://builds.apache.org/job/apache-atlas-nightly/ws/repository/target/findbugs.xml>
with 0 unique warnings and 0 duplicates.
[FINDBUGS] Successfully parsed file <https://builds.apache.org/job/apache-atlas-nightly/ws/server-api/target/findbugs.xml>
with 0 unique warnings and 0 duplicates.
[FINDBUGS] Successfully parsed file <https://builds.apache.org/job/apache-atlas-nightly/ws/titan/target/findbugs.xml>
with 0 unique warnings and 0 duplicates.
[FINDBUGS] Successfully parsed file <https://builds.apache.org/job/apache-atlas-nightly/ws/typesystem/target/findbugs.xml>
with 0 unique warnings and 0 duplicates.
[FINDBUGS] Successfully parsed file <https://builds.apache.org/job/apache-atlas-nightly/ws/webapp/target/findbugs.xml>
with 0 unique warnings and 0 duplicates.
[FINDBUGS] Computing warning deltas based on reference build #256
Archiving artifacts
Compressed 810.35 MB of artifacts by 13.3% relative to #256
TestNG Reports Processing: START
Looking for TestNG results report in workspace using pattern: **/target/surefire-reports/testng-results.xml,**/target/failsafe-reports/testng-results.xml
Saving reports...
Processing '/x1/jenkins/jenkins-home/jobs/apache-atlas-nightly/builds/258/testng/testng-results-1.xml'
Processing '/x1/jenkins/jenkins-home/jobs/apache-atlas-nightly/builds/258/testng/testng-results-10.xml'
Processing '/x1/jenkins/jenkins-home/jobs/apache-atlas-nightly/builds/258/testng/testng-results-11.xml'
Processing '/x1/jenkins/jenkins-home/jobs/apache-atlas-nightly/builds/258/testng/testng-results-12.xml'
Processing '/x1/jenkins/jenkins-home/jobs/apache-atlas-nightly/builds/258/testng/testng-results-13.xml'
Processing '/x1/jenkins/jenkins-home/jobs/apache-atlas-nightly/builds/258/testng/testng-results-2.xml'
Processing '/x1/jenkins/jenkins-home/jobs/apache-atlas-nightly/builds/258/testng/testng-results-3.xml'
Processing '/x1/jenkins/jenkins-home/jobs/apache-atlas-nightly/builds/258/testng/testng-results-4.xml'
Processing '/x1/jenkins/jenkins-home/jobs/apache-atlas-nightly/builds/258/testng/testng-results-5.xml'
Processing '/x1/jenkins/jenkins-home/jobs/apache-atlas-nightly/builds/258/testng/testng-results-6.xml'
Processing '/x1/jenkins/jenkins-home/jobs/apache-atlas-nightly/builds/258/testng/testng-results-7.xml'
Processing '/x1/jenkins/jenkins-home/jobs/apache-atlas-nightly/builds/258/testng/testng-results-8.xml'
Processing '/x1/jenkins/jenkins-home/jobs/apache-atlas-nightly/builds/258/testng/testng-results-9.xml'
Processing '/x1/jenkins/jenkins-home/jobs/apache-atlas-nightly/builds/258/testng/testng-results.xml'
TestNG Reports Processing: FINISH

Mime
View raw message