atlas-dev mailing list archives

Site index · List index
Message view « Date » · « Thread »
Top « Date » · « Thread »
From Apache Jenkins Server <jenk...@builds.apache.org>
Subject Build failed in Jenkins: apache-atlas-nightly #238
Date Fri, 08 Apr 2016 18:14:39 GMT
See <https://builds.apache.org/job/apache-atlas-nightly/238/changes>

Changes:

[sumasai.shivaprasad] ATLAS-603 Document High Availability of Atlas (yhemanth via sumasai)

------------------------------------------
[...truncated 1741 lines...]
[INFO] --- maven-source-plugin:2.4:test-jar-no-fork (attach-sources) @ atlas-notification
---
[INFO] Building jar: <https://builds.apache.org/job/apache-atlas-nightly/ws/notification/target/atlas-notification-0.7-incubating-SNAPSHOT-test-sources.jar>
[INFO] 
[INFO] --- maven-failsafe-plugin:2.19.1:verify (verify) @ atlas-notification ---
[INFO] 
[INFO] --- apache-rat-plugin:0.7:check (rat-check) @ atlas-notification ---
[INFO] Exclude: *.txt
[INFO] Exclude: **/*.json
[INFO] Exclude: .pc/**
[INFO] Exclude: debian/**
[INFO] Exclude: .svn/**
[INFO] Exclude: .git/**
[INFO] Exclude: .gitignore
[INFO] Exclude: **/.idea/**
[INFO] Exclude: **/*.twiki
[INFO] Exclude: **/*.iml
[INFO] Exclude: **/*.json
[INFO] Exclude: **/target/**
[INFO] Exclude: **/target*/**
[INFO] Exclude: **/build/**
[INFO] Exclude: **/*.patch
[INFO] Exclude: derby.log
[INFO] Exclude: **/logs/**
[INFO] Exclude: **/.classpath
[INFO] Exclude: **/.project
[INFO] Exclude: **/.settings/**
[INFO] Exclude: **/test-output/**
[INFO] Exclude: **/mock/**
[INFO] Exclude: **/data/**
[INFO] Exclude: **/maven-eclipse.xml
[INFO] Exclude: **/.externalToolBuilders/**
[INFO] Exclude: **/build.log
[INFO] Exclude: .bowerrc
[INFO] Exclude: *.json
[INFO] Exclude: **/overlays/**
[INFO] Exclude: dev-support/**
[INFO] 
[INFO] --- maven-checkstyle-plugin:2.9.1:check (checkstyle-check) @ atlas-notification ---
[INFO] Starting audit...
Audit done.

[INFO] 
[INFO] >>> findbugs-maven-plugin:3.0.1:check (findbugs-check) @ atlas-notification
>>>
[INFO] 
[INFO] --- findbugs-maven-plugin:3.0.1:findbugs (findbugs) @ atlas-notification ---
[INFO] Fork Value is true
     [java] Warnings generated: 3
[INFO] Done FindBugs Analysis....
[INFO] 
[INFO] <<< findbugs-maven-plugin:3.0.1:check (findbugs-check) @ atlas-notification
<<<
[INFO] 
[INFO] --- findbugs-maven-plugin:3.0.1:check (findbugs-check) @ atlas-notification ---
[INFO] BugInstance size is 3
[INFO] Error size is 0
[INFO] Total bugs: 3
[INFO] org.apache.atlas.hook.AtlasHook.atlasProperties isn't final but should be [org.apache.atlas.hook.AtlasHook]
At AtlasHook.java:[line 58]
[INFO] org.apache.atlas.hook.AtlasHook.notifInterface isn't final but should be [org.apache.atlas.hook.AtlasHook]
At AtlasHook.java:[line 64]
[INFO] Inconsistent synchronization of org.apache.atlas.kafka.KafkaNotification.producer;
locked 40% of time [org.apache.atlas.kafka.KafkaNotification, org.apache.atlas.kafka.KafkaNotification,
org.apache.atlas.kafka.KafkaNotification, org.apache.atlas.kafka.KafkaNotification] Unsynchronized
access at KafkaNotification.java:[line 184]Unsynchronized access at KafkaNotification.java:[line
193]Synchronized access at KafkaNotification.java:[line 272]Synchronized access at KafkaNotification.java:[line
273]
[INFO] 


To see bug detail using the Findbugs GUI, use the following command "mvn findbugs:gui"



[INFO]                                                                         
[INFO] ------------------------------------------------------------------------
[INFO] Building Apache Atlas Titan 0.7-incubating-SNAPSHOT
[INFO] ------------------------------------------------------------------------
[INFO] 
[INFO] --- maven-clean-plugin:2.5:clean (default-clean) @ atlas-titan ---
[INFO] Deleting <https://builds.apache.org/job/apache-atlas-nightly/ws/titan/target>
[INFO] Deleting <https://builds.apache.org/job/apache-atlas-nightly/ws/titan> (includes
= [**/*.pyc], excludes = [])
[INFO] 
[INFO] --- buildnumber-maven-plugin:1.4:create (default) @ atlas-titan ---
[INFO] Executing: /bin/sh -c cd '<https://builds.apache.org/job/apache-atlas-nightly/ws/titan'>
&& 'git' 'rev-parse' '--verify' 'HEAD'
[INFO] Working directory: <https://builds.apache.org/job/apache-atlas-nightly/ws/titan>
[INFO] Storing buildNumber: b8f4ffb68cf6adab4015d545715d1370a1ee57b9 at timestamp: 1460139182444
[WARNING] Cannot get the branch information from the git repository: 
Detecting the current branch failed: fatal: ref HEAD is not a symbolic ref

[INFO] Executing: /bin/sh -c cd '<https://builds.apache.org/job/apache-atlas-nightly/ws/titan'>
&& 'git' 'rev-parse' '--verify' 'HEAD'
[INFO] Working directory: <https://builds.apache.org/job/apache-atlas-nightly/ws/titan>
[INFO] Storing buildScmBranch: UNKNOWN
[INFO] 
[INFO] --- maven-remote-resources-plugin:1.5:process (default) @ atlas-titan ---
[INFO] 
[INFO] --- maven-resources-plugin:2.7:resources (default-resources) @ atlas-titan ---
[INFO] Using 'UTF-8' encoding to copy filtered resources.
[INFO] skip non existing resourceDirectory <https://builds.apache.org/job/apache-atlas-nightly/ws/titan/src/main/resources>
[INFO] Copying 2 resources to META-INF
[INFO] Copying 3 resources
[INFO] 
[INFO] --- scala-maven-plugin:3.2.0:compile (scala-compile-first) @ atlas-titan ---
[WARNING] Zinc server is not available at port 3030 - reverting to normal incremental compile
[INFO] Using incremental compilation
[INFO] Compiling 19 Java sources to <https://builds.apache.org/job/apache-atlas-nightly/ws/titan/target/classes...>
[WARNING] Note: Some input files use or override a deprecated API.
[WARNING] Note: Recompile with -Xlint:deprecation for details.
[WARNING] Note: <https://builds.apache.org/job/apache-atlas-nightly/ws/titan/src/main/java/com/thinkaurelius/titan/diskstorage/solr/Solr5Index.java>
uses unchecked or unsafe operations.
[WARNING] Note: Recompile with -Xlint:unchecked for details.
[INFO] 
[INFO] --- maven-compiler-plugin:3.1:compile (default-compile) @ atlas-titan ---
[INFO] Changes detected - recompiling the module!
[INFO] Compiling 19 source files to <https://builds.apache.org/job/apache-atlas-nightly/ws/titan/target/classes>
[WARNING] <https://builds.apache.org/job/apache-atlas-nightly/ws/titan/src/main/java/com/thinkaurelius/titan/diskstorage/hbase/HBaseCompat0_98.java>:
Some input files use or override a deprecated API.
[WARNING] <https://builds.apache.org/job/apache-atlas-nightly/ws/titan/src/main/java/com/thinkaurelius/titan/diskstorage/hbase/HBaseCompat0_98.java>:
Recompile with -Xlint:deprecation for details.
[WARNING] <https://builds.apache.org/job/apache-atlas-nightly/ws/titan/src/main/java/com/thinkaurelius/titan/diskstorage/solr/Solr5Index.java>:
<https://builds.apache.org/job/apache-atlas-nightly/ws/titan/src/main/java/com/thinkaurelius/titan/diskstorage/solr/Solr5Index.java>
uses unchecked or unsafe operations.
[WARNING] <https://builds.apache.org/job/apache-atlas-nightly/ws/titan/src/main/java/com/thinkaurelius/titan/diskstorage/solr/Solr5Index.java>:
Recompile with -Xlint:unchecked for details.
[INFO] 
[INFO] --- maven-resources-plugin:2.7:testResources (default-testResources) @ atlas-titan
---
[INFO] Using 'UTF-8' encoding to copy filtered resources.
[INFO] skip non existing resourceDirectory <https://builds.apache.org/job/apache-atlas-nightly/ws/titan/src/test/resources>
[INFO] Copying 3 resources
[INFO] 
[INFO] --- scala-maven-plugin:3.2.0:testCompile (scala-test-compile-first) @ atlas-titan ---
[WARNING] Zinc server is not available at port 3030 - reverting to normal incremental compile
[INFO] Using incremental compilation
[INFO] Compiling 1 Java source to <https://builds.apache.org/job/apache-atlas-nightly/ws/titan/target/test-classes...>
[INFO] 
[INFO] --- maven-compiler-plugin:3.1:testCompile (default-testCompile) @ atlas-titan ---
[INFO] Changes detected - recompiling the module!
[INFO] Compiling 1 source file to <https://builds.apache.org/job/apache-atlas-nightly/ws/titan/target/test-classes>
[INFO] 
[INFO] --- maven-surefire-plugin:2.18.1:test (default-test) @ atlas-titan ---
[WARNING] The parameter forkMode is deprecated since version 2.14. Use forkCount and reuseForks
instead.
[INFO] Surefire report directory: <https://builds.apache.org/job/apache-atlas-nightly/ws/titan/target/surefire-reports>
[INFO] Using configured provider org.apache.maven.surefire.testng.TestNGProvider
[WARNING] file.encoding cannot be set as system property, use <argLine>-Dfile.encoding=...<argLine>
instead

-------------------------------------------------------
 T E S T S
-------------------------------------------------------
Running com.thinkaurelius.titan.diskstorage.locking.LocalLockMediatorTest
Tests run: 1, Failures: 1, Errors: 0, Skipped: 0, Time elapsed: 0.828 sec <<< FAILURE!
- in com.thinkaurelius.titan.diskstorage.locking.LocalLockMediatorTest
testLock(com.thinkaurelius.titan.diskstorage.locking.LocalLockMediatorTest)  Time elapsed:
0.037 sec  <<< FAILURE!
java.lang.AssertionError: expected:<true> but was:<false>
	at org.testng.Assert.fail(Assert.java:89)
	at org.testng.Assert.failNotEquals(Assert.java:489)
	at org.testng.Assert.assertTrue(Assert.java:37)
	at org.testng.Assert.assertTrue(Assert.java:47)
	at com.thinkaurelius.titan.diskstorage.locking.LocalLockMediatorTest.testLock(LocalLockMediatorTest.java:46)


Results :

Failed tests: 
  LocalLockMediatorTest.testLock:46 expected:<true> but was:<false>

Tests run: 1, Failures: 1, Errors: 0, Skipped: 0

[INFO] ------------------------------------------------------------------------
[INFO] Reactor Summary:
[INFO] 
[INFO] apache-atlas ...................................... SUCCESS [ 20.178 s]
[INFO] Apache Atlas Common ............................... SUCCESS [ 30.770 s]
[INFO] Apache Atlas Typesystem ........................... SUCCESS [02:13 min]
[INFO] Apache Atlas Client ............................... SUCCESS [ 37.275 s]
[INFO] Apache Atlas Server API ........................... SUCCESS [ 19.767 s]
[INFO] Apache Atlas Notification ......................... SUCCESS [ 47.817 s]
[INFO] Apache Atlas Titan ................................ FAILURE [ 19.669 s]
[INFO] Apache Atlas Repository ........................... SKIPPED
[INFO] Apache Atlas UI ................................... SKIPPED
[INFO] Apache Atlas Web Application ...................... SKIPPED
[INFO] Apache Atlas Documentation ........................ SKIPPED
[INFO] Apache Atlas FileSystem Model ..................... SKIPPED
[INFO] Apache Atlas Hive Bridge .......................... SKIPPED
[INFO] Apache Atlas Falcon Bridge ........................ SKIPPED
[INFO] Apache Atlas Sqoop Bridge ......................... SKIPPED
[INFO] Apache Atlas Storm Bridge ......................... SKIPPED
[INFO] Apache Atlas Distribution ......................... SKIPPED
[INFO] ------------------------------------------------------------------------
[INFO] BUILD FAILURE
[INFO] ------------------------------------------------------------------------
[INFO] Total time: 05:11 min
[INFO] Finished at: 2016-04-08T18:13:21+00:00
[INFO] Final Memory: 110M/1606M
[INFO] ------------------------------------------------------------------------
[ERROR] Failed to execute goal org.apache.maven.plugins:maven-surefire-plugin:2.18.1:test
(default-test) on project atlas-titan: There are test failures.
[ERROR] 
[ERROR] Please refer to <https://builds.apache.org/job/apache-atlas-nightly/ws/titan/target/surefire-reports>
for the individual test results.
[ERROR] -> [Help 1]
[ERROR] 
[ERROR] To see the full stack trace of the errors, re-run Maven with the -e switch.
[ERROR] Re-run Maven using the -X switch to enable full debug logging.
[ERROR] 
[ERROR] For more information about the errors and possible solutions, please read the following
articles:
[ERROR] [Help 1] http://cwiki.apache.org/confluence/display/MAVEN/MojoFailureException
[ERROR] 
[ERROR] After correcting the problems, you can resume the build with the command
[ERROR]   mvn <goals> -rf :atlas-titan
Build step 'Execute shell' marked build as failure
[CHECKSTYLE] Collecting checkstyle analysis files...
[CHECKSTYLE] Finding all files that match the pattern **/target/checkstyle-result.xml
[CHECKSTYLE] Parsing 16 files in <https://builds.apache.org/job/apache-atlas-nightly/ws/>
[CHECKSTYLE] Successfully parsed file <https://builds.apache.org/job/apache-atlas-nightly/ws/addons/falcon-bridge/target/checkstyle-result.xml>
with 52 unique warnings and 0 duplicates.
[CHECKSTYLE] Successfully parsed file <https://builds.apache.org/job/apache-atlas-nightly/ws/addons/hdfs-model/target/checkstyle-result.xml>
with 72 unique warnings and 0 duplicates.
[CHECKSTYLE] Successfully parsed file <https://builds.apache.org/job/apache-atlas-nightly/ws/addons/hive-bridge/target/checkstyle-result.xml>
with 241 unique warnings and 0 duplicates.
[CHECKSTYLE] Successfully parsed file <https://builds.apache.org/job/apache-atlas-nightly/ws/addons/sqoop-bridge/target/checkstyle-result.xml>
with 257 unique warnings and 0 duplicates.
[CHECKSTYLE] Successfully parsed file <https://builds.apache.org/job/apache-atlas-nightly/ws/addons/storm-bridge/target/checkstyle-result.xml>
with 333 unique warnings and 0 duplicates.
[CHECKSTYLE] Successfully parsed file <https://builds.apache.org/job/apache-atlas-nightly/ws/client/target/checkstyle-result.xml>
with 397 unique warnings and 0 duplicates.
[CHECKSTYLE] Successfully parsed file <https://builds.apache.org/job/apache-atlas-nightly/ws/common/target/checkstyle-result.xml>
with 397 unique warnings and 0 duplicates.
[CHECKSTYLE] Successfully parsed file <https://builds.apache.org/job/apache-atlas-nightly/ws/dashboard/target/checkstyle-result.xml>
with 397 unique warnings and 0 duplicates.
[CHECKSTYLE] Successfully parsed file <https://builds.apache.org/job/apache-atlas-nightly/ws/distro/target/checkstyle-result.xml>
with 397 unique warnings and 0 duplicates.
[CHECKSTYLE] Successfully parsed file <https://builds.apache.org/job/apache-atlas-nightly/ws/docs/target/checkstyle-result.xml>
with 397 unique warnings and 0 duplicates.
[CHECKSTYLE] Successfully parsed file <https://builds.apache.org/job/apache-atlas-nightly/ws/notification/target/checkstyle-result.xml>
with 397 unique warnings and 0 duplicates.
[CHECKSTYLE] Successfully parsed file <https://builds.apache.org/job/apache-atlas-nightly/ws/repository/target/checkstyle-result.xml>
with 1105 unique warnings and 0 duplicates.
[CHECKSTYLE] Successfully parsed file <https://builds.apache.org/job/apache-atlas-nightly/ws/server-api/target/checkstyle-result.xml>
with 1128 unique warnings and 0 duplicates.
[CHECKSTYLE] Successfully parsed file <https://builds.apache.org/job/apache-atlas-nightly/ws/target/checkstyle-result.xml>
with 1128 unique warnings and 0 duplicates.
[CHECKSTYLE] Successfully parsed file <https://builds.apache.org/job/apache-atlas-nightly/ws/typesystem/target/checkstyle-result.xml>
with 1791 unique warnings and 0 duplicates.
[CHECKSTYLE] Successfully parsed file <https://builds.apache.org/job/apache-atlas-nightly/ws/webapp/target/checkstyle-result.xml>
with 2064 unique warnings and 0 duplicates.
[CHECKSTYLE] Computing warning deltas based on reference build #237
[FINDBUGS] Collecting findbugs analysis files...
[FINDBUGS] Finding all files that match the pattern **/target/findbugs.xml
[FINDBUGS] Parsing 12 files in <https://builds.apache.org/job/apache-atlas-nightly/ws/>
[FINDBUGS] Successfully parsed file <https://builds.apache.org/job/apache-atlas-nightly/ws/addons/falcon-bridge/target/findbugs.xml>
with 0 unique warnings and 0 duplicates.
[FINDBUGS] Successfully parsed file <https://builds.apache.org/job/apache-atlas-nightly/ws/addons/hdfs-model/target/findbugs.xml>
with 0 unique warnings and 0 duplicates.
[FINDBUGS] Successfully parsed file <https://builds.apache.org/job/apache-atlas-nightly/ws/addons/hive-bridge/target/findbugs.xml>
with 0 unique warnings and 0 duplicates.
[FINDBUGS] Successfully parsed file <https://builds.apache.org/job/apache-atlas-nightly/ws/addons/sqoop-bridge/target/findbugs.xml>
with 0 unique warnings and 0 duplicates.
[FINDBUGS] Successfully parsed file <https://builds.apache.org/job/apache-atlas-nightly/ws/addons/storm-bridge/target/findbugs.xml>
with 0 unique warnings and 0 duplicates.
[FINDBUGS] Successfully parsed file <https://builds.apache.org/job/apache-atlas-nightly/ws/client/target/findbugs.xml>
with 0 unique warnings and 0 duplicates.
[FINDBUGS] Successfully parsed file <https://builds.apache.org/job/apache-atlas-nightly/ws/common/target/findbugs.xml>
with 0 unique warnings and 0 duplicates.
[FINDBUGS] Successfully parsed file <https://builds.apache.org/job/apache-atlas-nightly/ws/notification/target/findbugs.xml>
with 0 unique warnings and 0 duplicates.
[FINDBUGS] Successfully parsed file <https://builds.apache.org/job/apache-atlas-nightly/ws/repository/target/findbugs.xml>
with 0 unique warnings and 0 duplicates.
[FINDBUGS] Successfully parsed file <https://builds.apache.org/job/apache-atlas-nightly/ws/server-api/target/findbugs.xml>
with 0 unique warnings and 0 duplicates.
[FINDBUGS] Successfully parsed file <https://builds.apache.org/job/apache-atlas-nightly/ws/typesystem/target/findbugs.xml>
with 0 unique warnings and 0 duplicates.
[FINDBUGS] Successfully parsed file <https://builds.apache.org/job/apache-atlas-nightly/ws/webapp/target/findbugs.xml>
with 0 unique warnings and 0 duplicates.
[FINDBUGS] Computing warning deltas based on reference build #237
Archiving artifacts
Compressed 718.41 MB of artifacts by 100.0% relative to #237
TestNG Reports Processing: START
Looking for TestNG results report in workspace using pattern: **/target/surefire-reports/testng-results.xml,**/target/failsafe-reports/testng-results.xml
testng-results.xml was last modified before this build started. Ignoring it.
testng-results.xml was last modified before this build started. Ignoring it.
testng-results.xml was last modified before this build started. Ignoring it.
testng-results.xml was last modified before this build started. Ignoring it.
testng-results.xml was last modified before this build started. Ignoring it.
testng-results.xml was last modified before this build started. Ignoring it.
testng-results.xml was last modified before this build started. Ignoring it.
testng-results.xml was last modified before this build started. Ignoring it.
testng-results.xml was last modified before this build started. Ignoring it.
Saving reports...
Processing '/x1/jenkins/jenkins-home/jobs/apache-atlas-nightly/builds/238/testng/testng-results-1.xml'
Processing '/x1/jenkins/jenkins-home/jobs/apache-atlas-nightly/builds/238/testng/testng-results-2.xml'
Processing '/x1/jenkins/jenkins-home/jobs/apache-atlas-nightly/builds/238/testng/testng-results-3.xml'
Processing '/x1/jenkins/jenkins-home/jobs/apache-atlas-nightly/builds/238/testng/testng-results-4.xml'
Processing '/x1/jenkins/jenkins-home/jobs/apache-atlas-nightly/builds/238/testng/testng-results.xml'
Failed Tests/Configs found. Marking build as UNSTABLE.
TestNG Reports Processing: FINISH

Mime
View raw message