atlas-dev mailing list archives

Site index · List index
Message view « Date » · « Thread »
Top « Date » · « Thread »
From Apache Jenkins Server <jenk...@builds.apache.org>
Subject Build failed in Jenkins: apache-atlas-nightly #233
Date Tue, 05 Apr 2016 20:38:08 GMT
See <https://builds.apache.org/job/apache-atlas-nightly/233/changes>

Changes:

[sumasai.shivaprasad] ATLAS-605 Hook Notifications for DELETE entity needs to be supported

------------------------------------------
[...truncated 3565 lines...]
[ERROR] npm http 200 https://registry.npmjs.org/grunt-dev-update
[ERROR] npm ERR! registry error parsing json
[ERROR] npm http 200 https://registry.npmjs.org/express-load/-/express-load-1.1.15.tgz
[ERROR] npm ERR! SyntaxError: Unexpected token 
[ERROR] npm ERR! �     �YKo�6�+�λ2)Q"e E
[ERROR] npm ERR! z(�C�K|IK[+)"�`���3�ڱ��-և
[ERROR] t0`Q�y~����_9_��0�am��z��6^�W���7%_Ι*�\PRUVȢ�*��!��2W�[��/�1�����u-�:�n�����dʵu�UѮ����F�6��]{���/.l"M.FA��g��
k_~�P�hO���n������-,%ž��^4� ������>���޵�OH�;����V;����nk{�,lB�//.��5�$5�6��u/T@�s|���7zعߢ��^�����h=&B�a�
[ERROR] ���f�?lckH��J��'gzB��WP��o��K7H��!}3֮��?
[ERROR]  yq��i���[�p��,9������U��y�k��
`[0 �c�:�	��MD1�u�}�]��
[ERROR] npm ERR! �]?���|d�0��i�z���A����߁{�#{s�t׆����߸Q�I8
l��=�?���$�&遄n�����[ųʵ������&�jAc���
[ERROR] ,�Bٴ]�]��͕��錜����E�~�`h5Kr��[;<�0��b����������m���x�2��}�(�XT�7ҏ[�,�Te9-*n��8/�����*�3�Ijri
� �����`�5�v	���'�Pv��`i=9���o��
��q�@�_3i�
[ERROR] npm ERR! �23�~��������G�
����	]{���ퟠ�P%
[ERROR] @F�w�.�T��'3��(�1��0��1�.<���}o�_����7?'��;���,WT)��a��V���[:+uQVi��ON�c���Xz���s�1�b-籇c6��c?7�M���tQ)�UDhMifR�1A���ʄ`��R�Z�'>�Q8���y,;�Dz�ǖ��dO���s%N�8(=�+���T\愑��0UV�MMY�J�%�HY����~��Xv�<Ǝ�1����c������r?��p?F�����̐<�tZjI�Єk�8��ɒ
�Y�+I�<�\�Θ��cx3�̕�\y�yl����������<����i�S�J�
-x���
[ERROR] npm ERR! ����dN���8�y,?[�_s~����g�����
 ���[�N�0���9����s�XsD*w��ݦ�FȁR�z�)V�����%���q���ͯd����|�W��No����v�0�S6�hN��L�*�
[ERROR] ����iu��-�m��ӇmZ^,���LL�&�!�6�+�f�7�T<����n�)���2����93�hD��`+5�h�k
���p��#������4�H�`n��E�n�܎nrܩ��EX���dB�봀ƑK��jk���N����m��i&sf��Flc1Z�?����1�I��?:c����jY��Ds���v����K=Po#��+Qjఅ`�"8E���{�I�S��遂�̓�R\�t����t�j�?�
[ERROR] npm ERR! �L�蠅ڀ4�7���G��i
[ERROR] npm ERR! �븟������jd8pk]ʵD���H���N������Ҷ�LJ�S�p�u�\g�^�t��*�{��{7��{\:����M����a�vU�v%�\��x���ush�t�˹m���a�V,�paQ7`o���K]�{�aoq��98��h����l�"x3g��)��q6p����;
  ����݊� ����G_f��
[ERROR] npm ERR! {��;���P�����$]oK$����s�l�b
�{+��Xu�g#����������'�}��\nk_���],4�����uY�@*%��F)̞��U��������WG`�}�����񾛢�$㟷�>et
[ERROR] npm ERR! q�,�ܤ���'Ԭ�8YGm[O���IC�fX>]�a�a���}�ě��t-�4Ԥ\Ɣ�h��(�2)
[ERROR] �YX�F�������SvkhXtB/���89ͮ��zuث�)=�ܹiR�e��X�~Ls��<(t#�b�#��!
k��W��11X����ա[�C��sSǔ|��k�f�qxw�f��
��5���,P��R�;e�E�������g����L�8��R6��Z�j��|���2��N�����II�k�0dCK|
[ERROR] npm ERR! �F�`+�0;F�
[ERROR] npm ERR! ���b\{���W��0��Xx��s����Mh�|�0Rۮ�G��A��[�av����:��3�
 �����N�0�߅3�b;��3�	q��Z�D\x�+���F�nM�V�WmRɟֻ�3��E�KX��������ø��`�iY�t�Z���ZXVKe\_�"O�:������''��J�*17Y]�aOl�A�<��\�#�w0�#�EO�ª
[ERROR] npm ERR! ���������#���!xԲ�B��
�m����:0�Ux����b����Mt�������ׄo�8)�����G�5�Ծ1�(�^t���,�V�p��;��L���j6�L���Bpaۄ�@@@�����鬞����"��v����c��*NFv���L�d�����*f�|�4!����Q�
L�Z�T�c3�&�
[ERROR] �A0<����	2���<5c�\���8�1�����'��Bj��7&���C�f\�y��7
[ERROR] npm ERR! ����'�}�f�P���P7�
[ERROR] &Z�r�\�R���t E1�o.���p���J�Q�3��(�.E\Vx������W��+�����{z|X?���O��l���v^��*o����X|Sg<
[ERROR] npm ERR! �Qs	Ȇ��YR�zdFˆ�W�pɠ�F'h�&�������DHK�l›e�l����)�S(��ee�
  �����n�0�ߥ�����Ǿ�%�������F�k)&��r�k�
�a}�w�k�9�W
[ERROR] �G�,�p-�x�dEٟ�o?*�9߾��H{'#��y����RE�`)$�#i-��ju�}��}AsH�`�DR��Qh�&�G�������ֿ���#����vEs�F3��:���ހ���?g��p>��5��J)�A�jU�f��M6�Q`��+�|v���pJޡ�Ivb:�X�CkT�{n�)���
[ERROR] npm ERR! -��0UQf�Ʃby����^�w�+��#�T�|]9˾����-#�t����P@�2%/�����u��������dz��芽�>y#�������0�"�5ڂ�(�t��:�w�ؘ�A�:�G�4e(���Q��M�I5l���i��x���K<�~g������5<���f�<?,C;�|�<�<�ٮ�싱�P#�5ٵj��H��q,���|)m>�RW�<?��t.�0�K�6A:Dhq��C�4�y�J$C�/)�C�|86w�َl�����]�vu�xx���@���?��&{��3�>m��������4��#���-tR�3
[ERROR] npm ERR! �mݭ���q?Cs�b1�����v�5q����Ɗ�҉�CbU6#��"�����EGr�����+�7�����|�
� �]��{i�� z��{�q���O�
-rr`q$��.��Z${+�;Ʉ	��*Blx���y~�g�6Z�l�롪���U���qt6�k7{ի��H�����X�����f��[���hg��s��
 ���]=o�0�+�g��H�ک@�.�ց�(�H�������&�]K��q
[ERROR] }�����޽{���@������bҜ���_���p�E����;wB3�N
�ں
[ERROR] npm ERR! C�<��̘«*mbU(�9�nf(y���߽�fp���p��b���FW67�S��h���f�<'�<��F���y@L>��4�M�yb�mSH�`z��6,�74au���2�ߐ���",po\�.`N-w�9�➫�e)Wh#Y�r�U�w\(�y�c�;�cb��f�8����y���
[ERROR] npm ERR! ���9���9"g�.��k���?�f�Dun�2
ïs9����>�Úrd1�念�4��b�����RgN�8{�ȰQ��"����ץA'
hyt��B�����A9�:����L������2����}f4z������?����^��iF�dܘ���|u�ݰ��ή�1�����q��-¥[/��
	�ZG=3���Ӊ�¸ˆ���Ψ�;�h���d
vB3�ۗ#}� ��6�0���b�;i��pA���dF�R���b%]�S9Gpc#�8��>���q:x����(�ߪ!
쎆q�mqHk�G��,�4g�c0-1��qo��!�!�U�'lha��‘�K9��JJ�$������qVH�g��f=����)!�{X�/�j����L;��7ĕ����by&%�����������*�~�j�
[ERROR] npm ERR! 8��� w����������Y9��?1����oJ�Fs��3󰹾{���*��n�����|���ur��4���r�����w�6�g��
[ERROR] �
[ERROR] V&N���"�ʔ�{���f�o��Sk�E��oN�P�������
�!�ǰԒ���94�.����KWo�/���)�=�U�q]E˧��O~I�����3>����Ss�k͕
�q���������s�-cGT8F�v�Q��
 �����n�0�hZ����l���R׋���c�M��j�㮪hS���������Mުo���9��j�7��;j���ZO����<6��ڤ�Ǖr��P�$H��G���o�����8�]�(���r%Ο~�����uH�
�b	�S��,����q^QhX�䒮:�:
[ERROR] npm ERR! �i���1dm����vL`D���י���ڃ��SQ>G�:�T�S��(��h~��$�KpD�gwj/�|��7��DE=;�R.�,��������\'���9O���b��P���i��(�����=���5%2u�U�}�<�9��3����aZ�%$���q䩽�vi����|��y}S���Ԃ%o���
K�9�v[D5<����t[F���</o�Kyޠ2`$}��s[ʫ\�1�cLָ-*�V�<t�VUS9�T^��o��D���V}���G���<�-���D�������}G[@5�X�`_EG��|��y����"7xqa���,xC���Sf�l�l��==������_~=�x����4Yy>T���G�%�qm�(,��i.(YKs��1�|=͓5��U)�v�ת�I������rCl0H�:��G����C�7�_k�3��A1�:෰0��X�c�h��2As�gэ�<�vD�ސ�l��1.��\.>�������i^�M���C��N>;27h.��R�?ͅk+�9U��i�`h��TT޹ȬRk\LL�K���4��)�
[ERROR] npm ERR! ��\�t�ܓ��*fi�
[ERROR] #+O��M=iE����
[ERROR] npm ERR! �K�|��7���3�l�*�м���GڜH�7���+�?q�|��z�C�{�-�
 ���]�r�F��Y�A"KE]bK[qʎcǮ]˻�ֵ%f�!0$!�
1,G����gp�E�c�&уD�3�=}9} �����-؈��?�أ�\�
����n�&G�T�k	䮙�|���rt"FTw6s�߈��h0��7N������C�-<ǃ��8�����^N�|����w2l=Ħ���2���x�+�r���a�S</Q���!@?8|���(<'�Į�s9����μ|ƌ�"���v+�S��jt�ƿW��ˤ��%�C"�W��4���uʼ�q����3=���[8ә.h�/J�<��-Io$k
[ERROR] �m��\{ـ������¼�)�c�����H���lM�qV�?���=�3,�s�7�<��Z�?rhcg���o�.�=�{�鷴}�gTo_<
��ޞ���6*��2�1ȭѠ�'�� ��O�%�Xxw�P����&��_�h�O������'fl��p�+�(ĬNO4f�}#����-�m/��v���ڞ��P���3�͡����'c��M�y���Ia�Dc��G<��wFۻ���ష�fi�򹍇�7����l��}�!
�}�F���� �@~��
[ERROR] �������/����N��9�p�F�
�T�p����ly�٣u�����6�g�7Q��!��B��Su���i���S:
q��>��- �-�"*�J+���=��d�\����+{�C�B4�x�42q�{QڇQ�wkF����wy��ͷ�X�MK1b�M���k};���"!��?$<�����ҟ�Q\�Y^�ɷ)0�����_�������/�������^��db6�A[��^$S���W�(�d�.�7�
���4ʕT2�����\�2uy=&O�)�V�[�27��n���Ff�ff�����̨"U���*-�utjн�C5��@i�C�$=;jRF!
[ERROR] �s��<�qK����% �����օ���z6�M�%Q���x���Vi�bLT�`m���I`����XϢ8ҙ8���Bͳ40y����e5^�01�
�]3��Y���N�
[ERROR] �mխ�sdA2����AY%2�����u7�
��\�
[ERROR] �a=��@LƔf_�)�L1��P�X��w����pZ��Ä��Q¼��.�m�{�|���n��<+��ꍀpj-
[ERROR] ԓ�G�e)�x p(s����՚�q�,����4��y���]�Ti��&J������x�nr��'C�t��]l���=F@����A��*����h�.r$�0J��E�6�2���8X���[�儶f����1�P�:4L=��4M����
2��M	�!U��8�x�����
[ERROR] npm ERR! "'��žJ3'2�o���#O�0�r3���$�-B7UV�e��"i�
[ERROR] npm ERR! �GĔ�gv��q��s�ɠ�@�ö�U�����Ǚz?]�d
��O�(}���0���.�gg�e���~�Z���
0i�K�R�*#y�����Nd��*;�=�>���
2W"�z
[ERROR] ��& E J"�z<ZĒk��ѭMv�J�=���S��Äw�Y
���Yz��k+��>'���
[ERROR] npm ERR! �����{C�W!�S���
[ERROR] npm ERR! ��U:�1`9
[ERROR] ЛT�� �NT|�C�u|8�ʨ��?��J™�G�(���:��i)�����}J�DMR�(1"������_���)q�`"��Ե2=�N�WL���.��L���46:^�0c]���鸤o�:�
[ERROR] ���:�d!�cbh@F��X���U2/pY2�
RFg�?�tV�U�4-��>	Qȉk���8
[ERROR] npm ERR! ���&t�o�D��!���sI�al�ֻ�r������ecGW��
[ERROR] npm ERR! �A�.�H�$#0���]>��a�^��p`�dd�+K���_
�hL�w�:��]9�*��õ��A���9�7�#���A��T����F
(�-���
[ERROR] 鼂��ʄ[|Ь4���	�1�-Ƨ�����aP��Ш��iQ�?U��4t��a�]�A|,�!��`��}�*�HN^��Cz������`?z[�'�����l��h�6�I۴nY�ӊqi)���`p�Z�ә�c_���[Q�R�b‹.��r5�#>�Nתa�y�A������Ä�o��������l�u����\w-3�����a��a�Z|zh�ۥ��"T83��ZLa�A]�s��.0lK�t��,~�s=�N#��m���L���X0
[ERROR] npm ERR! 9QD�y�"��X�bh�r���T���IǿH:��R����U��O���%,m��U##x�3rS��݈���,VaY/�S�
 qŋ{}tՇx[�)@�I��r]�+7}�� ́��֝:)�q&���9丵�X�?�ߚ����X�e��QM���*�(ƸDk'/X�{�F#m����0�EXN��Xa��
[ERROR] �� �8o*�/�b}�j@},IԚ��)N�U	��c�e4xa}�ln��q�R�bmi�>����;B�$�Z1(��1��v��-(ϲL/7ԓ��8��[����݁�-�Y`�AFX�s��X"i���q�p�!�c�2�y�e@/�4KUK�������)SaM7����OrR?���sL�+G����-����I@VqO��3��l\Ғ��E1k.v�
@�w�A<y%�W&v)��R�m�H�+!~g8� �HÈ%�8ؤS�=Z�=0���0
[ERROR] �Zk!i���:k]V)5)�R�kY\B=����[�$�է����c��4}�j~�
 ����K�Gǿ��}Z��G�@��.ќQdY,ٵ%�!�wϯ��gl
�$�V����U�]]S�7&EZ	���ڢA#�Y��G�;��4�>.�nN�7/~����7۲�bYE�o�|fׯ�,6l���Yb���no�g񲭸���v��Βc�ʾn'~�Ϙ��E���o��HD�5����Rg�^���gY'���?��v��������Ұ�?ݛ�/�j��ݶ>H@e)S�5?_�-u��ջA���؜�<Pձy���Iɲ���?�~�È���?�Ho����Ђ�.H����l�l���c�>�>��m�9�J:�:;�.f�rഩq��ђ�\�Dpl8YI���H}N���r#�X�FQ��ݔ��>��/$�!I���7�xI��>�@.o�tA��d�{C�BA��ʋײַ���dx/���BC��n�𲒬�΍�_���P0�P�D��u~����g7�ޫ
ʉ��r�E/Ix�TP�l�����'q9�X
[ERROR]  u�$Ō�p�yC��+�١Ɗ�����d�6dˡ�06��b
ʈ����5�a!	�]�`���R�r��d�]`^
[ERROR] npm ERR! 	��y��IJ!A(�v�^0�C��4��
���-�F3L��D��:�K�sb� ���*4��g
P�vXxY��]�3�)l��E��R籴�MP�P�K2�B�w�Y�疁�����w~_�_tgۜ��Uy��;\7p&�u(���`
[ERROR] npm ERR! �G��ICՌ^)n��c���$Q"�W���C
[ERROR] e��1�\��v���+r*�ԡ_PRR^R��}aE��dF1�`Ɣ�!�e��"^=2u�DޮXQ�z��e�DR�UI�Ugr
3�������&��Ï�:!Y�+1�/x���(��NH�8����j1�d����DI��

[ERROR] npm ERR! ��O�@E���>�^�A�v&���"�F����QUWK(�@�h�8�DLp��������GG�$W�[�-Yo�����^�]'�zH-񑭢�ۊo$�x���Tnm����'O�?3wҋNRo�~l}��d0(+9���L��o�o�:���q�]~���������xږ�(雺3��k?�[��P��y����i�{-Y-Q��O���8��
 
[ERROR] npm ERR!     at Object.parse (native)
[ERROR] npm ERR!     at RegClient.<anonymous> (<https://builds.apache.org/job/apache-atlas-nightly/ws/dashboard/target/node/npm/node_modules/npm-registry-client/lib/request.js>:203:23)
[ERROR] npm ERR!     at Request.self.callback (<https://builds.apache.org/job/apache-atlas-nightly/ws/dashboard/target/node/npm/node_modules/request/request.js>:123:22)
[ERROR] npm ERR!     at Request.emit (events.js:98:17)
[ERROR] npm ERR!     at Request.<anonymous> (<https://builds.apache.org/job/apache-atlas-nightly/ws/dashboard/target/node/npm/node_modules/request/request.js>:893:14)
[ERROR] npm ERR!     at Request.emit (events.js:117:20)
[ERROR] npm ERR!     at IncomingMessage.<anonymous> (<https://builds.apache.org/job/apache-atlas-nightly/ws/dashboard/target/node/npm/node_modules/request/request.js>:844:12)
[ERROR] npm ERR!     at IncomingMessage.emit (events.js:117:20)
[ERROR] npm ERR!     at _stream_readable.js:938:16
[ERROR] npm ERR!     at process._tickCallback (node.js:419:13)
[ERROR] npm ERR! If you need help, you may report this *entire* log,
[ERROR] npm ERR! including the npm and node versions, at:
[ERROR] npm ERR!     <http://github.com/npm/npm/issues>
[ERROR] 
[ERROR] npm ERR! System Linux 3.13.0-36-lowlatency
[ERROR] npm ERR! command "<https://builds.apache.org/job/apache-atlas-nightly/ws/dashboard/target/node/node">
"<https://builds.apache.org/job/apache-atlas-nightly/ws/dashboard/target/node/npm/bin/npm-cli.js">
"install" "--color=false"
[ERROR] npm ERR! cwd <https://builds.apache.org/job/apache-atlas-nightly/ws/dashboard/target>
[ERROR] npm ERR! node -v v0.10.30
[ERROR] npm ERR! npm -v 1.4.3
[ERROR] npm ERR! type unexpected_token
[ERROR] npm http GET https://registry.npmjs.org/superagent/-/superagent-0.20.0.tgz
[ERROR] npm http 200 https://registry.npmjs.org/grunt-bower-task
[ERROR] npm ERR! registry error parsing json
[ERROR] npm http 200 https://registry.npmjs.org/grunt-jsbeautifier
[ERROR] npm http 200 https://registry.npmjs.org/grunt-contrib-watch
[ERROR] npm http 200 https://registry.npmjs.org/grunt-shell
[ERROR] npm http GET https://registry.npmjs.org/view-helpers/-/view-helpers-0.1.5.tgz
[ERROR] npm http 200 https://registry.npmjs.org/static-favicon/-/static-favicon-2.0.0-alpha.tgz
[ERROR] npm http 200 https://registry.npmjs.org/path-extra/-/path-extra-0.1.1.tgz
[ERROR] npm http 200 https://registry.npmjs.org/method-override/-/method-override-1.0.2.tgz
[ERROR] npm http 304 https://registry.npmjs.org/express
[ERROR] npm http 304 https://registry.npmjs.org/lodash
[ERROR] npm http 304 https://registry.npmjs.org/morgan
[ERROR] npm http 200 https://registry.npmjs.org/grunt-nodemon
[ERROR] npm http 200 https://registry.npmjs.org/cookies/-/cookies-0.4.1.tgz
[ERROR] npm http 200 https://registry.npmjs.org/forever/-/forever-0.11.1.tgz
[ERROR] npm http GET https://registry.npmjs.org/swig/-/swig-1.3.2.tgz
[ERROR] npm http 200 https://registry.npmjs.org/grunt-nginx
[ERROR] npm http 200 https://registry.npmjs.org/view-helpers/-/view-helpers-0.1.5.tgz
[ERROR] npm http 304 https://registry.npmjs.org/q
[ERROR] npm http 304 https://registry.npmjs.org/grunt-contrib-clean
[ERROR] npm http GET https://registry.npmjs.org/grunt-contrib-compress/-/grunt-contrib-compress-0.13.0.tgz
[ERROR] npm http 304 https://registry.npmjs.org/grunt-cli
[ERROR] npm http 200 https://registry.npmjs.org/superagent/-/superagent-0.20.0.tgz
[ERROR] npm http 200 https://registry.npmjs.org/proxit/-/proxit-0.6.4.tgz
[ERROR] npm http 200 https://registry.npmjs.org/grunt-contrib-jshint
[ERROR] npm http 200 https://registry.npmjs.org/grunt
[ERROR] npm http 304 https://registry.npmjs.org/load-grunt-tasks
[ERROR] npm http 304 https://registry.npmjs.org/grunt-concurrent
[ERROR] npm http 304 https://registry.npmjs.org/grunt-contrib-copy
[ERROR] npm http GET https://registry.npmjs.org/git-rev/-/git-rev-0.2.1.tgz
[ERROR] npm http GET https://registry.npmjs.org/grunt-contrib-watch/-/grunt-contrib-watch-0.6.1.tgz
[ERROR] npm http GET https://registry.npmjs.org/grunt-jsbeautifier/-/grunt-jsbeautifier-0.2.10.tgz
[ERROR] npm http 304 https://registry.npmjs.org/body-parser
[ERROR] npm http 304 https://registry.npmjs.org/bower
[ERROR] npm http 304 https://registry.npmjs.org/compression
[ERROR] npm http GET https://registry.npmjs.org/grunt-shell/-/grunt-shell-1.2.1.tgz
[ERROR] npm http 304 https://registry.npmjs.org/consolidate
[ERROR] npm http GET https://registry.npmjs.org/express/-/express-4.2.0.tgz
[ERROR] npm http GET https://registry.npmjs.org/grunt-nodemon/-/grunt-nodemon-0.4.1.tgz
[ERROR] npm http GET https://registry.npmjs.org/grunt-nginx/-/grunt-nginx-0.2.2.tgz
[ERROR] npm http GET https://registry.npmjs.org/q/-/q-1.0.1.tgz
[ERROR] npm http GET https://registry.npmjs.org/grunt-contrib-clean/-/grunt-contrib-clean-0.6.0.tgz
[ERROR] npm http 200 https://registry.npmjs.org/grunt-contrib-compress/-/grunt-contrib-compress-0.13.0.tgz
[ERROR] npm http GET https://registry.npmjs.org/grunt-contrib-jshint/-/grunt-contrib-jshint-0.11.3.tgz
[ERROR] npm http GET https://registry.npmjs.org/load-grunt-tasks/-/load-grunt-tasks-3.4.1.tgz
[ERROR] npm http GET https://registry.npmjs.org/grunt-concurrent/-/grunt-concurrent-1.0.1.tgz
[ERROR] npm http GET https://registry.npmjs.org/grunt-contrib-copy/-/grunt-contrib-copy-0.8.2.tgz
[ERROR] npm http GET https://registry.npmjs.org/bower/-/bower-1.3.12.tgz
[ERROR] npm http GET https://registry.npmjs.org/consolidate/-/consolidate-0.10.0.tgz
[ERROR] npm http 200 https://registry.npmjs.org/swig/-/swig-1.3.2.tgz
[ERROR] npm http 200 https://registry.npmjs.org/grunt-shell/-/grunt-shell-1.2.1.tgz
[ERROR] npm http 200 https://registry.npmjs.org/grunt-contrib-watch/-/grunt-contrib-watch-0.6.1.tgz
[ERROR] npm http 200 https://registry.npmjs.org/git-rev/-/git-rev-0.2.1.tgz
[ERROR] npm http 200 https://registry.npmjs.org/express/-/express-4.2.0.tgz
[ERROR] npm http 200 https://registry.npmjs.org/grunt-nodemon/-/grunt-nodemon-0.4.1.tgz
[ERROR] npm http 200 https://registry.npmjs.org/grunt-contrib-jshint/-/grunt-contrib-jshint-0.11.3.tgz
[ERROR] npm http 200 https://registry.npmjs.org/q/-/q-1.0.1.tgz
[ERROR] npm http 200 https://registry.npmjs.org/grunt-contrib-clean/-/grunt-contrib-clean-0.6.0.tgz
[ERROR] npm http 200 https://registry.npmjs.org/load-grunt-tasks/-/load-grunt-tasks-3.4.1.tgz
[ERROR] npm http 200 https://registry.npmjs.org/bower/-/bower-1.3.12.tgz
[ERROR] npm http 200 https://registry.npmjs.org/grunt-contrib-copy/-/grunt-contrib-copy-0.8.2.tgz
[ERROR] npm http 200 https://registry.npmjs.org/consolidate/-/consolidate-0.10.0.tgz
[ERROR] npm http 200 https://registry.npmjs.org/grunt-nginx/-/grunt-nginx-0.2.2.tgz
[ERROR] npm http 200 https://registry.npmjs.org/grunt-concurrent/-/grunt-concurrent-1.0.1.tgz
[ERROR] npm http 200 https://registry.npmjs.org/grunt-jsbeautifier/-/grunt-jsbeautifier-0.2.10.tgz
[ERROR] npm ERR! 
[ERROR] npm ERR! Additional logging details can be found in:
[ERROR] npm ERR!     <https://builds.apache.org/job/apache-atlas-nightly/ws/dashboard/target/npm-debug.log>
[ERROR] npm ERR! not ok code 0
[INFO] ------------------------------------------------------------------------
[INFO] Reactor Summary:
[INFO] 
[INFO] apache-atlas ...................................... SUCCESS [ 18.201 s]
[INFO] Apache Atlas Common ............................... SUCCESS [ 31.645 s]
[INFO] Apache Atlas Typesystem ........................... SUCCESS [02:24 min]
[INFO] Apache Atlas Client ............................... SUCCESS [ 36.994 s]
[INFO] Apache Atlas Server API ........................... SUCCESS [ 18.296 s]
[INFO] Apache Atlas Notification ......................... SUCCESS [ 47.130 s]
[INFO] Apache Atlas Titan ................................ SUCCESS [ 49.888 s]
[INFO] Apache Atlas Repository ........................... SUCCESS [11:33 min]
[INFO] Apache Atlas UI ................................... FAILURE [ 13.855 s]
[INFO] Apache Atlas Web Application ...................... SKIPPED
[INFO] Apache Atlas Documentation ........................ SKIPPED
[INFO] Apache Atlas FileSystem Model ..................... SKIPPED
[INFO] Apache Atlas Hive Bridge .......................... SKIPPED
[INFO] Apache Atlas Falcon Bridge ........................ SKIPPED
[INFO] Apache Atlas Sqoop Bridge ......................... SKIPPED
[INFO] Apache Atlas Storm Bridge ......................... SKIPPED
[INFO] Apache Atlas Distribution ......................... SKIPPED
[INFO] ------------------------------------------------------------------------
[INFO] BUILD FAILURE
[INFO] ------------------------------------------------------------------------
[INFO] Total time: 17:37 min
[INFO] Finished at: 2016-04-05T20:37:11+00:00
[INFO] Final Memory: 125M/1404M
[INFO] ------------------------------------------------------------------------
[ERROR] Failed to execute goal com.github.eirslett:frontend-maven-plugin:0.0.23:npm (npm install)
on project atlas-dashboard: Failed to run task: 'npm install --color=false' failed. (error
code 1) -> [Help 1]
[ERROR] 
[ERROR] To see the full stack trace of the errors, re-run Maven with the -e switch.
[ERROR] Re-run Maven using the -X switch to enable full debug logging.
[ERROR] 
[ERROR] For more information about the errors and possible solutions, please read the following
articles:
[ERROR] [Help 1] http://cwiki.apache.org/confluence/display/MAVEN/MojoFailureException
[ERROR] 
[ERROR] After correcting the problems, you can resume the build with the command
[ERROR]   mvn <goals> -rf :atlas-dashboard
Build step 'Execute shell' marked build as failure
[CHECKSTYLE] Collecting checkstyle analysis files...
[CHECKSTYLE] Finding all files that match the pattern **/target/checkstyle-result.xml
[CHECKSTYLE] Parsing 16 files in <https://builds.apache.org/job/apache-atlas-nightly/ws/>
[CHECKSTYLE] Successfully parsed file <https://builds.apache.org/job/apache-atlas-nightly/ws/addons/falcon-bridge/target/checkstyle-result.xml>
with 52 unique warnings and 0 duplicates.
[CHECKSTYLE] Successfully parsed file <https://builds.apache.org/job/apache-atlas-nightly/ws/addons/hdfs-model/target/checkstyle-result.xml>
with 69 unique warnings and 0 duplicates.
[CHECKSTYLE] Successfully parsed file <https://builds.apache.org/job/apache-atlas-nightly/ws/addons/hive-bridge/target/checkstyle-result.xml>
with 235 unique warnings and 0 duplicates.
[CHECKSTYLE] Successfully parsed file <https://builds.apache.org/job/apache-atlas-nightly/ws/addons/sqoop-bridge/target/checkstyle-result.xml>
with 251 unique warnings and 0 duplicates.
[CHECKSTYLE] Successfully parsed file <https://builds.apache.org/job/apache-atlas-nightly/ws/addons/storm-bridge/target/checkstyle-result.xml>
with 327 unique warnings and 0 duplicates.
[CHECKSTYLE] Successfully parsed file <https://builds.apache.org/job/apache-atlas-nightly/ws/client/target/checkstyle-result.xml>
with 391 unique warnings and 0 duplicates.
[CHECKSTYLE] Successfully parsed file <https://builds.apache.org/job/apache-atlas-nightly/ws/common/target/checkstyle-result.xml>
with 391 unique warnings and 0 duplicates.
[CHECKSTYLE] Successfully parsed file <https://builds.apache.org/job/apache-atlas-nightly/ws/distro/target/checkstyle-result.xml>
with 391 unique warnings and 0 duplicates.
[CHECKSTYLE] Successfully parsed file <https://builds.apache.org/job/apache-atlas-nightly/ws/docs/target/checkstyle-result.xml>
with 391 unique warnings and 0 duplicates.
[CHECKSTYLE] Successfully parsed file <https://builds.apache.org/job/apache-atlas-nightly/ws/notification/target/checkstyle-result.xml>
with 391 unique warnings and 0 duplicates.
[CHECKSTYLE] Successfully parsed file <https://builds.apache.org/job/apache-atlas-nightly/ws/repository/target/checkstyle-result.xml>
with 1098 unique warnings and 0 duplicates.
[CHECKSTYLE] Successfully parsed file <https://builds.apache.org/job/apache-atlas-nightly/ws/server-api/target/checkstyle-result.xml>
with 1121 unique warnings and 0 duplicates.
[CHECKSTYLE] Successfully parsed file <https://builds.apache.org/job/apache-atlas-nightly/ws/target/checkstyle-result.xml>
with 1121 unique warnings and 0 duplicates.
[CHECKSTYLE] Successfully parsed file <https://builds.apache.org/job/apache-atlas-nightly/ws/titan/target/checkstyle-result.xml>
with 1481 unique warnings and 0 duplicates.
[CHECKSTYLE] Successfully parsed file <https://builds.apache.org/job/apache-atlas-nightly/ws/typesystem/target/checkstyle-result.xml>
with 2144 unique warnings and 0 duplicates.
[CHECKSTYLE] Successfully parsed file <https://builds.apache.org/job/apache-atlas-nightly/ws/webapp/target/checkstyle-result.xml>
with 2385 unique warnings and 0 duplicates.
[CHECKSTYLE] Computing warning deltas based on reference build #231
[FINDBUGS] Collecting findbugs analysis files...
[FINDBUGS] Finding all files that match the pattern **/target/findbugs.xml
[FINDBUGS] Parsing 13 files in <https://builds.apache.org/job/apache-atlas-nightly/ws/>
[FINDBUGS] Successfully parsed file <https://builds.apache.org/job/apache-atlas-nightly/ws/addons/falcon-bridge/target/findbugs.xml>
with 0 unique warnings and 0 duplicates.
[FINDBUGS] Successfully parsed file <https://builds.apache.org/job/apache-atlas-nightly/ws/addons/hdfs-model/target/findbugs.xml>
with 0 unique warnings and 0 duplicates.
[FINDBUGS] Successfully parsed file <https://builds.apache.org/job/apache-atlas-nightly/ws/addons/hive-bridge/target/findbugs.xml>
with 0 unique warnings and 0 duplicates.
[FINDBUGS] Successfully parsed file <https://builds.apache.org/job/apache-atlas-nightly/ws/addons/sqoop-bridge/target/findbugs.xml>
with 0 unique warnings and 0 duplicates.
[FINDBUGS] Successfully parsed file <https://builds.apache.org/job/apache-atlas-nightly/ws/addons/storm-bridge/target/findbugs.xml>
with 0 unique warnings and 0 duplicates.
[FINDBUGS] Successfully parsed file <https://builds.apache.org/job/apache-atlas-nightly/ws/client/target/findbugs.xml>
with 0 unique warnings and 0 duplicates.
[FINDBUGS] Successfully parsed file <https://builds.apache.org/job/apache-atlas-nightly/ws/common/target/findbugs.xml>
with 0 unique warnings and 0 duplicates.
[FINDBUGS] Successfully parsed file <https://builds.apache.org/job/apache-atlas-nightly/ws/notification/target/findbugs.xml>
with 0 unique warnings and 0 duplicates.
[FINDBUGS] Successfully parsed file <https://builds.apache.org/job/apache-atlas-nightly/ws/repository/target/findbugs.xml>
with 0 unique warnings and 0 duplicates.
[FINDBUGS] Successfully parsed file <https://builds.apache.org/job/apache-atlas-nightly/ws/server-api/target/findbugs.xml>
with 0 unique warnings and 0 duplicates.
[FINDBUGS] Successfully parsed file <https://builds.apache.org/job/apache-atlas-nightly/ws/titan/target/findbugs.xml>
with 0 unique warnings and 0 duplicates.
[FINDBUGS] Successfully parsed file <https://builds.apache.org/job/apache-atlas-nightly/ws/typesystem/target/findbugs.xml>
with 0 unique warnings and 0 duplicates.
[FINDBUGS] Successfully parsed file <https://builds.apache.org/job/apache-atlas-nightly/ws/webapp/target/findbugs.xml>
with 0 unique warnings and 0 duplicates.
[FINDBUGS] Computing warning deltas based on reference build #231
Archiving artifacts
Compressed 499.73 MB of artifacts by 82.6% relative to #231
TestNG Reports Processing: START
Looking for TestNG results report in workspace using pattern: **/target/surefire-reports/testng-results.xml,**/target/failsafe-reports/testng-results.xml
testng-results.xml was last modified before this build started. Ignoring it.
testng-results.xml was last modified before this build started. Ignoring it.
testng-results.xml was last modified before this build started. Ignoring it.
testng-results.xml was last modified before this build started. Ignoring it.
testng-results.xml was last modified before this build started. Ignoring it.
testng-results.xml was last modified before this build started. Ignoring it.
testng-results.xml was last modified before this build started. Ignoring it.
testng-results.xml was last modified before this build started. Ignoring it.
Saving reports...
Processing '/x1/jenkins/jenkins-home/jobs/apache-atlas-nightly/builds/233/testng/testng-results-1.xml'
Processing '/x1/jenkins/jenkins-home/jobs/apache-atlas-nightly/builds/233/testng/testng-results-2.xml'
Processing '/x1/jenkins/jenkins-home/jobs/apache-atlas-nightly/builds/233/testng/testng-results-3.xml'
Processing '/x1/jenkins/jenkins-home/jobs/apache-atlas-nightly/builds/233/testng/testng-results-4.xml'
Processing '/x1/jenkins/jenkins-home/jobs/apache-atlas-nightly/builds/233/testng/testng-results-5.xml'
Processing '/x1/jenkins/jenkins-home/jobs/apache-atlas-nightly/builds/233/testng/testng-results.xml'
TestNG Reports Processing: FINISH
Mime
View raw message