atlas-dev mailing list archives

Site index · List index
Message view « Date » · « Thread »
Top « Date » · « Thread »
From "Hemanth Yamijala (JIRA)" <j...@apache.org>
Subject [jira] [Updated] (ATLAS-199) webapp build fails (grunt + tests)
Date Fri, 29 Jan 2016 05:37:39 GMT

     [ https://issues.apache.org/jira/browse/ATLAS-199?page=com.atlassian.jira.plugin.system.issuetabpanels:all-tabpanel
]

Hemanth Yamijala updated ATLAS-199:
-----------------------------------
    Attachment: npm-install-failed.txt

Got a similar error today during build - was doing clean install - the npm log messages are
attached (npm-install-failed.txt)... Just fyi.. Hopefully the patch will fix it.. Can't say
for sure as it appears randomly.

> webapp build fails (grunt + tests)
> ----------------------------------
>
>                 Key: ATLAS-199
>                 URL: https://issues.apache.org/jira/browse/ATLAS-199
>             Project: Atlas
>          Issue Type: Bug
>    Affects Versions: 0.6-incubating
>            Reporter: Erik Bergenholtz
>            Assignee: Sanjay Patel
>            Priority: Critical
>              Labels: ATLAS-UI-BUGS
>             Fix For: trunk
>
>         Attachments: ATLAS-199-v0.patch, ATLAS-199-v1.patch, npm-install-failed.txt
>
>
> When building Atlas webapp, I see the following issues:
> mvn clean install:
> {code}
> [INFO] Running 'grunt bower --no-color' in /Users/ebergenholtz/git3/incubator-atlas/dashboard
> [INFO] ------------------------------------------------------------------------
> [INFO] BUILD FAILURE
> [INFO] ------------------------------------------------------------------------
> [INFO] Total time: 34.282 s
> [INFO] Finished at: 2015-09-30T13:55:30-05:00
> [INFO] Final Memory: 35M/420M
> [INFO] ------------------------------------------------------------------------
> [ERROR] Failed to execute goal com.github.eirslett:frontend-maven-plugin:0.0.23:grunt
(install bower) on project atlas-webapp: Failed to run task: 'grunt bower --no-color' failed.
java.io.IOException: Cannot run program "/Users/ebergenholtz/git3/incubator-atlas/dashboard/node/node"
(in directory "/Users/ebergenholtz/git3/incubator-atlas/dashboard"): error=2, No such file
or directory -> [Help 1]
> {code}
> Also, if I bypass the grunt task some of the tests fail.



--
This message was sent by Atlassian JIRA
(v6.3.4#6332)

Mime
View raw message