atlas-dev mailing list archives

Site index · List index
Message view « Date » · « Thread »
Top « Date » · « Thread »
From "liutongfeng (JIRA)" <j...@apache.org>
Subject [jira] [Created] (ATLAS-280) The url of jceks cause some test cases always fail under Windows
Date Wed, 04 Nov 2015 11:28:27 GMT
liutongfeng created ATLAS-280:
---------------------------------

             Summary: The url of jceks cause some test cases always fail under Windows
                 Key: ATLAS-280
                 URL: https://issues.apache.org/jira/browse/ATLAS-280
             Project: Atlas
          Issue Type: Bug
            Reporter: liutongfeng
            Assignee: liutongfeng


The failure message:

Tests run: 4, Failures: 4, Errors: 0, Skipped: 0, Time elapsed: 0.669 sec <<< FAILURE!
- in org.apache.atlas.CredentialProviderUtilityIT
testEnterEmptyValues(org.apache.atlas.CredentialProviderUtilityIT)  Time elapsed: 0.262 sec
 <<< FAILURE!
java.lang.IllegalArgumentException: java.net.URISyntaxException: Relative path in absolute
URI: fileC:://Users/ADMINI~1/AppData/Local/Temp/tempproviders8020571659810622990/test.jks



--
This message was sent by Atlassian JIRA
(v6.3.4#6332)

Mime
View raw message