atlas-dev mailing list archives

Site index · List index
Message view « Date » · « Thread »
Top « Date » · « Thread »
From "Darshan Kumar (JIRA)" <j...@apache.org>
Subject [jira] [Commented] (ATLAS-199) webapp build fails (grunt + tests)
Date Fri, 09 Oct 2015 16:31:28 GMT

    [ https://issues.apache.org/jira/browse/ATLAS-199?page=com.atlassian.jira.plugin.system.issuetabpanels:comment-tabpanel&focusedCommentId=14950657#comment-14950657
] 

Darshan Kumar commented on ATLAS-199:
-------------------------------------

1. result of the command : export MAVEN_OPTS="-Xmx1024m -XX:MaxPermSize=256m" && mvn
install -DskipTests -DskipCheck=true

[INFO] ------------------------------------------------------------------------
[INFO] Reactor Summary:
[INFO] 
[INFO] apache-atlas ....................................... SUCCESS [ 37.890 s]
[INFO] Apache Atlas Typesystem ............................ SUCCESS [01:12 min]
[INFO] Apache Atlas Common ................................ SUCCESS [  3.860 s]
[INFO] Apache Atlas Client ................................ SUCCESS [ 15.169 s]
[INFO] Apache Atlas Notification .......................... SUCCESS [  6.924 s]
[INFO] Apache Atlas Repository ............................ SUCCESS [01:57 min]
[INFO] Apache Atlas Web Application ....................... SUCCESS [05:56 min]
[INFO] Apache Atlas Documentation ......................... SUCCESS [ 15.785 s]
[INFO] Apache Atlas Hive Bridge ........................... SUCCESS [ 41.435 s]
[INFO] Apache Atlas Distribution .......................... SUCCESS [  6.705 s]
[INFO] ------------------------------------------------------------------------
[INFO] BUILD SUCCESS
[INFO] ------------------------------------------------------------------------
[INFO] Total time: 11:20 min
[INFO] Finished at: 2015-10-09T21:48:51+05:30
[INFO] Final Memory: 122M/694M
[INFO] ------------------------------------------------------------------------

2. Result of the command :  mvn package -Pdist -DskipTests -DskipCheck=true 


[INFO] Building tar: /Users/darshankumar/HDPDGI-166/oct9/incubator-atlas/distro/target/apache-atlas-0.6-incubating-SNAPSHOT-sources.tar.gz
[INFO] ------------------------------------------------------------------------
[INFO] Reactor Summary:
[INFO] 
[INFO] apache-atlas ....................................... SUCCESS [ 45.119 s]
[INFO] Apache Atlas Typesystem ............................ SUCCESS [ 53.167 s]
[INFO] Apache Atlas Common ................................ SUCCESS [  3.194 s]
[INFO] Apache Atlas Client ................................ SUCCESS [  7.201 s]
[INFO] Apache Atlas Notification .......................... SUCCESS [  3.263 s]
[INFO] Apache Atlas Repository ............................ SUCCESS [01:58 min]
[INFO] Apache Atlas Web Application ....................... SUCCESS [01:31 min]
[INFO] Apache Atlas Documentation ......................... SUCCESS [ 13.551 s]
[INFO] Apache Atlas Hive Bridge ........................... SUCCESS [ 22.591 s]
[INFO] Apache Atlas Distribution .......................... SUCCESS [01:21 min]
[INFO] ------------------------------------------------------------------------
[INFO] BUILD SUCCESS
[INFO] ------------------------------------------------------------------------
[INFO] Total time: 07:26 min
[INFO] Finished at: 2015-10-09T21:56:50+05:30
[INFO] Final Memory: 79M/653M
[INFO] ------------------------------------------------------------------------

[~suma.shivaprasad] I am able to get Build success for the above command and please verify.
Thanks  

> webapp build fails (grunt + tests)
> ----------------------------------
>
>                 Key: ATLAS-199
>                 URL: https://issues.apache.org/jira/browse/ATLAS-199
>             Project: Atlas
>          Issue Type: Bug
>    Affects Versions: 0.6-incubating
>            Reporter: Erik Bergenholtz
>            Assignee: Darshan Kumar
>            Priority: Critical
>              Labels: patch-available
>             Fix For: 0.6-incubating
>
>         Attachments: ATLAS-199-v0.patch
>
>
> When building Atlas webapp, I see the following issues:
> mvn clean install:
> {code}
> [INFO] Running 'grunt bower --no-color' in /Users/ebergenholtz/git3/incubator-atlas/dashboard
> [INFO] ------------------------------------------------------------------------
> [INFO] BUILD FAILURE
> [INFO] ------------------------------------------------------------------------
> [INFO] Total time: 34.282 s
> [INFO] Finished at: 2015-09-30T13:55:30-05:00
> [INFO] Final Memory: 35M/420M
> [INFO] ------------------------------------------------------------------------
> [ERROR] Failed to execute goal com.github.eirslett:frontend-maven-plugin:0.0.23:grunt
(install bower) on project atlas-webapp: Failed to run task: 'grunt bower --no-color' failed.
java.io.IOException: Cannot run program "/Users/ebergenholtz/git3/incubator-atlas/dashboard/node/node"
(in directory "/Users/ebergenholtz/git3/incubator-atlas/dashboard"): error=2, No such file
or directory -> [Help 1]
> {code}
> Also, if I bypass the grunt task some of the tests fail.



--
This message was sent by Atlassian JIRA
(v6.3.4#6332)

Mime
View raw message