atlas-dev mailing list archives

Site index · List index
Message view « Date » · « Thread »
Top « Date » · « Thread »
From Apache Jenkins Server <jenk...@builds.apache.org>
Subject Build failed in Jenkins: apache-atlas-nightly #94
Date Mon, 12 Oct 2015 21:40:39 GMT
See <https://builds.apache.org/job/apache-atlas-nightly/94/changes>

Changes:

[sshivalingamurthy] ATLAS-212 Remove test class usage of hive configuration property

------------------------------------------
[...truncated 3765 lines...]
[INFO] Exclude: **/*.json
[INFO] Exclude: .pc/**
[INFO] Exclude: debian/**
[INFO] Exclude: .svn/**
[INFO] Exclude: .git/**
[INFO] Exclude: .gitignore
[INFO] Exclude: **/.idea/**
[INFO] Exclude: **/*.twiki
[INFO] Exclude: **/*.iml
[INFO] Exclude: **/*.json
[INFO] Exclude: **/target/**
[INFO] Exclude: **/target*/**
[INFO] Exclude: **/build/**
[INFO] Exclude: **/*.patch
[INFO] Exclude: derby.log
[INFO] Exclude: **/logs/**
[INFO] Exclude: **/.classpath
[INFO] Exclude: **/.project
[INFO] Exclude: **/.settings/**
[INFO] Exclude: **/test-output/**
[INFO] Exclude: **/mock/**
[INFO] Exclude: **/data/**
[INFO] Exclude: **/maven-eclipse.xml
[INFO] Exclude: **/.externalToolBuilders/**
[INFO] Exclude: **/build.log
[INFO] Exclude: .bowerrc
[INFO] Exclude: *.json
[INFO] 
[INFO] --- maven-checkstyle-plugin:2.9.1:check (checkstyle-check) @ dashboard ---
[INFO] Starting audit...
Audit done.

[INFO] 
[INFO] >>> findbugs-maven-plugin:3.0.1:check (findbugs-check) @ dashboard >>>
[INFO] 
[INFO] --- findbugs-maven-plugin:3.0.1:findbugs (findbugs) @ dashboard ---
[INFO] 
[INFO] <<< findbugs-maven-plugin:3.0.1:check (findbugs-check) @ dashboard <<<
[INFO] 
[INFO] --- findbugs-maven-plugin:3.0.1:check (findbugs-check) @ dashboard ---
[INFO]                                                                         
[INFO] ------------------------------------------------------------------------
[INFO] Building Apache Atlas Web Application 0.6-incubating-SNAPSHOT
[INFO] ------------------------------------------------------------------------
[INFO] 
[INFO] --- maven-clean-plugin:2.5:clean (default-clean) @ atlas-webapp ---
[INFO] Deleting <https://builds.apache.org/job/apache-atlas-nightly/ws/webapp/target>
[INFO] Deleting <https://builds.apache.org/job/apache-atlas-nightly/ws/webapp> (includes
= [**/*.pyc], excludes = [])
[INFO] 
[INFO] --- buildnumber-maven-plugin:1.0:create (default) @ atlas-webapp ---
[INFO] Checking for local modifications: skipped.
[INFO] Updating project files from SCM: skipped.
[WARNING] Cannot get the revision information from the scm repository, proceeding with revision
of release : 
No such provider: 'https'.
[INFO] Storing buildNumber: release at timestamp: 1444685982724
[WARNING] Cannot get the branch information from the scm repository, proceeding with UNKNOWN_BRANCH
: 
No such provider: 'https'.
[INFO] Storing buildScmBranch: UNKNOWN_BRANCH
[INFO] 
[INFO] --- maven-remote-resources-plugin:1.5:process (default) @ atlas-webapp ---
[INFO] 
[INFO] --- keytool-maven-plugin:1.5:clean (clean) @ atlas-webapp ---
[WARNING] Keystore file '<https://builds.apache.org/job/apache-atlas-nightly/ws/webapp/target/atlas.keystore'>
doesn't exist.
[INFO] 
[INFO] --- keytool-maven-plugin:1.5:generateKeyPair (generateKeyPair) @ atlas-webapp ---
[INFO] 
[INFO] --- maven-resources-plugin:2.7:resources (default-resources) @ atlas-webapp ---
[INFO] Using 'UTF-8' encoding to copy filtered resources.
[INFO] Copying 2 resources
[INFO] Copying 2 resources to META-INF
[INFO] Copying 3 resources
[INFO] 
[INFO] --- scala-maven-plugin:3.2.0:compile (scala-compile-first) @ atlas-webapp ---
[WARNING] Zinc server is not available at port 3030 - reverting to normal incremental compile
[INFO] Using incremental compilation
[INFO] Compiling 22 Java sources to <https://builds.apache.org/job/apache-atlas-nightly/ws/webapp/target/classes...>
[INFO] 
[INFO] --- maven-compiler-plugin:3.1:compile (default-compile) @ atlas-webapp ---
[INFO] Changes detected - recompiling the module!
[INFO] Compiling 22 source files to <https://builds.apache.org/job/apache-atlas-nightly/ws/webapp/target/classes>
[INFO] 
[INFO] --- maven-resources-plugin:2.7:testResources (default-testResources) @ atlas-webapp
---
[INFO] Using 'UTF-8' encoding to copy filtered resources.
[INFO] skip non existing resourceDirectory <https://builds.apache.org/job/apache-atlas-nightly/ws/webapp/src/test/resources>
[INFO] Copying 3 resources
[INFO] 
[INFO] --- scala-maven-plugin:3.2.0:testCompile (scala-test-compile-first) @ atlas-webapp
---
[WARNING] Zinc server is not available at port 3030 - reverting to normal incremental compile
[INFO] Using incremental compilation
[INFO] Compiling 22 Java sources to <https://builds.apache.org/job/apache-atlas-nightly/ws/webapp/target/test-classes...>
[INFO] 
[INFO] --- maven-compiler-plugin:3.1:testCompile (default-testCompile) @ atlas-webapp ---
[INFO] Changes detected - recompiling the module!
[INFO] Compiling 22 source files to <https://builds.apache.org/job/apache-atlas-nightly/ws/webapp/target/test-classes>
[INFO] 
[INFO] --- maven-war-plugin:2.4:war (default-war) @ atlas-webapp ---
[INFO] Packaging webapp
[INFO] Assembling webapp [atlas-webapp] in [<https://builds.apache.org/job/apache-atlas-nightly/ws/webapp/target/atlas-webapp-0.6-incubating-SNAPSHOT]>
[INFO] Processing overlay [ id org.apache.atlas:dashboard]
[INFO] Processing war project
[INFO] Copying webapp resources [<https://builds.apache.org/job/apache-atlas-nightly/ws/webapp/src/main/webapp]>
[INFO] Webapp assembled in [665 msecs]
[INFO] Building war: <https://builds.apache.org/job/apache-atlas-nightly/ws/webapp/target/atlas-webapp-0.6-incubating-SNAPSHOT.war>
[INFO] Packaging classes
[INFO] Building jar: <https://builds.apache.org/job/apache-atlas-nightly/ws/webapp/target/atlas-webapp-0.6-incubating-SNAPSHOT-classes.jar>
[INFO] 
[INFO] --- maven-site-plugin:3.4:attach-descriptor (attach-descriptor) @ atlas-webapp ---
[INFO] 
[INFO] >>> maven-javadoc-plugin:2.8.1:javadoc (javadoc) @ atlas-webapp >>>
[INFO] 
[INFO] --- buildnumber-maven-plugin:1.0:create (default) @ atlas-webapp ---
[INFO] Checking for local modifications: skipped.
[INFO] Updating project files from SCM: skipped.
[WARNING] Cannot get the revision information from the scm repository, proceeding with revision
of release : 
No such provider: 'https'.
[INFO] Storing buildNumber: release at timestamp: 1444686001802
[WARNING] Cannot get the branch information from the scm repository, proceeding with UNKNOWN_BRANCH
: 
No such provider: 'https'.
[INFO] Storing buildScmBranch: UNKNOWN_BRANCH
[INFO] 
[INFO] <<< maven-javadoc-plugin:2.8.1:javadoc (javadoc) @ atlas-webapp <<<
[INFO] 
[INFO] --- maven-javadoc-plugin:2.8.1:javadoc (javadoc) @ atlas-webapp ---
[INFO] Skipping javadoc generation
[INFO] 
[INFO] --- maven-surefire-plugin:2.18.1:test (default-test) @ atlas-webapp ---
[WARNING] The parameter forkMode is deprecated since version 2.14. Use forkCount and reuseForks
instead.
[INFO] Surefire report directory: <https://builds.apache.org/job/apache-atlas-nightly/ws/webapp/target/surefire-reports>
[INFO] Using configured provider org.apache.maven.surefire.testng.TestNGProvider
[WARNING] file.encoding cannot be set as system property, use <argLine>-Dfile.encoding=...<argLine>
instead

-------------------------------------------------------
 T E S T S
-------------------------------------------------------
Running org.apache.atlas.web.service.SecureEmbeddedServerTest
Tests run: 4, Failures: 0, Errors: 0, Skipped: 0, Time elapsed: 22.34 sec - in org.apache.atlas.web.service.SecureEmbeddedServerTest
Running org.apache.atlas.web.security.SSLAndKerberosTest
Tests run: 1, Failures: 1, Errors: 0, Skipped: 0, Time elapsed: 13.416 sec <<< FAILURE!
- in org.apache.atlas.web.security.SSLAndKerberosTest
testService(org.apache.atlas.web.security.SSLAndKerberosTest)  Time elapsed: 0.263 sec  <<<
FAILURE!
com.sun.jersey.api.client.ClientHandlerException: java.io.IOException: org.apache.hadoop.security.authentication.client.AuthenticationException:
Authentication failed, status: 503, message: Service Unavailable
	at org.apache.hadoop.security.authentication.client.AuthenticatedURL.extractToken(AuthenticatedURL.java:275)
	at org.apache.hadoop.security.authentication.client.PseudoAuthenticator.authenticate(PseudoAuthenticator.java:77)
	at org.apache.hadoop.security.token.delegation.web.DelegationTokenAuthenticator.authenticate(DelegationTokenAuthenticator.java:128)
	at org.apache.hadoop.security.authentication.client.KerberosAuthenticator.authenticate(KerberosAuthenticator.java:214)
	at org.apache.hadoop.security.token.delegation.web.DelegationTokenAuthenticator.authenticate(DelegationTokenAuthenticator.java:128)
	at org.apache.hadoop.security.authentication.client.AuthenticatedURL.openConnection(AuthenticatedURL.java:215)
	at org.apache.hadoop.security.token.delegation.web.DelegationTokenAuthenticatedURL.openConnection(DelegationTokenAuthenticatedURL.java:322)
	at org.apache.atlas.security.SecureClientUtils$1$1.run(SecureClientUtils.java:102)
	at org.apache.atlas.security.SecureClientUtils$1$1.run(SecureClientUtils.java:98)
	at java.security.AccessController.doPrivileged(Native Method)
	at javax.security.auth.Subject.doAs(Subject.java:415)
	at org.apache.hadoop.security.UserGroupInformation.doAs(UserGroupInformation.java:1657)
	at org.apache.atlas.security.SecureClientUtils$1.getHttpURLConnection(SecureClientUtils.java:98)
	at com.sun.jersey.client.urlconnection.URLConnectionClientHandler._invoke(URLConnectionClientHandler.java:159)
	at com.sun.jersey.client.urlconnection.URLConnectionClientHandler.handle(URLConnectionClientHandler.java:147)
	at com.sun.jersey.api.client.Client.handle(Client.java:648)
	at com.sun.jersey.api.client.WebResource.handle(WebResource.java:670)
	at com.sun.jersey.api.client.WebResource.access$200(WebResource.java:74)
	at com.sun.jersey.api.client.WebResource$Builder.method(WebResource.java:623)
	at org.apache.atlas.AtlasClient.callAPIWithResource(AtlasClient.java:445)
	at org.apache.atlas.AtlasClient.callAPI(AtlasClient.java:464)
	at org.apache.atlas.AtlasClient.listTypes(AtlasClient.java:190)
	at org.apache.atlas.web.security.SSLAndKerberosTest.testService(SSLAndKerberosTest.java:160)

Running org.apache.atlas.web.security.NegativeSSLAndKerberosTest
Tests run: 1, Failures: 0, Errors: 0, Skipped: 0, Time elapsed: 20.148 sec - in org.apache.atlas.web.security.NegativeSSLAndKerberosTest
Running org.apache.atlas.web.security.SSLTest
Tests run: 1, Failures: 0, Errors: 0, Skipped: 0, Time elapsed: 16.49 sec - in org.apache.atlas.web.security.SSLTest
Running org.apache.atlas.web.listeners.TestGuiceServletConfig$1
Tests run: 0, Failures: 0, Errors: 0, Skipped: 0, Time elapsed: 0.217 sec - in org.apache.atlas.web.listeners.TestGuiceServletConfig$1
Running org.apache.atlas.web.listeners.TestGuiceServletConfig
Tests run: 0, Failures: 0, Errors: 0, Skipped: 0, Time elapsed: 0.219 sec - in org.apache.atlas.web.listeners.TestGuiceServletConfig
Running org.apache.atlas.web.TestUtils
Tests run: 0, Failures: 0, Errors: 0, Skipped: 0, Time elapsed: 0.196 sec - in org.apache.atlas.web.TestUtils

Results :

Failed tests: 
  SSLAndKerberosTest.testService:160 » ClientHandler java.io.IOException: org.ap...

Tests run: 7, Failures: 1, Errors: 0, Skipped: 0

[INFO] ------------------------------------------------------------------------
[INFO] Reactor Summary:
[INFO] 
[INFO] apache-atlas ...................................... SUCCESS [  8.977 s]
[INFO] Apache Atlas Typesystem ........................... SUCCESS [01:11 min]
[INFO] Apache Atlas Common ............................... SUCCESS [  9.013 s]
[INFO] Apache Atlas Client ............................... SUCCESS [ 14.584 s]
[INFO] Apache Atlas Notification ......................... SUCCESS [ 17.132 s]
[INFO] Apache Atlas Repository ........................... SUCCESS [05:21 min]
[INFO] Apache Atlas UI ................................... SUCCESS [01:01 min]
[INFO] Apache Atlas Web Application ...................... FAILURE [01:34 min]
[INFO] Apache Atlas Documentation ........................ SKIPPED
[INFO] Apache Atlas Hive Bridge .......................... SKIPPED
[INFO] Apache Atlas Distribution ......................... SKIPPED
[INFO] ------------------------------------------------------------------------
[INFO] BUILD FAILURE
[INFO] ------------------------------------------------------------------------
[INFO] Total time: 10:00 min
[INFO] Finished at: 2015-10-12T21:41:17+00:00
[INFO] Final Memory: 132M/1367M
[INFO] ------------------------------------------------------------------------
[ERROR] Failed to execute goal org.apache.maven.plugins:maven-surefire-plugin:2.18.1:test
(default-test) on project atlas-webapp: There are test failures.
[ERROR] 
[ERROR] Please refer to <https://builds.apache.org/job/apache-atlas-nightly/ws/webapp/target/surefire-reports>
for the individual test results.
[ERROR] -> [Help 1]
[ERROR] 
[ERROR] To see the full stack trace of the errors, re-run Maven with the -e switch.
[ERROR] Re-run Maven using the -X switch to enable full debug logging.
[ERROR] 
[ERROR] For more information about the errors and possible solutions, please read the following
articles:
[ERROR] [Help 1] http://cwiki.apache.org/confluence/display/MAVEN/MojoFailureException
[ERROR] 
[ERROR] After correcting the problems, you can resume the build with the command
[ERROR]   mvn <goals> -rf :atlas-webapp
Build step 'Execute shell' marked build as failure
[CHECKSTYLE] Collecting checkstyle analysis files...
[CHECKSTYLE] Finding all files that match the pattern **/target/checkstyle-result.xml
[CHECKSTYLE] Parsing 9 files in <https://builds.apache.org/job/apache-atlas-nightly/ws/>
[CHECKSTYLE] Successfully parsed file <https://builds.apache.org/job/apache-atlas-nightly/ws/client/target/checkstyle-result.xml>
with 27 unique warnings and 0 duplicates.
[CHECKSTYLE] Successfully parsed file <https://builds.apache.org/job/apache-atlas-nightly/ws/common/target/checkstyle-result.xml>
with 31 unique warnings and 0 duplicates.
[CHECKSTYLE] Successfully parsed file <https://builds.apache.org/job/apache-atlas-nightly/ws/dashboard/target/checkstyle-result.xml>
with 31 unique warnings and 0 duplicates.
[CHECKSTYLE] Successfully parsed file <https://builds.apache.org/job/apache-atlas-nightly/ws/distro/target/checkstyle-result.xml>
with 31 unique warnings and 0 duplicates.
[CHECKSTYLE] Successfully parsed file <https://builds.apache.org/job/apache-atlas-nightly/ws/docs/target/checkstyle-result.xml>
with 31 unique warnings and 0 duplicates.
[CHECKSTYLE] Successfully parsed file <https://builds.apache.org/job/apache-atlas-nightly/ws/notification/target/checkstyle-result.xml>
with 56 unique warnings and 0 duplicates.
[CHECKSTYLE] Successfully parsed file <https://builds.apache.org/job/apache-atlas-nightly/ws/repository/target/checkstyle-result.xml>
with 413 unique warnings and 0 duplicates.
[CHECKSTYLE] Successfully parsed file <https://builds.apache.org/job/apache-atlas-nightly/ws/target/checkstyle-result.xml>
with 413 unique warnings and 0 duplicates.
[CHECKSTYLE] Successfully parsed file <https://builds.apache.org/job/apache-atlas-nightly/ws/typesystem/target/checkstyle-result.xml>
with 980 unique warnings and 0 duplicates.
[CHECKSTYLE] Computing warning deltas based on reference build #80
[FINDBUGS] Collecting findbugs analysis files...
[FINDBUGS] Finding all files that match the pattern **/target/findbugs.xml
[FINDBUGS] Parsing 5 files in <https://builds.apache.org/job/apache-atlas-nightly/ws/>
[FINDBUGS] Successfully parsed file <https://builds.apache.org/job/apache-atlas-nightly/ws/client/target/findbugs.xml>
with 0 unique warnings and 0 duplicates.
[FINDBUGS] Successfully parsed file <https://builds.apache.org/job/apache-atlas-nightly/ws/common/target/findbugs.xml>
with 0 unique warnings and 0 duplicates.
[FINDBUGS] Successfully parsed file <https://builds.apache.org/job/apache-atlas-nightly/ws/notification/target/findbugs.xml>
with 0 unique warnings and 0 duplicates.
[FINDBUGS] Successfully parsed file <https://builds.apache.org/job/apache-atlas-nightly/ws/repository/target/findbugs.xml>
with 0 unique warnings and 0 duplicates.
[FINDBUGS] Successfully parsed file <https://builds.apache.org/job/apache-atlas-nightly/ws/typesystem/target/findbugs.xml>
with 0 unique warnings and 0 duplicates.
[FINDBUGS] Computing warning deltas based on reference build #80
Archiving artifacts
Recording test results
TestNG Reports Processing: START
Looking for TestNG results report in workspace using pattern: **/target/surefire-reports/testng-results.xml
Saving reports...
Processing '/x1/jenkins/jenkins-home/jobs/apache-atlas-nightly/builds/94/testng/testng-results-1.xml'
Processing '/x1/jenkins/jenkins-home/jobs/apache-atlas-nightly/builds/94/testng/testng-results-2.xml'
Processing '/x1/jenkins/jenkins-home/jobs/apache-atlas-nightly/builds/94/testng/testng-results-3.xml'
Processing '/x1/jenkins/jenkins-home/jobs/apache-atlas-nightly/builds/94/testng/testng-results.xml'
TestNG Reports Processing: FINISH

Mime
View raw message