atlas-dev mailing list archives

Site index · List index
Message view « Date » · « Thread »
Top « Date » · « Thread »
From Apache Jenkins Server <jenk...@builds.apache.org>
Subject Build failed in Jenkins: apache-atlas-nightly #90
Date Sun, 11 Oct 2015 04:06:09 GMT
See <https://builds.apache.org/job/apache-atlas-nightly/90/changes>

Changes:

[sumasai.shivaprasad] ATLAS-159 Added empty overlag tag for current build(sanjayp via sumasai)

------------------------------------------
[...truncated 3618 lines...]
[INFO] bower extract archive.tar.gz
[INFO] bower resolved git://github.com/angular/bower-angular-route.git#1.2.29
[INFO] bower extract archive.tar.gz
[INFO] bower resolved git://github.com/angular/bower-angular.git#1.2.29
[INFO] bower extract archive.tar.gz
[INFO] bower resolved git://github.com/angular-ui/bootstrap-bower.git#0.12.1
[INFO] bower extract archive.tar.gz
[INFO] bower extract archive.tar.gz
[INFO] bower invalid-meta angular-ui-utils is missing "ignore" entry in bower.json
[INFO] bower resolved git://github.com/angular-ui/ui-utils.git#0.1.1
[INFO] bower extract archive.tar.gz
[INFO] bower extract archive.tar.gz
[INFO] bower extract archive.tar.gz
[INFO] bower extract archive.tar.gz
[INFO] bower resolved git://github.com/lodash/lodash.git#3.0.1
[INFO] bower resolved git://github.com/angular-ui/ui-router.git#0.2.15
[INFO] bower resolved git://github.com/twbs/bootstrap.git#3.1.1
[INFO] bower not-cached git://github.com/jquery/jquery.git#>= 1.9.0
[INFO] bower resolve git://github.com/jquery/jquery.git#>= 1.9.0
[INFO] bower download https://github.com/jquery/jquery/archive/2.1.4.tar.gz
[INFO] bower resolved git://github.com/mbostock/d3.git#3.5.6
[INFO] bower not-cached git://github.com/mbostock/d3.git#3.5.5
[INFO] bower resolve git://github.com/mbostock/d3.git#3.5.5
[INFO] bower download https://github.com/mbostock/d3/archive/v3.5.5.tar.gz
[INFO] bower resolved git://github.com/FortAwesome/Font-Awesome.git#4.2.0
[INFO] bower extract archive.tar.gz
[INFO] bower resolved git://github.com/jquery/jquery.git#2.1.4
[INFO] bower extract archive.tar.gz
[INFO] bower resolved git://github.com/mbostock/d3.git#3.5.5
[INFO] bower extra-resolution Unnecessary resolution: d3#~3.5.3
[INFO] bower install closure-compiler#e-tag:469db
[INFO] bower install ng-closure-runner#e-tag:91da43ccc
[INFO] bower install angular-resource#1.2.29
[INFO] bower install angular-cookies#1.2.29
[INFO] bower install angular-sanitize#1.2.29
[INFO] bower install d3-tip#0.6.7
[INFO] bower install angular-route#1.2.29
[INFO] bower install angular#1.2.29
[INFO] bower install angular-bootstrap#0.12.1
[INFO] bower install angular-ui-utils#0.1.1
[INFO] bower install lodash#3.0.1
[INFO] bower install angular-ui-router#0.2.15
[INFO] bower install bootstrap#3.1.1
[INFO] bower install d3#3.5.5
[INFO] bower install font-awesome#4.2.0
[INFO] bower install jquery#2.1.4
[INFO] >> Installed bower packages
[INFO] grunt-bower copying dist/lib/angular-cookies/angular-cookies.js -> .bower-components/angular-cookies/angular-cookies.js
[INFO] grunt-bower copying dist/lib/angular-bootstrap/ui-bootstrap-tpls.js -> .bower-components/angular-bootstrap/ui-bootstrap-tpls.js
[INFO] grunt-bower copying dist/lib/angular-resource/angular-resource.js -> .bower-components/angular-resource/angular-resource.js
[INFO] grunt-bower copying dist/lib/angular-route/angular-route.js -> .bower-components/angular-route/angular-route.js
[INFO] grunt-bower copying dist/lib/angular-sanitize/angular-sanitize.js -> .bower-components/angular-sanitize/angular-sanitize.js
[INFO] grunt-bower copying dist/lib/angular-ui-router/release/angular-ui-router.js -> .bower-components/angular-ui-router/angular-ui-router.js
[INFO] grunt-bower copying dist/lib/angular-ui-utils/ui-utils.js -> .bower-components/angular-ui-utils/ui-utils.js
[INFO] grunt-bower copying dist/lib/angular/angular.js -> .bower-components/angular/angular.js
[INFO] grunt-bower copying dist/lib/bootstrap/dist/css/bootstrap.css -> .bower-components/bootstrap/bootstrap.css
[INFO] grunt-bower copying dist/lib/bootstrap/dist/js/bootstrap.js -> .bower-components/bootstrap/bootstrap.js
[INFO] grunt-bower copying dist/lib/bootstrap/dist/fonts/glyphicons-halflings-regular.eot
-> .bower-components/bootstrap/glyphicons-halflings-regular.eot
[INFO] grunt-bower copying dist/lib/bootstrap/dist/fonts/glyphicons-halflings-regular.svg
-> .bower-components/bootstrap/glyphicons-halflings-regular.svg
[INFO] grunt-bower copying dist/lib/bootstrap/dist/fonts/glyphicons-halflings-regular.ttf
-> .bower-components/bootstrap/glyphicons-halflings-regular.ttf
[INFO] grunt-bower copying dist/lib/bootstrap/dist/fonts/glyphicons-halflings-regular.woff
-> .bower-components/bootstrap/glyphicons-halflings-regular.woff
[INFO] grunt-bower copying  dir dist/lib/closure-compiler -> .bower-components/closure-compiler
[INFO] grunt-bower copying dist/lib/d3-tip/index.js -> .bower-components/d3-tip/index.js
[INFO] grunt-bower copying dist/lib/d3/d3.js -> .bower-components/d3/d3.js
[INFO] grunt-bower copying dist/lib/jquery/dist/jquery.js -> .bower-components/jquery/jquery.js
[INFO] grunt-bower copying dist/lib/font-awesome/css/font-awesome.css -> .bower-components/font-awesome/font-awesome.css
[INFO] grunt-bower copying dist/lib/font-awesome/fonts/FontAwesome.otf -> .bower-components/font-awesome/FontAwesome.otf
[INFO] grunt-bower copying dist/lib/font-awesome/fonts/fontawesome-webfont.eot -> .bower-components/font-awesome/fontawesome-webfont.eot
[INFO] grunt-bower copying dist/lib/font-awesome/fonts/fontawesome-webfont.svg -> .bower-components/font-awesome/fontawesome-webfont.svg
[INFO] grunt-bower copying dist/lib/font-awesome/fonts/fontawesome-webfont.ttf -> .bower-components/font-awesome/fontawesome-webfont.ttf
[INFO] grunt-bower copying dist/lib/font-awesome/fonts/fontawesome-webfont.woff -> .bower-components/font-awesome/fontawesome-webfont.woff
[INFO] grunt-bower copying dist/lib/lodash/lodash.js -> .bower-components/lodash/lodash.js
[INFO] grunt-bower copying  dir dist/lib/ng-closure-runner -> .bower-components/ng-closure-runner
[INFO] >> Copied packages to <https://builds.apache.org/job/apache-atlas-nightly/ws/dashboard/target/.bower-components>
[INFO] 
[INFO] Done, without errors.
[INFO] 
[INFO] --- frontend-maven-plugin:0.0.23:npm (npm remaining) @ dashboard ---
[INFO] Running 'npm install --ignore-scripts --color=false' in <https://builds.apache.org/job/apache-atlas-nightly/ws/dashboard/target>
[INFO] 
[INFO] --- frontend-maven-plugin:0.0.23:grunt (grunt dist) @ dashboard ---
[INFO] Running 'grunt build --no-color' in <https://builds.apache.org/job/apache-atlas-nightly/ws/dashboard/target>
[INFO] Running "copy:dist" (copy) task
[INFO] Created 25 directories, copied 39 files
[INFO] 
[INFO] Running "minify" task
[INFO] 
[INFO] Running "shell:min" (shell) task
[INFO] 
[INFO] Done, without errors.
[INFO] 
[INFO] --- maven-resources-plugin:2.7:resources (default-resources) @ dashboard ---
[INFO] Using 'UTF-8' encoding to copy filtered resources.
[INFO] skip non existing resourceDirectory <https://builds.apache.org/job/apache-atlas-nightly/ws/dashboard/src/main/resources>
[INFO] Copying 2 resources to META-INF
[INFO] Copying 3 resources
[INFO] 
[INFO] --- scala-maven-plugin:3.2.0:compile (scala-compile-first) @ dashboard ---
[INFO] No sources to compile
[INFO] 
[INFO] --- maven-compiler-plugin:3.1:compile (default-compile) @ dashboard ---
[INFO] No sources to compile
[INFO] 
[INFO] --- maven-resources-plugin:2.7:testResources (default-testResources) @ dashboard ---
[INFO] Using 'UTF-8' encoding to copy filtered resources.
[INFO] skip non existing resourceDirectory <https://builds.apache.org/job/apache-atlas-nightly/ws/dashboard/src/test/resources>
[INFO] Copying 3 resources
[INFO] 
[INFO] --- scala-maven-plugin:3.2.0:testCompile (scala-test-compile-first) @ dashboard ---
[INFO] No sources to compile
[INFO] 
[INFO] --- maven-compiler-plugin:3.1:testCompile (default-testCompile) @ dashboard ---
[INFO] No sources to compile
[INFO] 
[INFO] --- maven-surefire-plugin:2.18.1:test (default-test) @ dashboard ---
[WARNING] The parameter forkMode is deprecated since version 2.14. Use forkCount and reuseForks
instead.
[INFO] 
[INFO] --- maven-war-plugin:2.4:war (default-war) @ dashboard ---
[INFO] Packaging webapp
[INFO] Assembling webapp [dashboard] in [<https://builds.apache.org/job/apache-atlas-nightly/ws/dashboard/target/dashboard-0.6-incubating-SNAPSHOT]>
[INFO] Processing war project
[INFO] Copying webapp webResources [<https://builds.apache.org/job/apache-atlas-nightly/ws/dashboard/target/dist]>
to [<https://builds.apache.org/job/apache-atlas-nightly/ws/dashboard/target/dashboard-0.6-incubating-SNAPSHOT]>
[INFO] Webapp assembled in [169 msecs]
[INFO] Building war: <https://builds.apache.org/job/apache-atlas-nightly/ws/dashboard/target/dashboard-0.6-incubating-SNAPSHOT.war>
[INFO] 
[INFO] --- maven-site-plugin:3.4:attach-descriptor (attach-descriptor) @ dashboard ---
[INFO] 
[INFO] >>> maven-javadoc-plugin:2.8.1:javadoc (javadoc) @ dashboard >>>
[INFO] 
[INFO] --- buildnumber-maven-plugin:1.0:create (default) @ dashboard ---
[INFO] Checking for local modifications: skipped.
[INFO] Updating project files from SCM: skipped.
[WARNING] Cannot get the revision information from the scm repository, proceeding with revision
of release : 
No such provider: 'https'.
[INFO] Storing buildNumber: release at timestamp: 1444536312247
[WARNING] Cannot get the branch information from the scm repository, proceeding with UNKNOWN_BRANCH
: 
No such provider: 'https'.
[INFO] Storing buildScmBranch: UNKNOWN_BRANCH
[INFO] 
[INFO] --- maven-resources-plugin:2.7:copy-resources (copy-resources) @ dashboard ---
[INFO] Using 'UTF-8' encoding to copy filtered resources.
[INFO] Copying 4 resources
[INFO] 
[INFO] <<< maven-javadoc-plugin:2.8.1:javadoc (javadoc) @ dashboard <<<
[INFO] 
[INFO] --- maven-javadoc-plugin:2.8.1:javadoc (javadoc) @ dashboard ---
[INFO] Skipping javadoc generation
[INFO] 
[INFO] --- maven-failsafe-plugin:2.18.1:integration-test (integration-test) @ dashboard ---
[INFO] 
[INFO] --- maven-failsafe-plugin:2.18.1:verify (verify) @ dashboard ---
[INFO] Failsafe report directory: <https://builds.apache.org/job/apache-atlas-nightly/ws/dashboard/target/failsafe-reports>
[INFO] 
[INFO] --- apache-rat-plugin:0.7:check (rat-check) @ dashboard ---
[INFO] Exclude: *.txt
[INFO] Exclude: **/*.json
[INFO] Exclude: .pc/**
[INFO] Exclude: debian/**
[INFO] Exclude: .svn/**
[INFO] Exclude: .git/**
[INFO] Exclude: .gitignore
[INFO] Exclude: **/.idea/**
[INFO] Exclude: **/*.twiki
[INFO] Exclude: **/*.iml
[INFO] Exclude: **/*.json
[INFO] Exclude: **/target/**
[INFO] Exclude: **/target*/**
[INFO] Exclude: **/build/**
[INFO] Exclude: **/*.patch
[INFO] Exclude: derby.log
[INFO] Exclude: **/logs/**
[INFO] Exclude: **/.classpath
[INFO] Exclude: **/.project
[INFO] Exclude: **/.settings/**
[INFO] Exclude: **/test-output/**
[INFO] Exclude: **/mock/**
[INFO] Exclude: **/data/**
[INFO] Exclude: **/maven-eclipse.xml
[INFO] Exclude: **/.externalToolBuilders/**
[INFO] Exclude: **/build.log
[INFO] Exclude: .bowerrc
[INFO] Exclude: *.json
[INFO] ------------------------------------------------------------------------
[INFO] Reactor Summary:
[INFO] 
[INFO] apache-atlas ...................................... SUCCESS [ 11.335 s]
[INFO] Apache Atlas Typesystem ........................... SUCCESS [01:11 min]
[INFO] Apache Atlas Common ............................... SUCCESS [  7.468 s]
[INFO] Apache Atlas Client ............................... SUCCESS [ 15.736 s]
[INFO] Apache Atlas Notification ......................... SUCCESS [ 16.749 s]
[INFO] Apache Atlas Repository ........................... SUCCESS [05:09 min]
[INFO] Apache Atlas UI ................................... FAILURE [02:33 min]
[INFO] Apache Atlas Web Application ...................... SKIPPED
[INFO] Apache Atlas Documentation ........................ SKIPPED
[INFO] Apache Atlas Hive Bridge .......................... SKIPPED
[INFO] Apache Atlas Distribution ......................... SKIPPED
[INFO] ------------------------------------------------------------------------
[INFO] BUILD FAILURE
[INFO] ------------------------------------------------------------------------
[INFO] Total time: 09:47 min
[INFO] Finished at: 2015-10-11T04:06:42+00:00
[INFO] Final Memory: 126M/1265M
[INFO] ------------------------------------------------------------------------
[ERROR] Failed to execute goal org.apache.rat:apache-rat-plugin:0.7:check (rat-check) on project
dashboard: Too many unapproved licenses: 15094 -> [Help 1]
[ERROR] 
[ERROR] To see the full stack trace of the errors, re-run Maven with the -e switch.
[ERROR] Re-run Maven using the -X switch to enable full debug logging.
[ERROR] 
[ERROR] For more information about the errors and possible solutions, please read the following
articles:
[ERROR] [Help 1] http://cwiki.apache.org/confluence/display/MAVEN/MojoFailureException
[ERROR] 
[ERROR] After correcting the problems, you can resume the build with the command
[ERROR]   mvn <goals> -rf :dashboard
Build step 'Execute shell' marked build as failure
[CHECKSTYLE] Collecting checkstyle analysis files...
[CHECKSTYLE] Finding all files that match the pattern **/target/checkstyle-result.xml
[CHECKSTYLE] Parsing 10 files in <https://builds.apache.org/job/apache-atlas-nightly/ws/>
[CHECKSTYLE] Successfully parsed file <https://builds.apache.org/job/apache-atlas-nightly/ws/addons/hive-bridge/target/checkstyle-result.xml>
with 130 unique warnings and 0 duplicates.
[CHECKSTYLE] Successfully parsed file <https://builds.apache.org/job/apache-atlas-nightly/ws/client/target/checkstyle-result.xml>
with 157 unique warnings and 0 duplicates.
[CHECKSTYLE] Successfully parsed file <https://builds.apache.org/job/apache-atlas-nightly/ws/common/target/checkstyle-result.xml>
with 161 unique warnings and 0 duplicates.
[CHECKSTYLE] Successfully parsed file <https://builds.apache.org/job/apache-atlas-nightly/ws/distro/target/checkstyle-result.xml>
with 161 unique warnings and 0 duplicates.
[CHECKSTYLE] Successfully parsed file <https://builds.apache.org/job/apache-atlas-nightly/ws/docs/target/checkstyle-result.xml>
with 161 unique warnings and 0 duplicates.
[CHECKSTYLE] Successfully parsed file <https://builds.apache.org/job/apache-atlas-nightly/ws/notification/target/checkstyle-result.xml>
with 186 unique warnings and 0 duplicates.
[CHECKSTYLE] Successfully parsed file <https://builds.apache.org/job/apache-atlas-nightly/ws/repository/target/checkstyle-result.xml>
with 543 unique warnings and 0 duplicates.
[CHECKSTYLE] Successfully parsed file <https://builds.apache.org/job/apache-atlas-nightly/ws/target/checkstyle-result.xml>
with 543 unique warnings and 0 duplicates.
[CHECKSTYLE] Successfully parsed file <https://builds.apache.org/job/apache-atlas-nightly/ws/typesystem/target/checkstyle-result.xml>
with 1110 unique warnings and 0 duplicates.
[CHECKSTYLE] Successfully parsed file <https://builds.apache.org/job/apache-atlas-nightly/ws/webapp/target/checkstyle-result.xml>
with 1264 unique warnings and 0 duplicates.
[CHECKSTYLE] Computing warning deltas based on reference build #80
[FINDBUGS] Collecting findbugs analysis files...
[FINDBUGS] Finding all files that match the pattern **/target/findbugs.xml
[FINDBUGS] Parsing 7 files in <https://builds.apache.org/job/apache-atlas-nightly/ws/>
[FINDBUGS] Successfully parsed file <https://builds.apache.org/job/apache-atlas-nightly/ws/addons/hive-bridge/target/findbugs.xml>
with 0 unique warnings and 0 duplicates.
[FINDBUGS] Successfully parsed file <https://builds.apache.org/job/apache-atlas-nightly/ws/client/target/findbugs.xml>
with 0 unique warnings and 0 duplicates.
[FINDBUGS] Successfully parsed file <https://builds.apache.org/job/apache-atlas-nightly/ws/common/target/findbugs.xml>
with 0 unique warnings and 0 duplicates.
[FINDBUGS] Successfully parsed file <https://builds.apache.org/job/apache-atlas-nightly/ws/notification/target/findbugs.xml>
with 0 unique warnings and 0 duplicates.
[FINDBUGS] Successfully parsed file <https://builds.apache.org/job/apache-atlas-nightly/ws/repository/target/findbugs.xml>
with 0 unique warnings and 0 duplicates.
[FINDBUGS] Successfully parsed file <https://builds.apache.org/job/apache-atlas-nightly/ws/typesystem/target/findbugs.xml>
with 0 unique warnings and 0 duplicates.
[FINDBUGS] Successfully parsed file <https://builds.apache.org/job/apache-atlas-nightly/ws/webapp/target/findbugs.xml>
with 0 unique warnings and 0 duplicates.
[FINDBUGS] Computing warning deltas based on reference build #80
Archiving artifacts
Recording test results
TestNG Reports Processing: START
Looking for TestNG results report in workspace using pattern: **/target/surefire-reports/testng-results.xml
testng-results.xml was last modified before this build started. Ignoring it.
Saving reports...
Processing '/x1/jenkins/jenkins-home/jobs/apache-atlas-nightly/builds/90/testng/testng-results-1.xml'
Processing '/x1/jenkins/jenkins-home/jobs/apache-atlas-nightly/builds/90/testng/testng-results-2.xml'
Processing '/x1/jenkins/jenkins-home/jobs/apache-atlas-nightly/builds/90/testng/testng-results.xml'
TestNG Reports Processing: FINISH

Mime
View raw message