atlas-dev mailing list archives

Site index · List index
Message view « Date » · « Thread »
Top « Date » · « Thread »
From Apache Jenkins Server <jenk...@builds.apache.org>
Subject Build failed in Jenkins: apache-atlas-nightly #74
Date Tue, 22 Sep 2015 13:06:28 GMT
See <https://builds.apache.org/job/apache-atlas-nightly/74/changes>

Changes:

[sshivalingamurthy] ATLAS-147 Fix a code issue when defineTypes (ltfxyz via shwethags)

------------------------------------------
Started by an SCM change
Started by an SCM change
Started by an SCM change
[EnvInject] - Loading node environment variables.
Building remotely on H0 (Hadoop Tez) in workspace <https://builds.apache.org/job/apache-atlas-nightly/ws/>
 > git rev-parse --is-inside-work-tree # timeout=10
Fetching changes from the remote Git repository
 > git config remote.origin.url http://git-wip-us.apache.org/repos/asf/incubator-atlas.git
# timeout=10
Fetching upstream changes from http://git-wip-us.apache.org/repos/asf/incubator-atlas.git
 > git --version # timeout=10
 > git fetch --tags --progress http://git-wip-us.apache.org/repos/asf/incubator-atlas.git
+refs/heads/*:refs/remotes/origin/*
 > git rev-parse refs/remotes/origin/master^{commit} # timeout=10
 > git rev-parse refs/remotes/origin/origin/master^{commit} # timeout=10
Checking out Revision c3453f60af575c7ec8e830b629280931b5e72e2d (refs/remotes/origin/master)
 > git config core.sparsecheckout # timeout=10
 > git checkout -f c3453f60af575c7ec8e830b629280931b5e72e2d
 > git rev-list 1bfda02a11762cee733bf5c5b1b82e1e256acda0 # timeout=10
[apache-atlas-nightly] $ /bin/bash -xe /tmp/hudson2945238184833656462.sh
+ JAVA_HOME=/home/jenkins/tools/java/jdk1.7.0-64
+ MAVEN_HOME=/home/jenkins/tools/maven/latest
+ PATH=/home/jenkins/tools/java/jdk1.7.0-64/bin:/home/jenkins/tools/java/latest1.7/bin:/usr/local/sbin:/usr/local/bin:/usr/sbin:/usr/bin:/sbin:/bin:/usr/games:/usr/local/games
+ export 'MAVEN_OPTS=-Xmx4096m -XX:MaxPermSize=1024m -Dfile.encoding=UTF-8 -noverify'
+ MAVEN_OPTS='-Xmx4096m -XX:MaxPermSize=1024m -Dfile.encoding=UTF-8 -noverify'
+ /home/jenkins/tools/maven/latest/bin/mvn clean verify -Drat.numUnapprovedLicenses=100 -Dfile.encoding=UTF-8
[INFO] Scanning for projects...
[WARNING] 
[WARNING] Some problems were encountered while building the effective model for org.apache.atlas:atlas-webapp:war:0.6-incubating-SNAPSHOT
[WARNING] 'build.plugins.plugin.version' for org.codehaus.mojo:keytool-maven-plugin is missing.
@ line 396, column 21
[WARNING] 
[WARNING] It is highly recommended to fix these problems because they threaten the stability
of your build.
[WARNING] 
[WARNING] For this reason, future Maven versions might no longer support building such malformed
projects.
[WARNING] 
[INFO] ------------------------------------------------------------------------
[INFO] Reactor Build Order:
[INFO] 
[INFO] apache-atlas
[INFO] Apache Atlas Typesystem
[INFO] Apache Atlas Common
[INFO] Apache Atlas Client
[INFO] Apache Atlas Notification
[INFO] Apache Atlas Repository
[INFO] Apache Atlas Web Application
[INFO] Apache Atlas Documentation
[INFO] Apache Atlas Hive Bridge
[INFO] Apache Atlas Distribution
[INFO] 
[INFO] Using the builder org.apache.maven.lifecycle.internal.builder.singlethreaded.SingleThreadedBuilder
with a thread count of 1
[INFO]                                                                         
[INFO] ------------------------------------------------------------------------
[INFO] Building apache-atlas 0.6-incubating-SNAPSHOT
[INFO] ------------------------------------------------------------------------
[INFO] 
[INFO] --- maven-clean-plugin:2.5:clean (default-clean) @ apache-atlas ---
[INFO] Deleting <https://builds.apache.org/job/apache-atlas-nightly/ws/target>
[INFO] Deleting <https://builds.apache.org/job/apache-atlas-nightly/ws/> (includes =
[**/*.pyc], excludes = [])
[INFO] 
[INFO] --- buildnumber-maven-plugin:1.0:create (default) @ apache-atlas ---
[INFO] Checking for local modifications: skipped.
[INFO] Updating project files from SCM: skipped.
[WARNING] Cannot get the revision information from the scm repository, proceeding with revision
of release : 
No such provider: 'https'.
[INFO] Storing buildNumber: release at timestamp: 1442927102827
[WARNING] Cannot get the branch information from the scm repository, proceeding with UNKNOWN_BRANCH
: 
No such provider: 'https'.
[INFO] Storing buildScmBranch: UNKNOWN_BRANCH
[INFO] 
[INFO] --- maven-remote-resources-plugin:1.4:process (default) @ apache-atlas ---
[INFO] 
[INFO] --- scala-maven-plugin:3.2.0:compile (scala-compile-first) @ apache-atlas ---
[INFO] No sources to compile
[INFO] 
[INFO] --- scala-maven-plugin:3.2.0:testCompile (scala-test-compile-first) @ apache-atlas
---
[INFO] No sources to compile
[INFO] 
[INFO] --- maven-site-plugin:3.3:attach-descriptor (attach-descriptor) @ apache-atlas ---
[INFO] 
[INFO] --- maven-failsafe-plugin:2.18.1:integration-test (integration-test) @ apache-atlas
---
[INFO] 
[INFO] --- maven-failsafe-plugin:2.18.1:verify (verify) @ apache-atlas ---
[INFO] Failsafe report directory: <https://builds.apache.org/job/apache-atlas-nightly/ws/target/failsafe-reports>
[INFO] 
[INFO] --- apache-rat-plugin:0.7:check (rat-check) @ apache-atlas ---
[INFO] Exclude: *.txt
[INFO] Exclude: **/*.json
[INFO] Exclude: .pc/**
[INFO] Exclude: debian/**
[INFO] Exclude: .svn/**
[INFO] Exclude: .git/**
[INFO] Exclude: .gitignore
[INFO] Exclude: **/.idea/**
[INFO] Exclude: **/*.twiki
[INFO] Exclude: **/*.iml
[INFO] Exclude: **/*.json
[INFO] Exclude: **/target/**
[INFO] Exclude: **/target*/**
[INFO] Exclude: **/build/**
[INFO] Exclude: **/*.patch
[INFO] Exclude: derby.log
[INFO] Exclude: **/logs/**
[INFO] Exclude: **/.classpath
[INFO] Exclude: **/.project
[INFO] Exclude: **/.settings/**
[INFO] Exclude: **/test-output/**
[INFO] Exclude: **/mock/**
[INFO] Exclude: **/data/**
[INFO] Exclude: **/maven-eclipse.xml
[INFO] Exclude: **/.externalToolBuilders/**
[INFO] Exclude: **/build.log
[INFO] Exclude: dashboard/.bower-*/**
[INFO] Exclude: dashboard/.bowerrc
[INFO] Exclude: dashboard/lib/**
[INFO] Exclude: dashboard/node*/**
[INFO] Exclude: dashboard/dist/**
[INFO] Exclude: dashboard/public/lib/**
[INFO] Exclude: dashboard/**/*.min.js*
[INFO] ------------------------------------------------------------------------
[INFO] Reactor Summary:
[INFO] 
[INFO] apache-atlas ...................................... FAILURE [01:23 min]
[INFO] Apache Atlas Typesystem ........................... SKIPPED
[INFO] Apache Atlas Common ............................... SKIPPED
[INFO] Apache Atlas Client ............................... SKIPPED
[INFO] Apache Atlas Notification ......................... SKIPPED
[INFO] Apache Atlas Repository ........................... SKIPPED
[INFO] Apache Atlas Web Application ...................... SKIPPED
[INFO] Apache Atlas Documentation ........................ SKIPPED
[INFO] Apache Atlas Hive Bridge .......................... SKIPPED
[INFO] Apache Atlas Distribution ......................... SKIPPED
[INFO] ------------------------------------------------------------------------
[INFO] BUILD FAILURE
[INFO] ------------------------------------------------------------------------
[INFO] Total time: 01:24 min
[INFO] Finished at: 2015-09-22T13:06:24+00:00
[INFO] Final Memory: 54M/1423M
[INFO] ------------------------------------------------------------------------
[ERROR] Failed to execute goal org.apache.rat:apache-rat-plugin:0.7:check (rat-check) on project
apache-atlas: Too many unapproved licenses: 15627 -> [Help 1]
[ERROR] 
[ERROR] To see the full stack trace of the errors, re-run Maven with the -e switch.
[ERROR] Re-run Maven using the -X switch to enable full debug logging.
[ERROR] 
[ERROR] For more information about the errors and possible solutions, please read the following
articles:
[ERROR] [Help 1] http://cwiki.apache.org/confluence/display/MAVEN/MojoFailureException
Build step 'Execute shell' marked build as failure
[CHECKSTYLE] Collecting checkstyle analysis files...
[CHECKSTYLE] Finding all files that match the pattern **/target/checkstyle-result.xml
[CHECKSTYLE] Parsing 8 files in <https://builds.apache.org/job/apache-atlas-nightly/ws/>
[CHECKSTYLE] Successfully parsed file <https://builds.apache.org/job/apache-atlas-nightly/ws/addons/hive-bridge/target/checkstyle-result.xml>
of module  with 117 warnings.
[CHECKSTYLE] Successfully parsed file <https://builds.apache.org/job/apache-atlas-nightly/ws/client/target/checkstyle-result.xml>
of module  with 30 warnings.
[CHECKSTYLE] Successfully parsed file <https://builds.apache.org/job/apache-atlas-nightly/ws/distro/target/checkstyle-result.xml>
of module  with 0 warnings.
[CHECKSTYLE] Successfully parsed file <https://builds.apache.org/job/apache-atlas-nightly/ws/docs/target/checkstyle-result.xml>
of module  with 0 warnings.
[CHECKSTYLE] Successfully parsed file <https://builds.apache.org/job/apache-atlas-nightly/ws/notification/target/checkstyle-result.xml>
of module  with 31 warnings.
[CHECKSTYLE] Successfully parsed file <https://builds.apache.org/job/apache-atlas-nightly/ws/repository/target/checkstyle-result.xml>
of module  with 567 warnings.
[CHECKSTYLE] Successfully parsed file <https://builds.apache.org/job/apache-atlas-nightly/ws/typesystem/target/checkstyle-result.xml>
of module  with 542 warnings.
[CHECKSTYLE] Successfully parsed file <https://builds.apache.org/job/apache-atlas-nightly/ws/webapp/target/checkstyle-result.xml>
of module  with 148 warnings.
[CHECKSTYLE] Computing warning deltas based on reference build #60
[FINDBUGS] Collecting findbugs analysis files...
[FINDBUGS] Finding all files that match the pattern **/target/findbugs.xml
[FINDBUGS] Parsing 6 files in <https://builds.apache.org/job/apache-atlas-nightly/ws/>
[FINDBUGS] Successfully parsed file <https://builds.apache.org/job/apache-atlas-nightly/ws/addons/hive-bridge/target/findbugs.xml>
of module  with 0 warnings.
[FINDBUGS] Successfully parsed file <https://builds.apache.org/job/apache-atlas-nightly/ws/client/target/findbugs.xml>
of module  with 0 warnings.
[FINDBUGS] Successfully parsed file <https://builds.apache.org/job/apache-atlas-nightly/ws/notification/target/findbugs.xml>
of module  with 0 warnings.
[FINDBUGS] Successfully parsed file <https://builds.apache.org/job/apache-atlas-nightly/ws/repository/target/findbugs.xml>
of module  with 0 warnings.
[FINDBUGS] Successfully parsed file <https://builds.apache.org/job/apache-atlas-nightly/ws/typesystem/target/findbugs.xml>
of module  with 0 warnings.
[FINDBUGS] Successfully parsed file <https://builds.apache.org/job/apache-atlas-nightly/ws/webapp/target/findbugs.xml>
of module  with 0 warnings.
[FINDBUGS] Computing warning deltas based on reference build #60
Archiving artifacts
Recording test results
TestNG Reports Processing: START
Looking for TestNG results report in workspace using pattern: **/target/surefire-reports/testng-results.xml
testng-results.xml was last modified before this build started. Ignoring it.
testng-results.xml was last modified before this build started. Ignoring it.
testng-results.xml was last modified before this build started. Ignoring it.
testng-results.xml was last modified before this build started. Ignoring it.
testng-results.xml was last modified before this build started. Ignoring it.
Saving reports...
Found matching files but did not find any TestNG results.

Mime
View raw message