atlas-dev mailing list archives

Site index · List index
Message view « Date » · « Thread »
Top « Date » · « Thread »
From Apache Jenkins Server <jenk...@builds.apache.org>
Subject Build failed in Jenkins: apache-atlas-nightly #69
Date Wed, 26 Aug 2015 20:50:21 GMT
See <https://builds.apache.org/job/apache-atlas-nightly/69/changes>

Changes:

[jmaron] ATLAS-67 add zk service principal for secure tests

[jmaron] ATLAS-115 Remove unnecessary log4j.xml in typesystem

------------------------------------------
[...truncated 2721 lines...]
[INFO] Class org.apache.atlas.query.QueryParser$$anonfun$singleQrySrc$6 defines non-transient
non-serializable instance field $outer [org.apache.atlas.query.QueryParser$$anonfun$singleQrySrc$6]
In QueryParser.scala
[INFO] Possible null pointer dereference of lId in org.apache.atlas.query.QueryParser$$anonfun$singleQrySrc$6$$anonfun$apply$10.apply(Expressions$Expression)
[org.apache.atlas.query.QueryParser$$anonfun$singleQrySrc$6$$anonfun$apply$10, org.apache.atlas.query.QueryParser$$anonfun$singleQrySrc$6$$anonfun$apply$10,
org.apache.atlas.query.QueryParser$$anonfun$singleQrySrc$6$$anonfun$apply$10] Dereferenced
at QueryParser.scala:[line 172]Null value at QueryParser.scala:[line 169]Known null at QueryParser.scala:[line
170]
[INFO] Class org.apache.atlas.query.QueryParser$$anonfun$singleQrySrc$7 defines non-transient
non-serializable instance field $outer [org.apache.atlas.query.QueryParser$$anonfun$singleQrySrc$7]
In QueryParser.scala
[INFO] Class org.apache.atlas.query.QueryParser$$anonfun$singleQuery$1 defines non-transient
non-serializable instance field $outer [org.apache.atlas.query.QueryParser$$anonfun$singleQuery$1]
In QueryParser.scala
[INFO] Class org.apache.atlas.query.QueryParser$$anonfun$singleQuery$2 defines non-transient
non-serializable instance field $outer [org.apache.atlas.query.QueryParser$$anonfun$singleQuery$2]
In QueryParser.scala
[INFO] Class org.apache.atlas.query.QueryParser$$anonfun$singleQuery$3 defines non-transient
non-serializable instance field $outer [org.apache.atlas.query.QueryParser$$anonfun$singleQuery$3]
In QueryParser.scala
[INFO] Class org.apache.atlas.query.Resolver$$anonfun$apply$1 defines non-transient non-serializable
instance field r$1 [org.apache.atlas.query.Resolver$$anonfun$apply$1] In Resolver.scala
[INFO] Class org.apache.atlas.query.SelectExpressionHandling$$anonfun$buildResultMapping$1
defines non-transient non-serializable instance field $outer [org.apache.atlas.query.SelectExpressionHandling$$anonfun$buildResultMapping$1]
In GremlinQuery.scala
[INFO] Class org.apache.atlas.query.SelectExpressionHandling$$anonfun$groupSelectExpressionsBySrc$1
defines non-transient non-serializable instance field $outer [org.apache.atlas.query.SelectExpressionHandling$$anonfun$groupSelectExpressionsBySrc$1]
In GremlinQuery.scala
[INFO] Class org.apache.atlas.query.SelectExpressionHandling$$anonfun$validateSelectExprHaveOneSrc$1
defines non-transient non-serializable instance field $outer [org.apache.atlas.query.SelectExpressionHandling$$anonfun$validateSelectExprHaveOneSrc$1]
In GremlinQuery.scala
[INFO] Class org.apache.atlas.query.SelectExpressionHandling$AddAliasToSelectInput$$anonfun$apply$1
defines non-transient non-serializable instance field $outer [org.apache.atlas.query.SelectExpressionHandling$AddAliasToSelectInput$$anonfun$apply$1]
In GremlinQuery.scala
[INFO] Class org.apache.atlas.query.SelectExpressionHandling$AddAliasToSelectInput$$anonfun$apply$2
defines non-transient non-serializable instance field $outer [org.apache.atlas.query.SelectExpressionHandling$AddAliasToSelectInput$$anonfun$apply$2]
In GremlinQuery.scala
[INFO] Null passed for non-null parameter of new Expressions$BackReference(String, Expressions$Expression,
Option) in org.apache.atlas.query.SelectExpressionHandling$AddAliasToSelectInput$DecorateFieldWithAlias.apply(Expressions$Expression)
[org.apache.atlas.query.SelectExpressionHandling$AddAliasToSelectInput$DecorateFieldWithAlias,
org.apache.atlas.query.SelectExpressionHandling$AddAliasToSelectInput$DecorateFieldWithAlias]
Method invoked at GremlinQuery.scala:[line 57]Known null at GremlinQuery.scala:[line 56]
[INFO] The class name org.apache.atlas.query.SelectExpressionHandling$class doesn't start
with an upper case letter [org.apache.atlas.query.SelectExpressionHandling$class] At GremlinQuery.scala:[lines
40-122]
[INFO] The class name org.apache.atlas.query.SingleInstanceClosureQuery$class doesn't start
with an upper case letter [org.apache.atlas.query.SingleInstanceClosureQuery$class] At ClosureQuery.scala:[lines
231-240]
[INFO] Class org.apache.atlas.query.TypeUtils$$anonfun$3 defines non-transient non-serializable
instance field typ$1 [org.apache.atlas.query.TypeUtils$$anonfun$3] In TypeUtils.scala
[INFO] new org.apache.atlas.query.TypeUtils$$anonfun$createStructType$1(AttributeDefinition[])
may expose internal representation by storing an externally mutable object into TypeUtils$$anonfun$createStructType$1.aDefs$1
[org.apache.atlas.query.TypeUtils$$anonfun$createStructType$1] At TypeUtils.scala:[line 62]
[INFO] Load of known null value in org.apache.atlas.query.TypeUtils$$anonfun$createStructType$1.apply(Tuple2)
[org.apache.atlas.query.TypeUtils$$anonfun$createStructType$1] At TypeUtils.scala:[line 63]
[INFO] Class org.apache.atlas.query.TypeUtils$$anonfun$createStructType$1 defines non-transient
non-serializable instance field aDefs$1 [org.apache.atlas.query.TypeUtils$$anonfun$createStructType$1]
In TypeUtils.scala
[INFO] Class org.apache.atlas.query.TypeUtils$FieldInfo defines non-transient non-serializable
instance field attrInfo [org.apache.atlas.query.TypeUtils$FieldInfo] In TypeUtils.scala
[INFO] Write to static field org.apache.atlas.query.TypeUtils$FieldInfo$.MODULE$ from instance
method new org.apache.atlas.query.TypeUtils$FieldInfo$() [org.apache.atlas.query.TypeUtils$FieldInfo$]
At TypeUtils.scala:[line 161]
[INFO] Write to static field org.apache.atlas.query.TypeUtils$GraphResultStruct$.MODULE$ from
instance method new org.apache.atlas.query.TypeUtils$GraphResultStruct$() [org.apache.atlas.query.TypeUtils$GraphResultStruct$]
At TypeUtils.scala:[line 100]
[INFO] Write to static field org.apache.atlas.query.TypeUtils$ResultWithPathStruct$.MODULE$
from instance method new org.apache.atlas.query.TypeUtils$ResultWithPathStruct$() [org.apache.atlas.query.TypeUtils$ResultWithPathStruct$]
At TypeUtils.scala:[line 71]
[INFO] Possible doublecheck on org.apache.atlas.repository.graph.TitanGraphProvider.graphInstance
in org.apache.atlas.repository.graph.TitanGraphProvider.get() [org.apache.atlas.repository.graph.TitanGraphProvider]
At TitanGraphProvider.java:[lines 91-93]
[INFO] Comparison of String objects using == or != in org.apache.atlas.repository.memory.ClassStore.createInstance(MemRepository,
Id)  [org.apache.atlas.repository.memory.ClassStore] At ClassStore.java:[line 78]
[INFO] Comparison of String objects using == or != in org.apache.atlas.repository.memory.ClassStore.validate(MemRepository,
Id)  [org.apache.atlas.repository.memory.ClassStore] At ClassStore.java:[line 64]
[INFO] Redundant nullcheck of org.apache.atlas.typesystem.types.ObjectGraphWalker$Node.value,
which is known to be non-null in org.apache.atlas.repository.memory.ReplaceIdWithInstance.processNode(ObjectGraphWalker$Node)
[org.apache.atlas.repository.memory.ReplaceIdWithInstance] Redundant null check at ReplaceIdWithInstance.java:[line
59]
[INFO] 


To see bug detail using the Findbugs GUI, use the following command "mvn findbugs:gui"



[INFO]                                                                         
[INFO] ------------------------------------------------------------------------
[INFO] Building Apache Atlas Web Application 0.6-incubating-SNAPSHOT
[INFO] ------------------------------------------------------------------------
Downloading: https://repository.apache.org/content/groups/staging/org/glassfish/javax.el/maven-metadata.xml
Downloading: http://repo.hortonworks.com/content/repositories/releases/org/glassfish/javax.el/maven-metadata.xml
Downloading: http://repo1.maven.org/maven2/org/glassfish/javax.el/maven-metadata.xml
Downloading: https://repository.apache.org/content/groups/snapshots/org/glassfish/javax.el/maven-metadata.xml
847/847 B   
            
Downloaded: http://repo1.maven.org/maven2/org/glassfish/javax.el/maven-metadata.xml (847 B
at 3.7 KB/sec)
Downloading: https://repository.apache.org/content/groups/public/org/glassfish/javax.el/maven-metadata.xml
            
Downloading: https://maven.java.net/content/groups/public/org/glassfish/javax.el/maven-metadata.xml
            
            
            
Downloading: https://repository.jboss.org/nexus/content/groups/public/org/glassfish/javax.el/maven-metadata.xml
Downloading: http://repo.typesafe.com/typesafe/releases/org/glassfish/javax.el/maven-metadata.xml
Downloading: http://repository.apache.org/snapshots/org/glassfish/javax.el/maven-metadata.xml
            
Downloading: https://oss.sonatype.org/content/groups/jetty/org/glassfish/javax.el/maven-metadata.xml
            
Downloading: https://maven.java.net/content/repositories/snapshots/org/glassfish/javax.el/maven-metadata.xml
979/979 B   
            
            
Downloaded: https://maven.java.net/content/groups/public/org/glassfish/javax.el/maven-metadata.xml
(979 B at 1.1 KB/sec)
            
373/373 B   
            
Downloaded: https://maven.java.net/content/repositories/snapshots/org/glassfish/javax.el/maven-metadata.xml
(373 B at 0.6 KB/sec)
[WARNING] Could not transfer metadata org.glassfish:javax.el/maven-metadata.xml from/to repository.jboss.org-public
(https://repository.jboss.org/nexus/content/groups/public): java.lang.RuntimeException: Could
not generate DH keypair
Downloading: https://maven.java.net/content/groups/public/org/glassfish/javax.el/3.0.1-b06-SNAPSHOT/maven-metadata.xml
Downloading: https://repository.apache.org/content/groups/snapshots/org/glassfish/javax.el/3.0.1-b06-SNAPSHOT/maven-metadata.xml
Downloading: https://repository.apache.org/content/groups/public/org/glassfish/javax.el/3.0.1-b06-SNAPSHOT/maven-metadata.xml
Downloading: https://repository.apache.org/content/groups/staging/org/glassfish/javax.el/3.0.1-b06-SNAPSHOT/maven-metadata.xml
            
Downloading: https://repository.jboss.org/nexus/content/groups/public/org/glassfish/javax.el/3.0.1-b06-SNAPSHOT/maven-metadata.xml
            
            
Downloading: http://repo.typesafe.com/typesafe/releases/org/glassfish/javax.el/3.0.1-b06-SNAPSHOT/maven-metadata.xml
Downloading: http://repository.apache.org/snapshots/org/glassfish/javax.el/3.0.1-b06-SNAPSHOT/maven-metadata.xml
            
Downloading: https://oss.sonatype.org/content/groups/jetty/org/glassfish/javax.el/3.0.1-b06-SNAPSHOT/maven-metadata.xml
            
Downloading: https://maven.java.net/content/repositories/snapshots/org/glassfish/javax.el/3.0.1-b06-SNAPSHOT/maven-metadata.xml
            
            
            
            
[WARNING] Could not transfer metadata org.glassfish:javax.el:3.0.1-b06-SNAPSHOT/maven-metadata.xml
from/to repository.jboss.org-public (https://repository.jboss.org/nexus/content/groups/public):
java.lang.RuntimeException: Could not generate DH keypair
[WARNING] Failure to transfer org.glassfish:javax.el:3.0.1-b06-SNAPSHOT/maven-metadata.xml
from https://repository.jboss.org/nexus/content/groups/public was cached in the local repository,
resolution will not be reattempted until the update interval of repository.jboss.org-public
has elapsed or updates are forced. Original error: Could not transfer metadata org.glassfish:javax.el:3.0.1-b06-SNAPSHOT/maven-metadata.xml
from/to repository.jboss.org-public (https://repository.jboss.org/nexus/content/groups/public):
java.lang.RuntimeException: Could not generate DH keypair
Downloading: https://repository.apache.org/content/groups/snapshots/org/glassfish/javax.el/3.0.1-b06-SNAPSHOT/javax.el-3.0.1-b06-SNAPSHOT.pom
            
Downloading: https://repository.apache.org/content/groups/staging/org/glassfish/javax.el/3.0.1-b06-SNAPSHOT/javax.el-3.0.1-b06-SNAPSHOT.pom
            
Downloading: https://repository.apache.org/content/groups/public/org/glassfish/javax.el/3.0.1-b06-SNAPSHOT/javax.el-3.0.1-b06-SNAPSHOT.pom
            
Downloading: https://maven.java.net/content/groups/public/org/glassfish/javax.el/3.0.1-b06-SNAPSHOT/javax.el-3.0.1-b06-SNAPSHOT.pom
            
Downloading: https://repository.jboss.org/nexus/content/groups/public/org/glassfish/javax.el/3.0.1-b06-SNAPSHOT/javax.el-3.0.1-b06-SNAPSHOT.pom
            
Downloading: http://repo.typesafe.com/typesafe/releases/org/glassfish/javax.el/3.0.1-b06-SNAPSHOT/javax.el-3.0.1-b06-SNAPSHOT.pom
            
Downloading: http://repository.apache.org/snapshots/org/glassfish/javax.el/3.0.1-b06-SNAPSHOT/javax.el-3.0.1-b06-SNAPSHOT.pom
            
Downloading: https://oss.sonatype.org/content/groups/jetty/org/glassfish/javax.el/3.0.1-b06-SNAPSHOT/javax.el-3.0.1-b06-SNAPSHOT.pom
            
Downloading: https://maven.java.net/content/repositories/snapshots/org/glassfish/javax.el/3.0.1-b06-SNAPSHOT/javax.el-3.0.1-b06-SNAPSHOT.pom
            
Downloading: https://repository.apache.org/content/groups/staging/org/glassfish/javax.el/3.0.1-b07-SNAPSHOT/maven-metadata.xml
Downloading: https://repository.apache.org/content/groups/snapshots/org/glassfish/javax.el/3.0.1-b07-SNAPSHOT/maven-metadata.xml
Downloading: https://maven.java.net/content/groups/public/org/glassfish/javax.el/3.0.1-b07-SNAPSHOT/maven-metadata.xml
Downloading: https://repository.apache.org/content/groups/public/org/glassfish/javax.el/3.0.1-b07-SNAPSHOT/maven-metadata.xml
            
            
            
Downloading: https://repository.jboss.org/nexus/content/groups/public/org/glassfish/javax.el/3.0.1-b07-SNAPSHOT/maven-metadata.xml
Downloading: http://repo.typesafe.com/typesafe/releases/org/glassfish/javax.el/3.0.1-b07-SNAPSHOT/maven-metadata.xml
Downloading: http://repository.apache.org/snapshots/org/glassfish/javax.el/3.0.1-b07-SNAPSHOT/maven-metadata.xml
            
Downloading: https://oss.sonatype.org/content/groups/jetty/org/glassfish/javax.el/3.0.1-b07-SNAPSHOT/maven-metadata.xml
            
Downloading: https://maven.java.net/content/repositories/snapshots/org/glassfish/javax.el/3.0.1-b07-SNAPSHOT/maven-metadata.xml
            
            
            
            
[WARNING] Could not transfer metadata org.glassfish:javax.el:3.0.1-b07-SNAPSHOT/maven-metadata.xml
from/to repository.jboss.org-public (https://repository.jboss.org/nexus/content/groups/public):
java.lang.RuntimeException: Could not generate DH keypair
[WARNING] Failure to transfer org.glassfish:javax.el:3.0.1-b07-SNAPSHOT/maven-metadata.xml
from https://repository.jboss.org/nexus/content/groups/public was cached in the local repository,
resolution will not be reattempted until the update interval of repository.jboss.org-public
has elapsed or updates are forced. Original error: Could not transfer metadata org.glassfish:javax.el:3.0.1-b07-SNAPSHOT/maven-metadata.xml
from/to repository.jboss.org-public (https://repository.jboss.org/nexus/content/groups/public):
java.lang.RuntimeException: Could not generate DH keypair
Downloading: https://repository.apache.org/content/groups/snapshots/org/glassfish/javax.el/3.0.1-b07-SNAPSHOT/javax.el-3.0.1-b07-SNAPSHOT.pom
            
Downloading: https://repository.apache.org/content/groups/staging/org/glassfish/javax.el/3.0.1-b07-SNAPSHOT/javax.el-3.0.1-b07-SNAPSHOT.pom
            
Downloading: https://repository.apache.org/content/groups/public/org/glassfish/javax.el/3.0.1-b07-SNAPSHOT/javax.el-3.0.1-b07-SNAPSHOT.pom
            
Downloading: https://maven.java.net/content/groups/public/org/glassfish/javax.el/3.0.1-b07-SNAPSHOT/javax.el-3.0.1-b07-SNAPSHOT.pom
            
Downloading: https://repository.jboss.org/nexus/content/groups/public/org/glassfish/javax.el/3.0.1-b07-SNAPSHOT/javax.el-3.0.1-b07-SNAPSHOT.pom
            
Downloading: http://repo.typesafe.com/typesafe/releases/org/glassfish/javax.el/3.0.1-b07-SNAPSHOT/javax.el-3.0.1-b07-SNAPSHOT.pom
            
Downloading: http://repository.apache.org/snapshots/org/glassfish/javax.el/3.0.1-b07-SNAPSHOT/javax.el-3.0.1-b07-SNAPSHOT.pom
            
Downloading: https://oss.sonatype.org/content/groups/jetty/org/glassfish/javax.el/3.0.1-b07-SNAPSHOT/javax.el-3.0.1-b07-SNAPSHOT.pom
            
Downloading: https://maven.java.net/content/repositories/snapshots/org/glassfish/javax.el/3.0.1-b07-SNAPSHOT/javax.el-3.0.1-b07-SNAPSHOT.pom
            
Downloading: https://repository.apache.org/content/groups/public/org/glassfish/javax.el/3.0.1-b08-SNAPSHOT/maven-metadata.xml
Downloading: https://repository.apache.org/content/groups/staging/org/glassfish/javax.el/3.0.1-b08-SNAPSHOT/maven-metadata.xml
Downloading: https://repository.apache.org/content/groups/snapshots/org/glassfish/javax.el/3.0.1-b08-SNAPSHOT/maven-metadata.xml
Downloading: https://maven.java.net/content/groups/public/org/glassfish/javax.el/3.0.1-b08-SNAPSHOT/maven-metadata.xml
            
            
            
Downloading: https://repository.jboss.org/nexus/content/groups/public/org/glassfish/javax.el/3.0.1-b08-SNAPSHOT/maven-metadata.xml
Downloading: http://repo.typesafe.com/typesafe/releases/org/glassfish/javax.el/3.0.1-b08-SNAPSHOT/maven-metadata.xml
Downloading: http://repository.apache.org/snapshots/org/glassfish/javax.el/3.0.1-b08-SNAPSHOT/maven-metadata.xml
            
Downloading: https://oss.sonatype.org/content/groups/jetty/org/glassfish/javax.el/3.0.1-b08-SNAPSHOT/maven-metadata.xml
            
Downloading: https://maven.java.net/content/repositories/snapshots/org/glassfish/javax.el/3.0.1-b08-SNAPSHOT/maven-metadata.xml
            
            
            
            
[WARNING] Could not transfer metadata org.glassfish:javax.el:3.0.1-b08-SNAPSHOT/maven-metadata.xml
from/to repository.jboss.org-public (https://repository.jboss.org/nexus/content/groups/public):
java.lang.RuntimeException: Could not generate DH keypair
[WARNING] Failure to transfer org.glassfish:javax.el:3.0.1-b08-SNAPSHOT/maven-metadata.xml
from https://repository.jboss.org/nexus/content/groups/public was cached in the local repository,
resolution will not be reattempted until the update interval of repository.jboss.org-public
has elapsed or updates are forced. Original error: Could not transfer metadata org.glassfish:javax.el:3.0.1-b08-SNAPSHOT/maven-metadata.xml
from/to repository.jboss.org-public (https://repository.jboss.org/nexus/content/groups/public):
java.lang.RuntimeException: Could not generate DH keypair
Downloading: https://repository.apache.org/content/groups/snapshots/org/glassfish/javax.el/3.0.1-b08-SNAPSHOT/javax.el-3.0.1-b08-SNAPSHOT.pom
            
Downloading: https://repository.apache.org/content/groups/staging/org/glassfish/javax.el/3.0.1-b08-SNAPSHOT/javax.el-3.0.1-b08-SNAPSHOT.pom
            
Downloading: https://repository.apache.org/content/groups/public/org/glassfish/javax.el/3.0.1-b08-SNAPSHOT/javax.el-3.0.1-b08-SNAPSHOT.pom
            
Downloading: https://maven.java.net/content/groups/public/org/glassfish/javax.el/3.0.1-b08-SNAPSHOT/javax.el-3.0.1-b08-SNAPSHOT.pom
            
Downloading: https://repository.jboss.org/nexus/content/groups/public/org/glassfish/javax.el/3.0.1-b08-SNAPSHOT/javax.el-3.0.1-b08-SNAPSHOT.pom
            
Downloading: http://repo.typesafe.com/typesafe/releases/org/glassfish/javax.el/3.0.1-b08-SNAPSHOT/javax.el-3.0.1-b08-SNAPSHOT.pom
            
Downloading: http://repository.apache.org/snapshots/org/glassfish/javax.el/3.0.1-b08-SNAPSHOT/javax.el-3.0.1-b08-SNAPSHOT.pom
            
Downloading: https://oss.sonatype.org/content/groups/jetty/org/glassfish/javax.el/3.0.1-b08-SNAPSHOT/javax.el-3.0.1-b08-SNAPSHOT.pom
            
Downloading: https://maven.java.net/content/repositories/snapshots/org/glassfish/javax.el/3.0.1-b08-SNAPSHOT/javax.el-3.0.1-b08-SNAPSHOT.pom
            
[INFO] ------------------------------------------------------------------------
[INFO] Reactor Summary:
[INFO] 
[INFO] apache-atlas ...................................... SUCCESS [01:11 min]
[INFO] Apache Atlas Typesystem ........................... SUCCESS [01:35 min]
[INFO] Apache Atlas Client ............................... SUCCESS [ 22.230 s]
[INFO] Apache Atlas Notification ......................... SUCCESS [ 20.363 s]
[INFO] Apache Atlas Repository ........................... SUCCESS [04:26 min]
[INFO] Apache Atlas Web Application ...................... FAILURE [  8.952 s]
[INFO] Apache Atlas Documentation ........................ SKIPPED
[INFO] Apache Atlas Hive Bridge .......................... SKIPPED
[INFO] ------------------------------------------------------------------------
[INFO] BUILD FAILURE
[INFO] ------------------------------------------------------------------------
[INFO] Total time: 08:07 min
[INFO] Finished at: 2015-08-26T20:51:19+00:00
[INFO] Final Memory: 141M/1480M
[INFO] ------------------------------------------------------------------------
[ERROR] Failed to execute goal on project atlas-webapp: Could not resolve dependencies for
project org.apache.atlas:atlas-webapp:war:0.6-incubating-SNAPSHOT: Failed to collect dependencies
at org.eclipse.jetty:jetty-jsp:jar:9.2.12.v20150709 -> org.glassfish.web:javax.servlet.jsp:jar:2.3.2
-> org.glassfish:javax.el:jar:3.0.1-b06-SNAPSHOT: Failed to read artifact descriptor for
org.glassfish:javax.el:jar:3.0.1-b06-SNAPSHOT: Could not transfer artifact org.glassfish:javax.el:pom:3.0.1-b06-SNAPSHOT
from/to repository.jboss.org-public (https://repository.jboss.org/nexus/content/groups/public):
java.lang.RuntimeException: Could not generate DH keypair: Prime size must be multiple of
64, and can only range from 512 to 1024 (inclusive) -> [Help 1]
[ERROR] 
[ERROR] To see the full stack trace of the errors, re-run Maven with the -e switch.
[ERROR] Re-run Maven using the -X switch to enable full debug logging.
[ERROR] 
[ERROR] For more information about the errors and possible solutions, please read the following
articles:
[ERROR] [Help 1] http://cwiki.apache.org/confluence/display/MAVEN/DependencyResolutionException
[ERROR] 
[ERROR] After correcting the problems, you can resume the build with the command
[ERROR]   mvn <goals> -rf :atlas-webapp
Build step 'Execute shell' marked build as failure
[CHECKSTYLE] Collecting checkstyle analysis files...
[CHECKSTYLE] Finding all files that match the pattern **/target/checkstyle-result.xml
[CHECKSTYLE] Parsing 8 files in <https://builds.apache.org/job/apache-atlas-nightly/ws/>
[CHECKSTYLE] Successfully parsed file <https://builds.apache.org/job/apache-atlas-nightly/ws/addons/hive-bridge/target/checkstyle-result.xml>
of module  with 117 warnings.
[CHECKSTYLE] Successfully parsed file <https://builds.apache.org/job/apache-atlas-nightly/ws/client/target/checkstyle-result.xml>
of module  with 30 warnings.
[CHECKSTYLE] Successfully parsed file <https://builds.apache.org/job/apache-atlas-nightly/ws/docs/target/checkstyle-result.xml>
of module  with 0 warnings.
[CHECKSTYLE] Successfully parsed file <https://builds.apache.org/job/apache-atlas-nightly/ws/notification/target/checkstyle-result.xml>
of module  with 31 warnings.
[CHECKSTYLE] Successfully parsed file <https://builds.apache.org/job/apache-atlas-nightly/ws/repository/target/checkstyle-result.xml>
of module  with 567 warnings.
[CHECKSTYLE] Successfully parsed file <https://builds.apache.org/job/apache-atlas-nightly/ws/target/checkstyle-result.xml>
of module  with 0 warnings.
[CHECKSTYLE] Successfully parsed file <https://builds.apache.org/job/apache-atlas-nightly/ws/typesystem/target/checkstyle-result.xml>
of module  with 542 warnings.
[CHECKSTYLE] Successfully parsed file <https://builds.apache.org/job/apache-atlas-nightly/ws/webapp/target/checkstyle-result.xml>
of module  with 148 warnings.
[CHECKSTYLE] Computing warning deltas based on reference build #60
[FINDBUGS] Collecting findbugs analysis files...
[FINDBUGS] Finding all files that match the pattern **/target/findbugs.xml
[FINDBUGS] Parsing 6 files in <https://builds.apache.org/job/apache-atlas-nightly/ws/>
[FINDBUGS] Successfully parsed file <https://builds.apache.org/job/apache-atlas-nightly/ws/addons/hive-bridge/target/findbugs.xml>
of module  with 0 warnings.
[FINDBUGS] Successfully parsed file <https://builds.apache.org/job/apache-atlas-nightly/ws/client/target/findbugs.xml>
of module  with 0 warnings.
[FINDBUGS] Successfully parsed file <https://builds.apache.org/job/apache-atlas-nightly/ws/notification/target/findbugs.xml>
of module  with 0 warnings.
[FINDBUGS] Successfully parsed file <https://builds.apache.org/job/apache-atlas-nightly/ws/repository/target/findbugs.xml>
of module  with 0 warnings.
[FINDBUGS] Successfully parsed file <https://builds.apache.org/job/apache-atlas-nightly/ws/typesystem/target/findbugs.xml>
of module  with 0 warnings.
[FINDBUGS] Successfully parsed file <https://builds.apache.org/job/apache-atlas-nightly/ws/webapp/target/findbugs.xml>
of module  with 0 warnings.
[FINDBUGS] Computing warning deltas based on reference build #60
Archiving artifacts
Sending artifact delta relative to apache-atlas-nightly #60
Archived 2 artifacts
Archive block size is 32768
Received 140 blocks and 8821 bytes
Compression is 99.8%
Took 2.3 sec
Recording test results
TestNG Reports Processing: START
Looking for TestNG results report in workspace using pattern: **/target/surefire-reports/testng-results.xml
testng-results.xml was last modified before this build started. Ignoring it.
Saving reports...
Processing '/x1/jenkins/jenkins-home/jobs/apache-atlas-nightly/builds/2015-08-26_20-41-59/testng/testng-results-1.xml'
Processing '/x1/jenkins/jenkins-home/jobs/apache-atlas-nightly/builds/2015-08-26_20-41-59/testng/testng-results-2.xml'
Processing '/x1/jenkins/jenkins-home/jobs/apache-atlas-nightly/builds/2015-08-26_20-41-59/testng/testng-results-3.xml'
Processing '/x1/jenkins/jenkins-home/jobs/apache-atlas-nightly/builds/2015-08-26_20-41-59/testng/testng-results.xml'
TestNG Reports Processing: FINISH

Mime
View raw message