asterixdb-notifications mailing list archives

Site index · List index
Message view « Date » · « Thread »
Top « Date » · « Thread »
From "Murtadha Hubail (JIRA)" <j...@apache.org>
Subject [jira] [Assigned] (ASTERIXDB-1181) Sporadic test failure in VersionAPIServletTest
Date Thu, 19 Nov 2015 05:23:10 GMT

     [ https://issues.apache.org/jira/browse/ASTERIXDB-1181?page=com.atlassian.jira.plugin.system.issuetabpanels:all-tabpanel
]

Murtadha Hubail reassigned ASTERIXDB-1181:
------------------------------------------

    Assignee: Murtadha Hubail  (was: Ian Maxon)

> Sporadic test failure in VersionAPIServletTest
> ----------------------------------------------
>
>                 Key: ASTERIXDB-1181
>                 URL: https://issues.apache.org/jira/browse/ASTERIXDB-1181
>             Project: Apache AsterixDB
>          Issue Type: Bug
>          Components: HTTP API
>            Reporter: Yingyi Bu
>            Assignee: Murtadha Hubail
>            Priority: Critical
>              Labels: sporadic-error
>
> Tests run: 1, Failures: 1, Errors: 0, Skipped: 0, Time elapsed: 6.025 sec <<<
FAILURE! - in org.apache.asterix.api.http.servlet.VersionAPIServletTest
> testGet(org.apache.asterix.api.http.servlet.VersionAPIServletTest)  Time elapsed: 5.983
sec  <<< FAILURE!
> java.lang.AssertionError: null
> 	at org.apache.asterix.common.context.DatasetLifecycleManager.closeDataset(DatasetLifecycleManager.java:604)
> 	at org.apache.asterix.common.context.DatasetLifecycleManager.closeAllDatasets(DatasetLifecycleManager.java:612)
> 	at org.apache.asterix.common.context.DatasetLifecycleManager.stop(DatasetLifecycleManager.java:622)
> 	at org.apache.hyracks.api.lifecycle.LifeCycleComponentManager.stopAll(LifeCycleComponentManager.java:126)
> 	at org.apache.asterix.hyracks.bootstrap.NCApplicationEntryPoint.stop(NCApplicationEntryPoint.java:183)
> 	at org.apache.hyracks.control.nc.NodeControllerService.stop(NodeControllerService.java:343)
> 	at org.apache.asterix.api.common.AsterixHyracksIntegrationUtil.deinit(AsterixHyracksIntegrationUtil.java:116)
> 	at org.apache.asterix.test.runtime.ExecutionTestUtil.tearDown(ExecutionTestUtil.java:91)
> 	at org.apache.asterix.test.runtime.ExecutionTest.tearDown(ExecutionTest.java:67)
> 	at org.apache.asterix.api.http.servlet.VersionAPIServletTest.testGet(VersionAPIServletTest.java:114)



--
This message was sent by Atlassian JIRA
(v6.3.4#6332)

Mime
View raw message