asterixdb-dev mailing list archives

Site index · List index
Message view « Date » · « Thread »
Top « Date » · « Thread »
From Asterix build server <jenk...@asterix-jenkins.ics.uci.edu>
Subject Build failed in Jenkins: asterix-integration-tests b9f89adf
Date Tue, 23 May 2017 20:41:46 GMT
See <https://asterix-jenkins.ics.uci.edu/job/asterix-integration-tests/700/changes>

Changes:

[Wang Xikui] Feed Adapter and RecordReader Clean

------------------------------------------
[...truncated 356909 lines...]
[INFO] Sensor Zero Coverage Sensor
[INFO] Sensor Zero Coverage Sensor (done) | time=3ms
[INFO] Sensor Code Colorizer Sensor
[INFO] Sensor Code Colorizer Sensor (done) | time=1ms
[INFO] Sensor CPD Block Indexer
[INFO] JavaCpdBlockIndexer is used for java
[INFO] Sensor CPD Block Indexer (done) | time=24ms
[INFO] -------------  Scan asterix-lang-sqlpp
[INFO] Base dir: <https://asterix-jenkins.ics.uci.edu/job/asterix-integration-tests/ws/asterixdb/asterix-lang-sqlpp>
[INFO] Working dir: <https://asterix-jenkins.ics.uci.edu/job/asterix-integration-tests/ws/asterixdb/asterix-lang-sqlpp/target/sonar>
[INFO] Source paths: pom.xml, src/main/java
[INFO] Test paths: src/test/java
[INFO] Binary dirs: target/classes
[INFO] Source encoding: UTF-8, default locale: en_US
[INFO] Index files
[INFO] 64 files indexed
[INFO] Quality profile for java: AsterixDB Way
[INFO] Sensor Lines Sensor
[INFO] Sensor Lines Sensor (done) | time=1ms
[INFO] Sensor JavaSquidSensor
[INFO] Configured Java source version (sonar.java.source): 6
[INFO] JavaClasspath initialization
[INFO] JavaClasspath initialization (done) | time=3ms
[INFO] JavaTestClasspath initialization
[INFO] JavaTestClasspath initialization (done) | time=3ms
[INFO] Java Main Files AST scan
[INFO] 63 source files to be analyzed
[INFO] Java Main Files AST scan (done) | time=6031ms
[INFO] Java Test Files AST scan
[INFO] 63/63 source files have been analyzed
[INFO] 1 source files to be analyzed
[INFO] Java Test Files AST scan (done) | time=52ms
[INFO] Sensor JavaSquidSensor (done) | time=6094ms
[INFO] 1/1 source files have been analyzed
[INFO] Sensor CheckstyleSensor
[INFO] Execute Checkstyle 7.3...
[INFO] Checkstyle configuration: <https://asterix-jenkins.ics.uci.edu/job/asterix-integration-tests/ws/asterixdb/asterix-lang-sqlpp/target/sonar/checkstyle.xml>
[INFO] Checkstyle charset: UTF-8
[INFO] Execute Checkstyle 7.3 done: 589 ms
[INFO] Sensor CheckstyleSensor (done) | time=589ms
[INFO] Sensor SCM Sensor
[INFO] Sensor SCM Sensor (done) | time=5ms
[INFO] Sensor FindBugs Sensor
[INFO] Loading findbugs plugin: <https://asterix-jenkins.ics.uci.edu/job/asterix-integration-tests/ws/asterixdb/asterix-lang-sqlpp/target/sonar/findbugs/findsecbugs-plugin.jar>
[INFO] Findbugs output report: <https://asterix-jenkins.ics.uci.edu/job/asterix-integration-tests/ws/asterixdb/asterix-lang-sqlpp/target/sonar/findbugs-result.xml>
[WARNING] The class 'org.apache.asterix.lang.sqlpp.parser.SQLPPParser' could not be matched
to its original source file. It might be a dynamically generated class.
[INFO] Sensor FindBugs Sensor (done) | time=7674ms
[INFO] Sensor SurefireSensor
[INFO] parsing <https://asterix-jenkins.ics.uci.edu/job/asterix-integration-tests/ws/asterixdb/asterix-lang-sqlpp/target/surefire-reports>
[INFO] Sensor SurefireSensor (done) | time=2ms
[INFO] Sensor JaCoCoSensor
[INFO] Analysing <https://asterix-jenkins.ics.uci.edu/job/asterix-integration-tests/ws/target/jacoco-merged.exec>
[INFO] No information about coverage per test.
[INFO] Sensor JaCoCoSensor (done) | time=45ms
[INFO] Sensor JaCoCoItSensor
[INFO] JaCoCoItSensor: JaCoCo IT report not found: <https://asterix-jenkins.ics.uci.edu/job/asterix-integration-tests/ws/asterixdb/asterix-lang-sqlpp/target/jacoco-it.exec>
[INFO] Sensor JaCoCoItSensor (done) | time=1ms
[INFO] Sensor JaCoCoOverallSensor
[INFO] Analysing <https://asterix-jenkins.ics.uci.edu/job/asterix-integration-tests/ws/target/jacoco-merged.exec>
[INFO] Analysing <https://asterix-jenkins.ics.uci.edu/job/asterix-integration-tests/ws/asterixdb/asterix-lang-sqlpp/target/sonar/jacoco-overall.exec>
[INFO] No information about coverage per test.
[INFO] Sensor JaCoCoOverallSensor (done) | time=60ms
[INFO] Sensor XmlFileSensor
[INFO] Sensor XmlFileSensor (done) | time=0ms
[INFO] Sensor Zero Coverage Sensor
[INFO] Sensor Zero Coverage Sensor (done) | time=6ms
[INFO] Sensor Code Colorizer Sensor
[INFO] Sensor Code Colorizer Sensor (done) | time=1ms
[INFO] Sensor CPD Block Indexer
[INFO] JavaCpdBlockIndexer is used for java
[INFO] Sensor CPD Block Indexer (done) | time=58ms
[INFO] -------------  Scan asterix-algebra
[INFO] Base dir: <https://asterix-jenkins.ics.uci.edu/job/asterix-integration-tests/ws/asterixdb/asterix-algebra>
[INFO] Working dir: <https://asterix-jenkins.ics.uci.edu/job/asterix-integration-tests/ws/asterixdb/asterix-algebra/target/sonar>
[INFO] Source paths: pom.xml, src/main/java
[INFO] Binary dirs: target/classes
[INFO] Source encoding: UTF-8, default locale: en_US
[INFO] Index files
[INFO] 129 files indexed
[INFO] Quality profile for java: AsterixDB Way
[INFO] Sensor Lines Sensor
[INFO] Sensor Lines Sensor (done) | time=1ms
[INFO] Sensor JavaSquidSensor
[INFO] Configured Java source version (sonar.java.source): 6
[INFO] JavaClasspath initialization
[INFO] JavaClasspath initialization (done) | time=3ms
[INFO] JavaTestClasspath initialization
[INFO] JavaTestClasspath initialization (done) | time=2ms
[INFO] Java Main Files AST scan
[INFO] 129 source files to be analyzed
[WARNING] Class not found: javax.annotation.Nullable
[WARNING] Class not found: javax.annotation.Nullable
[WARNING] Class not found: javax.annotation.Nullable
[INFO] 78/129 files analyzed, current file: <https://asterix-jenkins.ics.uci.edu/job/asterix-integration-tests/ws/asterixdb/asterix-algebra/src/main/java/org/apache/asterix/optimizer/rules/SimilarityCheckRule.java>
[WARNING] Class not found: javax.annotation.Nullable
[WARNING] Class not found: javax.annotation.Nullable
[WARNING] Class not found: javax.annotation.Nullable
[WARNING] Class not found: javax.annotation.Nullable
[WARNING] Class not found: javax.annotation.Nullable
[INFO] 121/129 files analyzed, current file: <https://asterix-jenkins.ics.uci.edu/job/asterix-integration-tests/ws/asterixdb/asterix-algebra/src/main/java/org/apache/asterix/translator/SqlppExpressionToPlanTranslator.java>
[INFO] 129/129 source files have been analyzed
[INFO] Java Main Files AST scan (done) | time=21828ms
[INFO] Java Test Files AST scan
[INFO] 0 source files to be analyzed
[INFO] Java Test Files AST scan (done) | time=1ms
[INFO] Sensor JavaSquidSensor (done) | time=21839ms
[INFO] Sensor CheckstyleSensor
[INFO] Execute Checkstyle 7.3...
[INFO] 0/0 source files have been analyzed
[INFO] Checkstyle configuration: <https://asterix-jenkins.ics.uci.edu/job/asterix-integration-tests/ws/asterixdb/asterix-algebra/target/sonar/checkstyle.xml>
[INFO] Checkstyle charset: UTF-8
[INFO] Execute Checkstyle 7.3 done: 2669 ms
[INFO] Sensor CheckstyleSensor (done) | time=2669ms
[INFO] Sensor SCM Sensor
[INFO] Sensor SCM Sensor (done) | time=9ms
[INFO] Sensor FindBugs Sensor
[INFO] Loading findbugs plugin: <https://asterix-jenkins.ics.uci.edu/job/asterix-integration-tests/ws/asterixdb/asterix-algebra/target/sonar/findbugs/findsecbugs-plugin.jar>
[INFO] Findbugs output report: <https://asterix-jenkins.ics.uci.edu/job/asterix-integration-tests/ws/asterixdb/asterix-algebra/target/sonar/findbugs-result.xml>
[INFO] ------------------------------------------------------------------------
[INFO] Reactor Summary:
[INFO] 
[INFO] hyracks-ecosystem-full-stack ....................... SKIPPED
[INFO] hyracks ............................................ SKIPPED
[INFO] hyracks-util ....................................... SKIPPED
[INFO] hyracks-ipc ........................................ SKIPPED
[INFO] hyracks-api ........................................ SKIPPED
[INFO] hyracks-net ........................................ SKIPPED
[INFO] hyracks-comm ....................................... SKIPPED
[INFO] hyracks-control .................................... SKIPPED
[INFO] hyracks-control-common ............................. SKIPPED
[INFO] hyracks-http ....................................... SKIPPED
[INFO] hyracks-control-cc ................................. SKIPPED
[INFO] hyracks-control-nc ................................. SKIPPED
[INFO] hyracks-client ..................................... SKIPPED
[INFO] hyracks-data ....................................... SKIPPED
[INFO] hyracks-data-std ................................... SKIPPED
[INFO] hyracks-dataflow-common ............................ SKIPPED
[INFO] hyracks-dataflow-std ............................... SKIPPED
[INFO] hyracks-nc-service ................................. SKIPPED
[INFO] hyracks-storage-common ............................. SKIPPED
[INFO] hyracks-storage-am-common .......................... SKIPPED
[INFO] hyracks-storage-am-bloomfilter ..................... SKIPPED
[INFO] hyracks-storage-am-btree ........................... SKIPPED
[INFO] hyracks-storage-am-lsm-common ...................... SKIPPED
[INFO] hyracks-storage-am-lsm-invertedindex ............... SKIPPED
[INFO] hyracks-storage-am-lsm-btree ....................... SKIPPED
[INFO] hyracks-storage-am-rtree ........................... SKIPPED
[INFO] hyracks-storage-am-lsm-rtree ....................... SKIPPED
[INFO] hyracks-test-support ............................... SKIPPED
[INFO] hyracks-tests ...................................... SKIPPED
[INFO] hyracks-storage-common-test ........................ SKIPPED
[INFO] hyracks-storage-am-btree-test ...................... SKIPPED
[INFO] hyracks-storage-am-rtree-test ...................... SKIPPED
[INFO] hyracks-storage-am-lsm-common-test ................. SKIPPED
[INFO] hyracks-storage-am-lsm-btree-test .................. SKIPPED
[INFO] hyracks-storage-am-lsm-rtree-test .................. SKIPPED
[INFO] hyracks-storage-am-lsm-invertedindex-test .......... SKIPPED
[INFO] hyracks-storage-am-bloomfilter-test ................ SKIPPED
[INFO] hyracks-server ..................................... SKIPPED
[INFO] hyracks-examples ................................... SKIPPED
[INFO] tpch-example ....................................... SKIPPED
[INFO] tpchclient ......................................... SKIPPED
[INFO] tpchserver ......................................... SKIPPED
[INFO] text-example ....................................... SKIPPED
[INFO] texthelper ......................................... SKIPPED
[INFO] textclient ......................................... SKIPPED
[INFO] hyracks-maven-plugins .............................. SKIPPED
[INFO] Hyracks VirtualCluster Maven Plugin ................ SKIPPED
[INFO] textserver ......................................... SKIPPED
[INFO] btree-example ...................................... SKIPPED
[INFO] btreehelper ........................................ SKIPPED
[INFO] btreeclient ........................................ SKIPPED
[INFO] btreeserver ........................................ SKIPPED
[INFO] hyracks-integration-tests .......................... SKIPPED
[INFO] hyracks-shutdown-test .............................. SKIPPED
[INFO] hyracks-documentation .............................. SKIPPED
[INFO] license-automation-plugin .......................... SKIPPED
[INFO] hyracks-hdfs ....................................... SKIPPED
[INFO] hyracks-hdfs-1.x ................................... SKIPPED
[INFO] hyracks-hdfs-2.x ................................... SKIPPED
[INFO] hyracks-hdfs-core .................................. SKIPPED
[INFO] hyracks-dist ....................................... SKIPPED
[INFO] algebricks ......................................... SKIPPED
[INFO] algebricks-common .................................. SKIPPED
[INFO] algebricks-data .................................... SKIPPED
[INFO] algebricks-runtime ................................. SKIPPED
[INFO] algebricks-core .................................... SKIPPED
[INFO] algebricks-compiler ................................ SKIPPED
[INFO] algebricks-rewriter ................................ SKIPPED
[INFO] algebricks-tests ................................... SKIPPED
[INFO] algebricks-examples ................................ SKIPPED
[INFO] piglet-example ..................................... SKIPPED
[INFO] hyracks-fullstack-license .......................... SKIPPED
[INFO] apache-asterixdb ................................... SKIPPED
[INFO] asterix-common ..................................... SKIPPED
[INFO] asterix-om ......................................... SKIPPED
[INFO] asterix-fuzzyjoin .................................. SKIPPED
[INFO] asterix-maven-plugins .............................. SKIPPED
[INFO] record-manager-generator-maven-plugin .............. SKIPPED
[INFO] asterix-transactions ............................... SKIPPED
[INFO] asterix-runtime .................................... SKIPPED
[INFO] asterix-events ..................................... SKIPPED
[INFO] asterix-active ..................................... SKIPPED
[INFO] asterix-hivecompat ................................. SKIPPED
[INFO] lexer-generator-maven-plugin ....................... SKIPPED
[INFO] asterix-external-data .............................. SKIPPED
[INFO] asterix-metadata ................................... SKIPPED
[INFO] asterix-lang-common ................................ SKIPPED
[INFO] asterix-lang-aql ................................... SKIPPED
[INFO] asterix-lang-sqlpp ................................. SKIPPED
[INFO] asterix-grammar-extension-maven-plugin ............. SKIPPED
[INFO] asterix-evaluator-generator-maven-plugin ........... SKIPPED
[INFO] asterix-algebra .................................... SKIPPED
[INFO] asterix-test-framework ............................. SKIPPED
[INFO] asterix-replication ................................ SKIPPED
[INFO] asterix-test-datagenerator-maven-plugin ............ SKIPPED
[INFO] asterix-app ........................................ SKIPPED
[INFO] asterix-tools ...................................... SKIPPED
[INFO] asterix-examples ................................... SKIPPED
[INFO] asterix-client-helper .............................. SKIPPED
[INFO] asterix-server ..................................... SKIPPED
[INFO] asterix-doc ........................................ SKIPPED
[INFO] asterix-benchmark .................................. SKIPPED
[INFO] asterix-coverage ................................... SKIPPED
[INFO] asterix-license .................................... SKIPPED
[INFO] asterix-installer .................................. SKIPPED
[INFO] asterix-yarn ....................................... SKIPPED
[INFO] asterix-experiments ................................ SKIPPED
[INFO] hyracks-asterix .................................... FAILURE [05:30 min]
[INFO] ------------------------------------------------------------------------
[INFO] BUILD FAILURE
[INFO] ------------------------------------------------------------------------
[INFO] Total time: 05:35 min
[INFO] Finished at: 2017-05-23T20:41:31+00:00
[INFO] Final Memory: 146M/1522M
[INFO] ------------------------------------------------------------------------
[ERROR] Failed to execute goal org.sonarsource.scanner.maven:sonar-maven-plugin:3.3.0.603:sonar
(default-cli) on project apache-asterixdb-fullstack: Can not execute Findbugs: java.lang.StackOverflowError
-> [Help 1]
[ERROR] 
[ERROR] To see the full stack trace of the errors, re-run Maven with the -e switch.
[ERROR] Re-run Maven using the -X switch to enable full debug logging.
[ERROR] 
[ERROR] For more information about the errors and possible solutions, please read the following
articles:
[ERROR] [Help 1] http://cwiki.apache.org/confluence/display/MAVEN/MojoExecutionException
[ERROR] 
[ERROR] After correcting the problems, you can resume the build with the command
[ERROR]   mvn <goals> -rf :apache-asterixdb-fullstack
Build step 'Invoke top-level Maven targets' marked build as failure
Archiving artifacts
Injecting SonarQube environment variables using the configuration: asterix-sonarqube

Mime
View raw message